https://arche.acdh.oeaw.ac.at/api/3013
type: Place
acl read: public
created by: admin
has alternative title: Republik Österreich
has alternative title: Republic of Austria @en
has available date: 2019-10-18T12:02:53.124Z
has binary updated role: admin
has identifier: place-austria
has identifier: https://sws.geonames.org/2782113/
has latitude: 47.33333
has longitude: 13.33333
has non linked identifier: Legalkraus-Id: pmb41240
has title: Österreich
has title: Austria @en
has updated date: 2025-03-03T18:45:46.083450
has updated role: sstuhec
has WKT: POINT(13.33333 47.33333)

https://arche.acdh.oeaw.ac.at/api/3313
type: Organisation
acl read: public
created by: admin
has address line1: Bäckerstraße 13
has address line2: c/o ACDH
has alternative title: A Resource Centre for the HumanitiEs @en
has available date: 2018-08-07T10:02:06.534Z
has binary updated role: admin
has city: Wien
has city: Vienna @en
has country: Österreich
has country: Austria @en
has identifier: arche
has postcode: 1010
has region: Wien
has region: Vienna @en
has title: ARCHE @en
has updated date: 2025-11-19T10:25:07.394857
has updated role: init
has url: https://arche.acdh.oeaw.ac.at/browser/
is member of: https://arche.acdh.oeaw.ac.at/api/48505

https://arche.acdh.oeaw.ac.at/api/10238
type: Person
acl read: public
created by: admin
has available date: 2018-12-14T10:44:01.644Z
has binary updated role: admin
has first name: Christian @und
has identifier: http://viaf.org/viaf/89693947
has identifier: cgugl
has identifier: 0000-0001-6607-959X
has last name: Gugl @und
has personal title: PD Dr. MA MSc-GIS
has title: Christian Gugl @und
has updated date: 2025-03-03T18:45:28.637495
has updated role: sstuhec
is member of: https://arche.acdh.oeaw.ac.at/api/37483

https://arche.acdh.oeaw.ac.at/api/21003
type: Organisation
acl read: public
created by: admin
has address line1: Dr. Ignaz Seipel-Platz 2
has alternative title: ÖAW
has available date: 2018-08-07T10:02:06.534Z
has binary updated role: admin
has city: Wien
has city: Vienna @en
has country: Österreich
has country: Austria @en
has identifier: http://viaf.org/viaf/141312644
has identifier: http://viaf.org/viaf/141440509
has identifier: Q299015
has identifier: https://d-nb.info/gnd/1001454-8
has identifier: 108595336X
has identifier: https://d-nb.info/gnd/1090414722
has identifier: https://d-nb.info/gnd/4079277-8
has identifier: oeaw
has identifier: 03anc3s24
has postcode: 1010
has region: Wien
has region: Vienna @en
has title: Österreichische Akademie der Wissenschaften
has title: Austrian Academy of Sciences @en
has updated date: 2025-11-19T10:25:06.557997
has updated role: init
has url: https://www.oeaw.ac.at

https://arche.acdh.oeaw.ac.at/api/37483
type: Organisation
acl read: public
created by: admin
has address line1: Dominikanerbastei 16
has alternative title: ÖAI
has alternative title: OeAI @en
has available date: 2018-08-07T10:02:06.534Z
has binary updated role: admin
has city: Wien
has city: Vienna @en
has country: Österreich
has country: Austria @en
has identifier: n50059613
has identifier: http://viaf.org/viaf/125130162
has identifier: Q306557
has identifier: https://d-nb.info/gnd/1088970192
has identifier: https://d-nb.info/gnd/35371-1
has identifier: https://d-nb.info/gnd/4516056-9
has identifier: oeai
has identifier: https://isni.org/isni/0000000121514674
has identifier: 02gqw3a90
has postcode: 1010
has region: Wien
has region: Vienna @en
has title: Österreichisches Archäologisches Institut | Österreichische Akademie der Wissenschaften
has title: Austrian Archaeological Institute | Austrian Academy of Sciences @en
has updated date: 2025-11-19T10:25:07.397250
has updated role: init
has url: https://www.oeaw.ac.at/oeai
is member of: https://arche.acdh.oeaw.ac.at/api/21003

öffentlich
source: CLARIN
type: Concept
definition: Öffentliche Ressourcen sind ohne Einschränkungen zugänglich.
definition: Public resources are accessible without any further restrictions. @en
in scheme: https://arche.acdh.oeaw.ac.at/api/67340
preferred label: public @en
top concept of: https://arche.acdh.oeaw.ac.at/api/67340
acl read: public
created by: init
has available date: 2020-07-31T12:16:21.054791
has identifier: public
has title: öffentlich
has title: public @en
has updated date: 2023-02-16T11:35:25.478661
has updated role: init
is part of: https://arche.acdh.oeaw.ac.at/api/67340

Archäologie
type: Concept
broader: https://arche.acdh.oeaw.ac.at/api/50071
in scheme: https://arche.acdh.oeaw.ac.at/api/67346
notation: 601003
preferred label: Archaeology @en
acl read: public
created by: init
has available date: 2020-09-22T06:26:31.372546
has identifier: https://vocabs.acdh.oeaw.ac.at/oefosdisciplines/601003
has title: Archäologie
has title: Archaeology @en
has updated date: 2024-01-18T13:37:13.313946
has updated role: init
is part of: https://arche.acdh.oeaw.ac.at/api/67346

aktiv
type: Concept
definition: Aktiv zeigt an, dass an dem Objekt noch aktiv gearbeitet wird.
definition: Active indicates an actively worked on object. @en
in scheme: https://arche.acdh.oeaw.ac.at/api/67342
preferred label: active @en
top concept of: https://arche.acdh.oeaw.ac.at/api/67342
acl read: public
created by: init
has available date: 2020-07-31T12:16:33.357145
has identifier: active
has title: aktiv
has title: active @en
has updated date: 2023-02-16T11:35:42.004296
has updated role: init
is part of: https://arche.acdh.oeaw.ac.at/api/67342

Deutsch
type: Concept
in scheme: https://arche.acdh.oeaw.ac.at/api/67345
preferred label: German @en
preferred label: allemand @fr
top concept of: https://arche.acdh.oeaw.ac.at/api/67345
acl read: public
created by: init
has available date: 2020-07-31T13:58:39.428401
has identifier: de
has identifier: deu
has title: Deutsch
has title: German @en
has title: allemand @fr
has updated date: 2023-02-16T17:46:19.419749
has updated role: init
is part of: https://arche.acdh.oeaw.ac.at/api/67345

CC BY 4.0
created: 2020-02-29T15:06:19.522758+00:00
modified: 2024-04-15T10:08:53.318304+00:00
type: Concept
alternative label: Namensnennung 4.0 International (CC BY 4.0)
alternative label: Attribution 4.0 International (CC BY 4.0) @en
definition: This license lets others distribute, remix, tweak, and build upon your work, even commercially, as long as they credit you for the original creation. This is the most accommodating of licenses offered. Recommended for maximum dissemination and use of licensed materials. @en
in scheme: https://arche.acdh.oeaw.ac.at/api/67343
top concept of: https://arche.acdh.oeaw.ac.at/api/67343
acl read: public
created by: init
has available date: 2020-09-30T11:06:20.479556
has identifier: https://creativecommons.org/licenses/by/4.0/
has identifier: cc-by-4-0
has title: CC BY 4.0
has updated date: 2024-04-24T06:22:28.946001
has updated role: init
is part of: https://arche.acdh.oeaw.ac.at/api/67343

Datensammlung
type: Concept
definition: Eine Sammlung von Ressourcen unterschiedlicher Typen. Wenn die Sammlung aus Ressourcen eines einzigen Typs besteht, sollte dieser Ressourcentyp verwendet werden.
definition: An aggregation of resources of various types. If a collection consists of a single type, use the single type to describe it. @en
in scheme: https://arche.acdh.oeaw.ac.at/api/67344
narrower: https://arche.acdh.oeaw.ac.at/api/139811
preferred label: Collection @en
top concept of: https://arche.acdh.oeaw.ac.at/api/67344
created by: init
has available date: 2021-07-26T17:56:35.279203
has identifier: collection
has title: Datensammlung
has title: Collection @en
has updated date: 2022-08-18T10:23:07.713742
has updated role: zozlak
is part of: https://arche.acdh.oeaw.ac.at/api/67344

ARIADNE
creator: Martina Trognitz
created: 2020-02-06T13:58:40.992257+00:00
modified: 2020-02-07T10:55:59.502484+00:00
type: Concept
definition: Kennzeichnet jene Sammlungen und Ressourchen in ARCHE, die durch ARIADNEplus (https://ariadne-infrastructure.eu) aggregiert werden sollen. Kriterien für die Aufnahme: Bezug zur Archäologie, z.B. hasRelatedDiscipline ist 6010 oder eine der Subkategorien in ÖFOS 2012 (https://vocabs.acdh.oeaw.ac.at/oefosdisciplines/6010).
definition: Denotes any Collections or Resources in ARCHE that should be harvested by ARIADNEplus (https://ariadne-infrastructure.eu). Criteria for inclusion: relation to archaeology, e.g. hasRelatedDiscipline is 6010 or one of subcategories in ÖFOS 2012 (https://vocabs.acdh.oeaw.ac.at/oefosdisciplines/6010). @en
in scheme: https://arche.acdh.oeaw.ac.at/api/67341
notation: ariadne
top concept of: https://arche.acdh.oeaw.ac.at/api/67341
created by: init
has available date: 2022-05-20T05:59:47.962627
has identifier: ariadne
has title: ARIADNE @und
has updated date: 2023-02-16T17:46:40.104565
has updated role: init
is part of: https://arche.acdh.oeaw.ac.at/api/67341

Archäologische Prospektion
type: Concept
broader: https://arche.acdh.oeaw.ac.at/api/50071
in scheme: https://arche.acdh.oeaw.ac.at/api/67346
notation: 601024
preferred label: Archaeological prospection @en
acl read: public
created by: init
has available date: 2020-09-22T06:26:16.367067
has identifier: https://vocabs.acdh.oeaw.ac.at/oefosdisciplines/601024
has title: Archäologische Prospektion
has title: Archaeological prospection @en
has updated date: 2024-01-18T13:37:15.871180
has updated role: init
is part of: https://arche.acdh.oeaw.ac.at/api/67346

https://arche.acdh.oeaw.ac.at/api/66763
type: Person
acl read: public
acl read: sstuhec
acl write: sstuhec
created by: sstuhec
has address line1: Bäckerstraße 13
has address line2: c/o ACDH
has available date: 2020-07-02T09:35:15.068401
has city: Wien
has city: Vienna @en
has country: Österreich
has country: Austria @en
has first name: Seta @und
has identifier: sstuhec
has identifier: https://orcid.org/0000-0002-1218-9635
has last name: Štuhec @und
has personal title: Dr.
has postcode: 1010
has region: Wien
has region: Vienna @en
has title: Seta Štuhec @und
has updated date: 2025-11-19T10:25:09.494529
has updated role: init
has url: https://www.oeaw.ac.at/acdh/institute/team/staff-members/seta-stuhec
is member of: https://arche.acdh.oeaw.ac.at/api/48505

https://arche.acdh.oeaw.ac.at/api/75209
type: Organisation
acl read: public
acl read: sstuhec
acl write: sstuhec
created by: sstuhec
has address line1: Sensengasse 1
has address line2: c/o FWF
has alternative title: Austrian Science Fund @en
has available date: 2020-10-29T10:25:24.726452
has city: Wien
has city: Vienna @en
has country: Österreich
has country: Austria @en
has identifier: http://viaf.org/viaf/154268016
has identifier: org-fwf
has postcode: 1090
has region: Wien
has region: Vienna @en
has title: FWF Der Wissenschaftsfonds
has title: FWF Austrian Science Fund @en
has title: FWF @und
has updated date: 2025-01-13T12:33:12.700361
has updated role: pandorfer
has url: https://www.fwf.ac.at

https://arche.acdh.oeaw.ac.at/api/138004
type: Place
acl read: pandorfer
acl write: pandorfer
created by: pandorfer
has available date: 2021-07-26T10:31:16.325979
has identifier: https://sws.geonames.org/2770542/
has latitude: 48.33333
has longitude: 15.75
has non linked identifier: Legalkraus-Id: pmb1003
has title: Niederösterreich
has title: Lower Austria @en
has updated date: 2025-01-18T22:11:00.523528
has updated role: rmandell
has WKT: POINT(15.75 48.33333)

OpenAIRE
creator: Mateusz Żółtak
created: 2022-05-19T10:55:59.502484+00:00
modified: 2022-05-19T10:55:59.502484+00:00
type: Concept
definition: Denotes any Collections or Resources in ARCHE that should be harvested by the OpenAIRE (https://www.openaire.eu/). Criteria for inclusion: all top collections. @en
in scheme: https://arche.acdh.oeaw.ac.at/api/67341
notation: openaire_data
top concept of: https://arche.acdh.oeaw.ac.at/api/67341
created by: init
has available date: 2022-05-20T05:59:48.542914
has identifier: openaire data
has title: OpenAIRE @und
has updated date: 2023-02-16T17:46:40.073303
has updated role: init
is part of: https://arche.acdh.oeaw.ac.at/api/67341

https://arche.acdh.oeaw.ac.at/api/255830
type: Person
acl read: sstuhec
acl write: sstuhec
created by: sstuhec
has available date: 2022-11-29T11:30:34.760964
has first name: Mario @und
has identifier: mwallner
has identifier: https://orcid.org/0000-0001-7006-8367
has last name: Wallner @und
has personal title: Mag.
has title: Mario Wallner @und
has updated date: 2023-03-28T09:17:48.021732
has updated role: sstuhec
has url: https://archpro.lbg.ac.at/team/archaeological-geophysical-prospection/mario-wallner
is member of: https://arche.acdh.oeaw.ac.at/api/255675

https://arche.acdh.oeaw.ac.at/api/504712
type: Person
acl read: sstuhec
acl write: sstuhec
created by: sstuhec
has available date: 2023-03-28T09:17:47.438579
has first name: Christopher @und
has identifier: cvadeanu
has identifier: https://orcid.org/0000-0003-3778-0066
has last name: Vadeanu @und
has title: Christopher Vadeanu @und
has updated date: 2023-03-28T09:17:47.438579
has updated role: sstuhec
is member of: https://arche.acdh.oeaw.ac.at/api/37483

https://arche.acdh.oeaw.ac.at/api/504765
type: Organisation
acl read: sstuhec
acl write: sstuhec
created by: sstuhec
has address line1: Nußdorfer Straße 64
has address line2: 6. Stock
has available date: 2023-03-28T09:17:51.614239
has city: Wien
has city: Vienna @en
has country: Österreich
has country: Austria @en
has identifier: no2006091207
has identifier: Q1874246
has identifier: https://d-nb.info/gnd/1024204324
has identifier: https://d-nb.info/gnd/1090617771
has identifier: lbg
has identifier: https://isni.org/isni/0000000108606806
has postcode: 1090
has region: Wien
has region: Vienna @en
has title: Ludwig Boltzmann Gesellschaft
has updated date: 2023-03-28T09:17:51.614239
has updated role: sstuhec
has url: https://lbg.ac.at

https://arche.acdh.oeaw.ac.at/api/504767
type: Organisation
acl read: sstuhec
acl write: sstuhec
created by: sstuhec
has alternative title: Amt der NÖ Landesregierung
has available date: 2023-03-28T09:17:51.641225
has identifier: land-niederoesterreich
has title: Land Niederösterreich
has updated date: 2023-03-28T09:17:51.641225
has updated role: sstuhec
has url: https://www.noe.gv.at/noe/index.html

https://arche.acdh.oeaw.ac.at/api/504771
type: Place
acl read: sstuhec
acl write: sstuhec
created by: sstuhec
has available date: 2023-03-28T09:17:52.504000
has identifier: place-petronell-carnuntum
has identifier: https://sws.geonames.org/8224652/
has latitude: 48.11317
has longitude: 16.86146
has title: Petronell-Carnuntum @und
has updated date: 2023-03-28T09:17:52.504000
has updated role: sstuhec
has WKT: POINT(16.86146 48.11317)

https://arche.acdh.oeaw.ac.at/api/504773
type: Place
acl read: sstuhec
acl write: sstuhec
created by: sstuhec
has available date: 2023-03-28T09:17:52.521857
has identifier: place-bad-deutsch-altenburg
has identifier: https://sws.geonames.org/2782068/
has latitude: 48.13425
has longitude: 16.90624
has title: Bad Deutsch-Altenburg @und
has updated date: 2023-03-28T09:17:52.521857
has updated role: sstuhec
has WKT: POINT(16.90624 48.13425)

https://arche.acdh.oeaw.ac.at/api/504774
type: TopCollection
created by: sstuhec
has access restriction summary: öffentlich: 6392 / eingeschränkt: 29
has access restriction summary: public: 6392 / restricted: 29 @en
has applied method: Ausgrabung
has applied method: Feldbegehung
has applied method: Luftbilderkundung
has applied method: Statistik
has applied method: geophysikalische Untersuchung
has applied method: aerial photography @en
has applied method: excavation @en
has applied method: field walking @en
has applied method: geophysical survey @en
has applied method: statistics @en
has applied method: GIS @und
has available date: 2023-03-28T09:17:54.452262
has binary size: 50961960329
has collected end date: 2021-01-01
has collected start date: 1968-01-01
has completeness: Diese Datensammlung ist aktiv. In Zukunft werden weitere Daten aus verschiedenen Projekten, die in Carnuntum, Österreich durchgeführt wurden, zur Verfügung gestellt. Neue Daten werden innerhalb der oberen Ordnerstruktur der Sammlung hinzugefügt.
has completeness: This collection is active. In the future more data from different projects conducted in Carnuntum, Austria will be made available. New data will be added within the upper folder sturcture of the collection. @en
has contact: https://arche.acdh.oeaw.ac.at/api/37483
has coverage end date: 1700-01-01
has coverage start date: 0050-01-01
has created end date: 2021-01-01
has created start date: 2004-01-01
has curator: https://arche.acdh.oeaw.ac.at/api/66763
has custom citation: editor = {Gugl, Christian and Vadeanu, Christopher}
has depositor: https://arche.acdh.oeaw.ac.at/api/10238
has description: Daten zu Publikations- und Feldprojekten in Carnuntum – Forschungen der Jahre 2004 bis 2021. Die Datensammlung umfasst Materialien zu sechs siedlungsarchäologischen Projekten in Carnuntum, die zwischen 2004 und 2021 durchgeführt wurden: * GIS-analytische Untersuchungen zur römischen Landvermessung im Raum Carnuntum. * Finale Auswertung der Grabungen 1968–1977 im Legionslager Carnuntum. * Luftbildarchäologische Studien zur Lagervorstadt (canabae legionis) in Carnuntum. * Geophysikalische Messungen und deren archäologische Interpretation in Carnuntum. * Systematische Feldbegehungen (Rastersurvey) im Bereich der canabae legionis. * siedlungsarchäologische Forschungen im Bereich der Vorstädte der Carnuntiner Zivilstadt. 2005_Limitatio-Carnuntina: Eine der Grundvoraussetzungen für die Organisation und Nutzung des städtisches Umlandes war in der Antike – wie heute auch – die systematische Landvermessung, Kartierung und Aufzeichnung der Grundbesitzverhältnisse. Die Relikte der römischen Landvermessung (Limitation, Zenturiation) haben sich im heutigen Landschaftsbild insbesondere in den Anrainerstaaten des Mittelmeerraumes erstaunlich gut erhalten, sodass vielerorts eine Rekonstruktion der römischen Limitation anhand der heutigen Flurgrenzen ermöglicht wurde. 1976/1977 erkannte Manfred Kandler im Umland des Legionslagers und der römischen Stadt Carnuntum (Niederösterreich), dass die Längsachse des ältesten Legionslagers mit einem Großteil der Parzellengrenzen in der Gemeinde Bad Deutsch-Altenburg fluchtet. Den Zusammenhang zwischen der Orientierung der aktuellen Flurgrenzen und der Ausrichtung des Lagers führte Kandler auf die römische Limitation des Gebiets zurück. Das Hauptziel der vorliegenden Studie bestand darin, diese Zusammenhängen auf die Hypothesen Kandlers bezug nehmend zu überprüfen. Voraussetzung dafür war die Definition der antiken Straßen- und Vermessungsachsen, wobei wegen Problemen der Lagegenauigkeit weniger auf die Ergebnisse der (Alt-)Grabungen als auf Fe…
has description: Data on publication and field projects in Carnuntum - research from 2004 to 2021. The data collection includes materials on six archaeological research projects in Carnuntum that were carried out between 2004 and 2021: * GIS-analytical research on Roman land surveying in the Carnuntum area. * Final evaluation of the excavations 1968-1977 in the Carnuntum legionary camp. * Aerial archaeological studies of the camp suburb (canabae legionis) in Carnuntum. * Geophysical measurements and their archaeological interpretation in Carnuntum. * Systematic field surveys (grid survey) in the area of the canabae legionis. * Archaeological research in the area of the suburbs of the Carnuntum civil city. 2005_Limitatio-Carnuntina: One of the basic prerequisites for the organisation and use of the urban hinterland in antiquity - as today - was the systematic surveying, mapping and recording of land ownership. The relics of Roman land surveying (limitation, centuriation) have been amazingly well preserved in today`s landscape, especially in the countries bordering the Mediterranean, so that in many places it has been possible to reconstruct Roman limitation on the basis of today`s land boundaries. In 1976/1977, Manfred Kandler recognised in the surrounding area of the legionary camp and the Roman town of Carnuntum (Lower Austria) that the longitudinal axis of the oldest legionary camp is aligned with a large part of the parcel boundaries in the municipality of Bad Deutsch-Altenburg. Kandler attributed the connection between the orientation of the current parcel boundaries and the orientation of the camp to the Roman limitation of the area. The main aim of the present study was to verify these connections with reference to Kandler`s hypotheses. A prerequisite for this was the definition of the ancient road and survey axes, whereby, due to problems of positional accuracy, less reliance was placed on the results of the (old) excavations than on remote sensing data (colour and B/W orthop… @en
has editor: https://arche.acdh.oeaw.ac.at/api/10238
has editor: https://arche.acdh.oeaw.ac.at/api/504712
has funder: https://arche.acdh.oeaw.ac.at/api/504767
has funder: https://arche.acdh.oeaw.ac.at/api/75209
has hosting: https://arche.acdh.oeaw.ac.at/api/3313
has identifier: https://hdl.handle.net/21.11115/0000-000F-9C36-5
has identifier: carnuntumarchiv
has language: Deutsch
has license summary: CC BY 4.0: 6392 / InC: 29
has licensor: https://arche.acdh.oeaw.ac.at/api/37483
has life cycle status: aktiv
has metadata creator: https://arche.acdh.oeaw.ac.at/api/10238
has metadata creator: https://arche.acdh.oeaw.ac.at/api/504712
has naming scheme: Für die Ablage der Daten wurde in der obersten Ordnungsebene die derzeit gültige Ordnerstruktur des Österreichischen Archäologischen Instituts (ÖAI) verwendet. Diese umfasst mit Stand 2022 in der obersten Hierarchieebene 33 Ordner. Die vorliegende Datensammlung umfasst Materialien zu fünf Top-level-Ordnern der ÖAI-Ordnerstruktur: * 02_Artefaktstudien_Fundverwaltung * 03_GIS * 05_Survey_Prospektion * 12_Fotodokumentation * 95_Publikationen
has naming scheme: The collection is arranged according to currently valid folder structure of the Austrian Archaeological Institute (ÖAI). As of 2022 the structure includes 33 top level folders. The present collection includes data on five of these top-level folders: * 02_ArtefactStudies_FindsManagement * 03_GIS * 05_Survey_Prospection * 12_PhotoDocumentation * 95_Publications @en
has non linked identifier: Project Am Westrand von Carnuntum – Oberflächensurvey auf der Gstettenbreite: ProjectNr. K1-WF-1150/002-2017
has non linked identifier: Project Die Canabae legionis von Carnuntum II: ProjectNr. PUB 204 Buchpublikation
has non linked identifier: Project Die westliche und die östliche Vorstadt des antiken Carnuntum: Untersuchungen zur Infrastruktur und zur chronologischen Entwicklung ausgewählter Vorstadtzonen”, ProjectNr. K1-WF-1150/003-2018
has non linked identifier: Project The canabae legionis of Carnuntum - a case study: ProjectNr. PUB 8 Buchpublikation
has non linked identifier: Project The legionary fortress of Carnuntum - excavations 1968 – 1977: Project Nr. D 3896
has number of items: 6564
has oai set: OpenAIRE
has oai set: ARIADNE
has owner: https://arche.acdh.oeaw.ac.at/api/37483
has pid: https://hdl.handle.net/21.11115/0000-000F-9C36-5
has principal investigator: https://arche.acdh.oeaw.ac.at/api/10238
has related discipline: Archäologie
has related discipline: Archäologische Prospektion
has rights holder: https://arche.acdh.oeaw.ac.at/api/21003
has rights holder: https://arche.acdh.oeaw.ac.at/api/504765
has rights holder: https://arche.acdh.oeaw.ac.at/api/504767
has spatial coverage: https://arche.acdh.oeaw.ac.at/api/138004
has spatial coverage: https://arche.acdh.oeaw.ac.at/api/3013
has spatial coverage: https://arche.acdh.oeaw.ac.at/api/504771
has spatial coverage: https://arche.acdh.oeaw.ac.at/api/504773
has subject: Siedlungsarchäologie
has subject: römische Funde
has subject: römische Keramik
has subject: Fieldwork archive @en
has subject: Roman finds @en
has subject: Roman pottery @en
has subject: settlement archaeology @en
has temporal coverage: Frühe Neuzeit
has temporal coverage: Mittelalter
has temporal coverage: Römische Kaiserzeit
has temporal coverage: Early modern @en
has temporal coverage: Middle Ages @en
has temporal coverage: Roman Empire @en
has temporal coverage identifier: http://chronontology.dainst.org/period/bCTpXj4LVC2n

https://arche.acdh.oeaw.ac.at/api/504802
type: Resource
acl read: public
created by: sstuhec
has access restriction: öffentlich
has alternative title: Befunde der Schedivy-Grabungen (1976) in der Carnuntiner Zivilstadt
has alternative title: Finds and features of the Schedivy excavations (1976) in the Carnuntum civil town @en
has available date: 2023-03-28T09:28:00.374903
has binary size: 120788071
has binary updated date: 2023-03-30T07:37:48.654468
has binary updated role: sstuhec
has category: Datensammlung
has coverage end date: 1700-01-01
has coverage start date: 0050-01-01
has created end date: 2021-01-01
has created start date: 2017-01-01
has creator: https://arche.acdh.oeaw.ac.at/api/10238
has creator: https://arche.acdh.oeaw.ac.at/api/255830
has creator: https://arche.acdh.oeaw.ac.at/api/504712
has curator: https://arche.acdh.oeaw.ac.at/api/66763
has custom citation: author = {Gugl, Christian and Vadeanu, Christopher and Wallner, Mario}
has depositor: https://arche.acdh.oeaw.ac.at/api/10238
has description: Georeferenzierte Pläne der Grabungen 1976 in der Carnuntiner Zivilstadt (2. Fassungen): Fassung 1 (Detailpläne 1976 nach dem Gesamtplan 1986 georeferenziert), Fassung 2 (Detailpläne nach den Radarbildern 2012-2015 georeferenziert). Die Vorlagen lagern im Archiv des ÖAI. Publiziert in: E. Schedivy, Notgrabung im Tiergarten des Schlosses Petronell, Carnuntum Jahrbuch 1985, 1986, 60–101.
has description: Georeferenced plans of the 1976 excavations in the Carnuntum civil town (2 versions): Version 1 (detailed plans 1976 georeferenced according to the 1986 general plan), Version 2 (detailed plans georeferenced according to the 2012-2015 radar images). The scan templates are stored in the archives of the ÖAI. Published in: E. Schedivy, Notgrabung im Tiergarten des Schlosses Petronell, Carnuntum Jahrbuch 1985, 1986, 60–101. @en
has digitising agent: https://arche.acdh.oeaw.ac.at/api/10238
has extent: Die Zip-Datei enthält ein BagIt mit 3 Datenordnern: Vektor, Raster und Attribute. Zusätzlich sind auch qgis-Projekte enthalten. Der Ordner 03_GIS/2021_Zivilstadt/02_Raster/01_Schedivy1976 enthält nicht nur die georefernzierten GEOTIFF-Dateien (*_modified.tif), sondern auch Informationen zur Georeferenzierung: *_modified_PNG.tif – Screenshot des Georeferenzierungsmoduls in QGIS mit Angabe der Transformation (Helmert), des RMS-Fehlers, etc. *_modifiedtif.points – Passpunkte.
has extent: The zip file contains a bagIt with 3 data folders: Vector, Raster and Attributes. Additionally qgis projects are also included. The folder 03_GIS/2021_Civil_City/02_Raster/01_Schedivy1976 contains not only the georeferenced GEOTIFF files (*_modified.tif), but also georeferencing information: *_modified_PNG.tif - screenshot of the georeferencing module in QGIS with indication of transformation (Helmert), RMS error, etc. *_modifiedtif.points - control points. @en
has filename: 2021_Zivilstadt.zip
has format: application/zip
has hosting: https://arche.acdh.oeaw.ac.at/api/3313
has identifier: https://hdl.handle.net/21.11115/0000-000F-B5D2-7
has identifier: 2021 Zivilstadt.zip
has license: CC BY 4.0
has licensor: https://arche.acdh.oeaw.ac.at/api/37483
has metadata creator: https://arche.acdh.oeaw.ac.at/api/10238
has metadata creator: https://arche.acdh.oeaw.ac.at/api/504712
has owner: https://arche.acdh.oeaw.ac.at/api/37483
has pid: https://hdl.handle.net/21.11115/0000-000F-B5D2-7
has principal investigator: https://arche.acdh.oeaw.ac.at/api/10238
has principal investigator: https://arche.acdh.oeaw.ac.at/api/255830
has raw binary size: 120788071
has rights holder: https://arche.acdh.oeaw.ac.at/api/21003
has spatial coverage: https://arche.acdh.oeaw.ac.at/api/138004
has spatial coverage: https://arche.acdh.oeaw.ac.at/api/3013
has spatial coverage: https://arche.acdh.oeaw.ac.at/api/504771
has spatial coverage: https://arche.acdh.oeaw.ac.at/api/504773
has temporal coverage: Frühe Neuzeit
has temporal coverage: Mittelalter
has temporal coverage: Römische Kaiserzeit
has temporal coverage identifier: http://n2t.net/ark:/99152/p0jrrjbvfhm
has temporal coverage identifier: http://n2t.net/ark:/99152/p0qhb66433w
has temporal coverage identifier: http://n2t.net/ark:/99152/p0qhb668mm5
has title: 2021_Zivilstadt.zip
has updated date: 2023-03-30T07:37:48.921981
has updated role: sstuhec
has used software: Esri ArcGIS
has used software: QGIS
is part of: https://arche.acdh.oeaw.ac.at/api/504806

https://arche.acdh.oeaw.ac.at/api/504806
type: Collection
acl read: sstuhec
acl write: sstuhec
created by: sstuhec
has access restriction summary: öffentlich: 2 / eingeschränkt: 1
has access restriction summary: public: 2 / restricted: 1 @en
has alternative title: GIS-Daten Carnuntum
has alternative title: GIS Data Carnuntum @en
has available date: 2023-03-28T09:17:54.315882
has binary size: 34382056927
has contact: https://arche.acdh.oeaw.ac.at/api/37483
has coverage end date: 1700-01-01
has coverage start date: 0050-01-01
has created end date: 2004-01-01
has created start date: 2004-01-01
has creator: https://arche.acdh.oeaw.ac.at/api/10238
has creator: https://arche.acdh.oeaw.ac.at/api/255830
has curator: https://arche.acdh.oeaw.ac.at/api/66763
has depositor: https://arche.acdh.oeaw.ac.at/api/10238
has description: Raumbezogene Daten aus Prospektions- und Grabungsprojekten in Carnuntum.
has description: Spatial data from prospection and excavation projects in Carnuntum. @en
has filename: 03_GIS
has hosting: https://arche.acdh.oeaw.ac.at/api/3313
has identifier: https://hdl.handle.net/21.11115/0000-000F-9C32-9
has identifier: 03 GIS
has license summary: CC BY 4.0: 2 / InC: 1
has licensor: https://arche.acdh.oeaw.ac.at/api/37483
has life cycle status: aktiv
has metadata creator: https://arche.acdh.oeaw.ac.at/api/10238
has metadata creator: https://arche.acdh.oeaw.ac.at/api/504712
has number of items: 3
has owner: https://arche.acdh.oeaw.ac.at/api/37483
has pid: https://hdl.handle.net/21.11115/0000-000F-9C32-9
has principal investigator: https://arche.acdh.oeaw.ac.at/api/10238
has related discipline: Archäologie
has related discipline: Archäologische Prospektion
has rights holder: https://arche.acdh.oeaw.ac.at/api/21003
has spatial coverage: https://arche.acdh.oeaw.ac.at/api/138004
has spatial coverage: https://arche.acdh.oeaw.ac.at/api/3013
has spatial coverage: https://arche.acdh.oeaw.ac.at/api/504771
has spatial coverage: https://arche.acdh.oeaw.ac.at/api/504773
has subject: Siedlungsarchäologie
has subject: settlement archaeology @en
has temporal coverage: Frühe Neuzeit
has temporal coverage: Mittelalter
has temporal coverage: Römische Kaiserzeit
has temporal coverage identifier: http://n2t.net/ark:/99152/p0jrrjbvfhm
has temporal coverage identifier: http://n2t.net/ark:/99152/p0qhb66433w
has temporal coverage identifier: http://n2t.net/ark:/99152/p0qhb668mm5
has title: 03_GIS @und
has updated date: 2023-03-30T14:28:42.044942
has updated role: sstuhec
has used software: Esri ArcGIS
has used software: Global Mapper
has used software: QGIS
is part of: https://arche.acdh.oeaw.ac.at/api/504774