https://arche.acdh.oeaw.ac.at/api/342
type: Resource
acl read: public
created by: admin
has access restriction: public
has applied method: photography @und
has author: https://arche.acdh.oeaw.ac.at/api/35998
has available date: 2018-09-03T14:24:27
has binary size: 7942978
has binary updated date: 2024-10-19 18:30:17
has binary updated role: zozlak
has category: Image
has curator: https://arche.acdh.oeaw.ac.at/api/39799
has depositor: https://arche.acdh.oeaw.ac.at/api/39799
has digitising agent: https://arche.acdh.oeaw.ac.at/api/23885
has extent: 16795096
has filename: Baedeker-Indien_a0001.tiff
has format: image/tiff
has hosting: https://arche.acdh.oeaw.ac.at/api/3313
has identifier: https://hdl.handle.net/21.11115/0000-000C-3276-7
has license: CC0 1.0
has licensor: https://arche.acdh.oeaw.ac.at/api/48505
has metadata creator: https://arche.acdh.oeaw.ac.at/api/39799
has next item: https://arche.acdh.oeaw.ac.at/api/32133
has owner: https://arche.acdh.oeaw.ac.at/api/48505
has pid: https://hdl.handle.net/21.11115/0000-000C-3276-7
has pixel height: 2792
has pixel width: 2004
has raw binary size: 7942978
has rights holder: https://arche.acdh.oeaw.ac.at/api/67349
has spatial coverage: https://arche.acdh.oeaw.ac.at/api/25486
has technical info: color photographs: 180 dpi
has title: Baedeker-Indien_a0001.tiff
has updated date: 2024-10-29T15:39:51.738944
has updated role: zozlak
has used hardware: Canon EOS D60
is part of: https://arche.acdh.oeaw.ac.at/api/34665
is title image of: https://arche.acdh.oeaw.ac.at/api/34665

https://arche.acdh.oeaw.ac.at/api/510
type: Resource
acl read: public
created by: admin
has access restriction: public
has applied method: scanning @und
has author: https://arche.acdh.oeaw.ac.at/api/35998
has available date: 2018-09-03T14:26:10
has binary size: 62749
has binary updated date: 2019-12-13T15:57:56.578Z
has binary updated role: admin
has category: Image
has curator: https://arche.acdh.oeaw.ac.at/api/39799
has depositor: https://arche.acdh.oeaw.ac.at/api/39799
has digitising agent: https://arche.acdh.oeaw.ac.at/api/39799
has extent: 62749
has filename: Baedeker-Indien_i0053.tiff
has format: image/tiff
has hosting: https://arche.acdh.oeaw.ac.at/api/3313
has identifier: https://hdl.handle.net/21.11115/0000-000C-32AE-8
has license: CC0 1.0
has licensor: https://arche.acdh.oeaw.ac.at/api/48505
has metadata creator: https://arche.acdh.oeaw.ac.at/api/39799
has next item: https://arche.acdh.oeaw.ac.at/api/27082
has owner: https://arche.acdh.oeaw.ac.at/api/48505
has pid: https://hdl.handle.net/21.11115/0000-000C-32AE-8
has pixel height: 2581
has pixel width: 1687
has raw binary size: 62749
has rights holder: https://arche.acdh.oeaw.ac.at/api/67349
has spatial coverage: https://arche.acdh.oeaw.ac.at/api/25486
has technical info: b/w scans: 400 dpi; greyscale scans: 400 dpi
has title: Baedeker-Indien_i0053.tiff
has updated date: 2021-07-15T10:16:52.096784
has updated role: uczeitschner
has used hardware: Zeutschel-OMNISCAN-7000 book scanner
is part of: https://arche.acdh.oeaw.ac.at/api/34665

https://arche.acdh.oeaw.ac.at/api/862
type: Place
acl read: public
created by: admin
has available date: 2018-09-03T10:18:53.705Z
has binary updated role: admin
has identifier: place-northamerica
has identifier: https://sws.geonames.org/6255149/
has latitude: 46.07323
has longitude: -100.54688
has non linked identifier: Legalkraus-Id: pmb175
has title: Nordamerika @de
has title: North America
has title: Amerika @und
has updated date: 2024-09-20T08:30:22.258302
has updated role: pandorfer
has WKT: POINT(-100.54688 46.07323)

https://arche.acdh.oeaw.ac.at/api/2732
type: Resource
acl read: public
created by: admin
has access restriction: public
has actor: https://arche.acdh.oeaw.ac.at/api/35998
has applied method: OCR @und
has applied method: XML/TEI structural and semantic annotation @und
has applied method: lemmatization @und
has applied method: part-of-speech-tagging @und
has applied method: tokenization @und
has available date: 2018-09-03T15:17:59
has binary size: 19200711
has binary updated date: 2020-02-13T17:41:02.237Z
has binary updated role: admin
has category: https://arche.acdh.oeaw.ac.at/api/48521
has character encoding: UTF-8
has contact: https://arche.acdh.oeaw.ac.at/api/3689
has contact: https://arche.acdh.oeaw.ac.at/api/39799
has coverage end date: 1914-01-01T00:00:00
has coverage start date: 1914-01-01T00:00:00
has created end date: 2017-11-30T00:00:00
has created start date: 2014-12-01T00:00:00
has creator: https://arche.acdh.oeaw.ac.at/api/24071
has creator: https://arche.acdh.oeaw.ac.at/api/3689
has creator: https://arche.acdh.oeaw.ac.at/api/39799
has curator: https://arche.acdh.oeaw.ac.at/api/39799
has custom citation: author = {Czeitschner, Ulrike and Eisenheld, Victoria and Krautgartner, Barbara}
has depositor: https://arche.acdh.oeaw.ac.at/api/39799
has description: A XML/TEI transcription of: Karl Baedeker: Indien. Leipzig, 1914. OCR is based on the collection Facsimiles: Baedeker, Indien 1914. The text is tokenized, lemmatized, labelled with part-of-speech-tags (STTS tagset produced with TreeTagger), and manually corrected. Semantic annotation includes personal names of historical, mythological/religious and literary figures (except occurences in street names and company names), dates, selected designations of groups and sights. Basic XML annotation was done at the Austrian Academy of Sciences (AAC-Austrian Academy Corpus). Transformation to TEI/P5, linguistic and semantic annotation was done within the GO!DIGITAL 1.0 project "travel!digital. Exploring People and Monuments in Baedeker Guidebooks (1875-1914)", Project-Nr.: ÖAW0204.
has extent: 1 xml-file (1 volume comprising 546 printed pages, 228764 tokens, 185290 running words)
has filename: Baedeker-Indien_1914.xml
has format: application/xml
has hosting: https://arche.acdh.oeaw.ac.at/api/3313
has identifier: https://hdl.handle.net/21.11115/0000-000C-35D0-D
has identifier: https://id.acdh.oeaw.ac.at/cmdi/2732
has identifier: Baedeker-Indien 1914.xml
has language: German
has license: CC BY 4.0
has licensor: https://arche.acdh.oeaw.ac.at/api/48505
has metadata creator: https://arche.acdh.oeaw.ac.at/api/39799
has metadata pid: https://hdl.handle.net/21.11115/0000-000D-D792-B
has oai set: https://arche.acdh.oeaw.ac.at/api/140017
has oai set: https://arche.acdh.oeaw.ac.at/api/50309
has owner: https://arche.acdh.oeaw.ac.at/api/48505
has pid: https://hdl.handle.net/21.11115/0000-000C-35D0-D
has raw binary size: 19200711
has related discipline: Digital humanities
has related discipline: Cultural anthropology
has related discipline: Cultural history
has related discipline: Linguistics and Literature
has rights holder: https://arche.acdh.oeaw.ac.at/api/21003
has schema: https://hdl.handle.net/21.11115/0000-000C-35CE-1
has spatial coverage: https://arche.acdh.oeaw.ac.at/api/25486
has subject: Karl Baedeker
has subject: historical travel guides
has technical info: Czeitschner: OCR, XML/TEI tagging; Eisenheld: manual correction of lemmatization and part-of-speech tagging; Krautgartner: tokenization, automatically lemmatization and part-of-speech tagging, interlinking of corpus and thesaurus
has title: Karl Baedeker: Indien. Handbuch für Reisende: Digitale Ausgabe @de
has title: Karl Baedeker: Indien. Handbuch für Reisende: Digital Edition
has updated date: 2021-07-15T10:46:41.661832
has updated role: uczeitschner
has used software: <oXygen/> XML Editor 17.1
has used software: ABBYY FineReader 8.0
has used software: TreeTagger
is part of: https://arche.acdh.oeaw.ac.at/api/14006
is source of: https://arche.acdh.oeaw.ac.at/api/21203

https://arche.acdh.oeaw.ac.at/api/3313
type: Organisation
acl read: public
created by: admin
has address line1: Bäckerstraße 13
has address line2: c/o ACDH
has alternative title: A Resource Centre for the HumanitiEs
has available date: 2018-08-07T10:02:06.534Z
has binary updated role: admin
has city: Wien @de
has city: Vienna
has country: Österreich @de
has country: Austria
has identifier: arche
has postcode: 1010
has region: Wien @de
has region: Vienna
has title: ARCHE
has updated date: 2025-12-15T10:35:19.209313
has updated role: init
has url: https://arche.acdh.oeaw.ac.at/browser/
is member of: https://arche.acdh.oeaw.ac.at/api/48505

https://arche.acdh.oeaw.ac.at/api/3689
type: Person
acl read: public
created by: admin
has address line1: Bäckerstraße 13
has address line2: c/o ACDH
has available date: 2018-09-03T10:18:53.705Z
has binary updated role: admin
has city: Wien @de
has city: Vienna
has country: Österreich @de
has country: Austria
has first name: Barbara @und
has identifier: bkrautgartner
has last name: Krautgartner @und
has personal title: Mag.
has postcode: 1010
has region: Wien @de
has region: Vienna
has title: Barbara Krautgartner @und
has updated date: 2025-09-02T14:48:48.991664
has updated role: uczeitschner
has url: https://www.oeaw.ac.at/acdh/institute/team/staff-members/barbara-krautgartner
is member of: https://arche.acdh.oeaw.ac.at/api/48505

https://arche.acdh.oeaw.ac.at/api/14006
type: Collection
acl read: public
created by: admin
has access restriction summary: öffentlich: 5 @de
has access restriction summary: public: 5
has actor: https://arche.acdh.oeaw.ac.at/api/35998
has applied method: OCR @und
has applied method: XML/TEI structural and semantic annotation @und
has applied method: lemmatization @und
has applied method: part-of-speech-tagging @und
has applied method: tokenization @und
has applied method description: Czeitschner: OCR, XML/TEI tagging, manual correction of lemmatization and part-of-speech tagging; Eisenheld: manual correction of lemmatization and part-of-speech tagging; Krautgartner: tokenization, automatically lemmatization and part-of-speech tagging, interlinking of corpus and thesaurus; Lanig: manual correction of lemmatization and part-of-speech tagging
has arrangement: 1 xml-file represents one printed volume
has available date: 2018-09-03T10:18:53.705Z
has binary size: 124461422
has binary updated role: admin
has collected end date: 2017-11-30T00:00:00
has collected start date: 2004-04-28T00:00:00
has completeness: project completed, no further changes
has contact: https://arche.acdh.oeaw.ac.at/api/3689
has contact: https://arche.acdh.oeaw.ac.at/api/39799
has coverage end date: 1914-01-01T00:00:00
has coverage start date: 1875-01-01T00:00:00
has created end date: 2018-01-26T00:00:00
has created start date: 2014-12-01T00:00:00
has creator: https://arche.acdh.oeaw.ac.at/api/24071
has creator: https://arche.acdh.oeaw.ac.at/api/28694
has creator: https://arche.acdh.oeaw.ac.at/api/3689
has creator: https://arche.acdh.oeaw.ac.at/api/39799
has curator: https://arche.acdh.oeaw.ac.at/api/39799
has custom citation: author = {Czeitschner, Ulrike and Krautgartner, Barbara and Eisenheld, Victoria and Lanig, Laura}
has depositor: https://arche.acdh.oeaw.ac.at/api/39799
has description: A collection of XML/TEI transcriptions of early German travel guides on non-European countries which were released by the Baedeker publishing house between 1875 and 1914 (5 volumes, first editions). OCR is based on the collection travel!digital Facsimiles. The texts are tokenized, lemmatized, labelled with part-of-speech-tags (STTS tagset produced with TreeTagger), and manually corrected. Semantic annotation includes personal names of historical, mythological/religious and literary figures (except occurences in street names and company names), dates, selected designations of groups and sights. Basic XML annotation was done at the Austrian Academy of Sciences (AAC-Austrian Academy Corpus). Transformation to TEI/P5, linguistic and semantic annotation was done within the GO!DIGITAL 1.0 project "travel!digital. Exploring People and Monuments in Baedeker Guidebooks (1875-1914)", Project-Nr.: ÖAW0204.
has extent: 5 XML-files (5 volumes comprising 3089 printed pages, 1,51 million tokens, 1,21 million running words)
has filename: Corpus
has funder: https://arche.acdh.oeaw.ac.at/api/21003
has hosting: https://arche.acdh.oeaw.ac.at/api/3313
has identifier: https://hdl.handle.net/21.11115/0000-000C-29F7-0
has identifier: Corpus
has language: German
has license: CC BY 4.0
has license summary: CC BY 4.0: 5 @de
has licensor: https://arche.acdh.oeaw.ac.at/api/48505
has life cycle status: completed
has metadata creator: https://arche.acdh.oeaw.ac.at/api/39799
has naming scheme: file names consist of Editor-Title_Year, e.g. Baedeker-Indien_1914.xml
has number of items: 5
has oai set: https://arche.acdh.oeaw.ac.at/api/140017
has owner: https://arche.acdh.oeaw.ac.at/api/48505
has pid: https://hdl.handle.net/21.11115/0000-000C-29F7-0
has principal investigator: https://arche.acdh.oeaw.ac.at/api/39799
has related discipline: Digital humanities
has related discipline: Cultural anthropology
has related discipline: Cultural history
has related discipline: Linguistics and Literature
has rights holder: https://arche.acdh.oeaw.ac.at/api/21003
has spatial coverage: https://arche.acdh.oeaw.ac.at/api/22510
has spatial coverage: https://arche.acdh.oeaw.ac.at/api/25486
has spatial coverage: https://arche.acdh.oeaw.ac.at/api/32349
has spatial coverage: https://arche.acdh.oeaw.ac.at/api/35780
has spatial coverage: https://arche.acdh.oeaw.ac.at/api/38487
has spatial coverage: https://arche.acdh.oeaw.ac.at/api/39249
has spatial coverage: https://arche.acdh.oeaw.ac.at/api/862
has subject: Karl Baedeker
has subject: historical travel guides
has technical info: A TEI schema documenting applied annotations is available
has title: travel!digital Corpus
has updated date: 2021-07-15T08:54:15.123856
has updated role: uczeitschner
has url: https://traveldigital.acdh.oeaw.ac.at
has used software: <oXygen/> XML Editor 17.1
has used software: ABBYY FineReader 8.0
has used software: TreeTagger
has version: 1
is part of: https://arche.acdh.oeaw.ac.at/api/19641
is source of: https://arche.acdh.oeaw.ac.at/api/12461
is source of: https://arche.acdh.oeaw.ac.at/api/21203

https://arche.acdh.oeaw.ac.at/api/19641
type: TopCollection
acl read: public
created by: admin
has access restriction summary: öffentlich: 3032 @de
has access restriction summary: public: 3032
has actor: https://arche.acdh.oeaw.ac.at/api/35998
has applied method: OCR, XML/TEI structural and semantic annotation @und
has applied method: SKOS data modelling @und
has applied method: TEI schema customization @und
has applied method: image creation (scanning, photography) @und
has applied method: index file creation @und
has applied method: lemmatization @und
has applied method: part-of-speech-tagging @und
has applied method: tokenization @und
has applied method description: Czeitschner (project manager): image creation, OCR, XML/TEI tagging, TEI schema customization, index file creation, manual correction of lemmatization and part-of-speech tagging, SKOS data modelling, Thesaurus enrichment; Eisenheld (student assistant): manual correction of lemmatization and part-of-speech tagging; Krautgartner (data manager): index file creation, tokenization, automatically lemmatization and part-of-speech tagging, interlinking of corpus and thesaurus; Lanig (student assistant): manual correction of lemmatization and part-of-speech tagging; Schopper (technical support): TEI schema customization; AAC: image creation
has available date: 2018-09-03T10:18:53.705Z
has binary size: 1900474613
has binary updated role: admin
has collected end date: 2017-11-30T00:00:00
has collected start date: 2004-04-28T00:00:00
has completeness: project completed, no further changes
has contact: https://arche.acdh.oeaw.ac.at/api/3689
has contact: https://arche.acdh.oeaw.ac.at/api/39799
has contributor: https://arche.acdh.oeaw.ac.at/api/24071
has contributor: https://arche.acdh.oeaw.ac.at/api/28694
has contributor: https://arche.acdh.oeaw.ac.at/api/37906
has coverage end date: 1914-01-01T00:00:00
has coverage start date: 1875-01-01T00:00:00
has created end date: 2018-01-26T00:00:00
has created start date: 2014-12-01T00:00:00
has curator: https://arche.acdh.oeaw.ac.at/api/39799
has custom citation: editor = {Czeitschner, Ulrike and Krautgartner, Barbara}
has depositor: https://arche.acdh.oeaw.ac.at/api/39799
has description: A digital collection of early German travel guides on non-European countries which were released by the Baedeker publishing house between 1875 and 1914. The collection consists of the travel!digital Corpus (XML/TEI transcriptions of first editions (5 volumes) including structural, semantic and linguistic annotations), the travel!digital Facsimiles (scans and photographs of the historical prints), the travel!digital Auxiliary Files (a TEI schema of the annotations applied in the corpus, and a list of term labels for indexing names of persons annotated in the corpus), and the travel!digital Thesaurus (a SKOS vocabulary covering designations of groups and selected sights annotated in the corpus). The collection was created within the GO!DIGITAL 1.0 project "travel!digital. Exploring People and Monuments in Baedeker Guidebooks (1875-1914)", Project-Nr.: ÖAW0204. Image creation was done in 2004 at the Austrian Academy of Sciences (AAC-Austrian Academy Corpus).
has editor: https://arche.acdh.oeaw.ac.at/api/3689
has editor: https://arche.acdh.oeaw.ac.at/api/39799
has extent: Total: 4 folders, 6 subfolders, 3031 files (Auxiliary Files: 1 subfolder with 3 files, 1 file; Corpus: 5 files; Images: 5 subfolders with 3021 files; Thesaurus: 1 file)
has funder: https://arche.acdh.oeaw.ac.at/api/21003
has hosting: https://arche.acdh.oeaw.ac.at/api/3313
has identifier: https://hdl.handle.net/21.11115/0000-000C-29F3-4
has identifier: traveldigital
has language: German
has license: CC BY 4.0
has license summary: CC0 1.0: 3021 / CC BY 4.0: 11 @de
has licensor: https://arche.acdh.oeaw.ac.at/api/48505
has life cycle status: completed
has metadata creator: https://arche.acdh.oeaw.ac.at/api/39799
has number of items: 3042
has oai set: OpenAIRE
has owner: https://arche.acdh.oeaw.ac.at/api/48505
has pid: https://hdl.handle.net/21.11115/0000-000C-29F3-4
has principal investigator: https://arche.acdh.oeaw.ac.at/api/39799
has related discipline: Digital humanities
has related discipline: Cultural anthropology
has related discipline: Cultural history
has related discipline: Linguistics and Literature
has rights holder: https://arche.acdh.oeaw.ac.at/api/21003
has spatial coverage: https://arche.acdh.oeaw.ac.at/api/22510
has spatial coverage: https://arche.acdh.oeaw.ac.at/api/25486
has spatial coverage: https://arche.acdh.oeaw.ac.at/api/32349
has spatial coverage: https://arche.acdh.oeaw.ac.at/api/35780
has spatial coverage: https://arche.acdh.oeaw.ac.at/api/38487
has spatial coverage: https://arche.acdh.oeaw.ac.at/api/39249
has spatial coverage: https://arche.acdh.oeaw.ac.at/api/862
has subject: Karl Baedeker
has subject: historical travel guides
has title: travel!digital Collection
has updated date: 2021-07-15T08:54:06.518349
has updated role: uczeitschner
has url: https://traveldigital.acdh.oeaw.ac.at
has version: 1

https://arche.acdh.oeaw.ac.at/api/19813
type: Resource
acl read: public
created by: admin
has access restriction: public
has applied method: scanning @und
has author: https://arche.acdh.oeaw.ac.at/api/35998
has available date: 2018-09-03T14:26:08
has binary size: 61954
has binary updated date: 2019-12-13T15:57:54.95Z
has binary updated role: admin
has category: Image
has curator: https://arche.acdh.oeaw.ac.at/api/39799
has depositor: https://arche.acdh.oeaw.ac.at/api/39799
has digitising agent: https://arche.acdh.oeaw.ac.at/api/39799
has extent: 61954
has filename: Baedeker-Indien_i0052.tiff
has format: image/tiff
has hosting: https://arche.acdh.oeaw.ac.at/api/3313
has identifier: https://hdl.handle.net/21.11115/0000-000C-32AD-9
has license: CC0 1.0
has licensor: https://arche.acdh.oeaw.ac.at/api/48505
has metadata creator: https://arche.acdh.oeaw.ac.at/api/39799
has next item: https://arche.acdh.oeaw.ac.at/api/510
has owner: https://arche.acdh.oeaw.ac.at/api/48505
has pid: https://hdl.handle.net/21.11115/0000-000C-32AD-9
has pixel height: 2581
has pixel width: 1688
has raw binary size: 61954
has rights holder: https://arche.acdh.oeaw.ac.at/api/67349
has spatial coverage: https://arche.acdh.oeaw.ac.at/api/25486
has technical info: b/w scans: 400 dpi; greyscale scans: 400 dpi
has title: Baedeker-Indien_i0052.tiff
has updated date: 2021-07-15T10:16:49.929670
has updated role: uczeitschner
has used hardware: Zeutschel-OMNISCAN-7000 book scanner
is part of: https://arche.acdh.oeaw.ac.at/api/34665

https://arche.acdh.oeaw.ac.at/api/21003
type: Organisation
acl read: public
created by: admin
has address line1: Dr. Ignaz Seipel-Platz 2
has alternative title: ÖAW @de
has available date: 2018-08-07T10:02:06.534Z
has binary updated role: admin
has city: Wien @de
has city: Vienna
has country: Österreich @de
has country: Austria
has identifier: http://viaf.org/viaf/141312644
has identifier: http://viaf.org/viaf/141440509
has identifier: Q299015
has identifier: https://d-nb.info/gnd/1001454-8
has identifier: 108595336X
has identifier: https://d-nb.info/gnd/1090414722
has identifier: https://d-nb.info/gnd/4079277-8
has identifier: oeaw
has identifier: 03anc3s24
has postcode: 1010
has region: Wien @de
has region: Vienna
has title: Österreichische Akademie der Wissenschaften @de
has title: Austrian Academy of Sciences
has updated date: 2025-12-15T10:35:18.507031
has updated role: init
has url: https://www.oeaw.ac.at

https://arche.acdh.oeaw.ac.at/api/22510
type: Place
acl read: public
created by: admin
has available date: 2018-09-03T10:18:53.705Z
has binary updated role: admin
has identifier: place-constantinople
has identifier: https://pleiades.stoa.org/places/520985
has latitude: 41.005902
has longitude: 28.9738815
has title: Konstantinopel @de
has title: Constantinople
has updated date: 2020-01-28T14:23:18.011Z
has updated role: admin
has WKT: POINT(28.9738815 41.005902)

https://arche.acdh.oeaw.ac.at/api/23885
type: Organisation
acl read: public
created by: admin
has alternative title: AAC
has available date: 2018-09-03T10:18:53.705Z
has binary updated role: admin
has identifier: aac
has note: Bestehungszeitraum 2005-2009 @de
has note: Existence 2005-2009
has title: Austrian Academy Corpus | Österreichische Akademie der Wissenschaften @de
has title: Austrian Academy Corpus | Austrian Academy of Sciences
has updated date: 2020-01-23T08:49:47.741Z
has updated role: admin
is member of: https://arche.acdh.oeaw.ac.at/api/21003

https://arche.acdh.oeaw.ac.at/api/24071
type: Person
acl read: public
created by: admin
has available date: 2018-09-03T10:18:53.705Z
has binary updated role: admin
has first name: Victoria @und
has identifier: veisenheld
has last name: Eisenheld @und
has title: Victoria Eisenheld @und
has updated date: 2020-02-24T08:28:29.221Z
has updated role: admin

https://arche.acdh.oeaw.ac.at/api/25486
type: Place
acl read: public
created by: admin
has available date: 2018-09-03T10:18:53.705Z
has binary updated role: admin
has identifier: place-india
has identifier: https://sws.geonames.org/1269750/
has latitude: 22
has longitude: 79
has title: Indien @de
has title: India
has updated date: 2020-01-28T14:23:18.269Z
has updated role: admin
has WKT: POINT(79 22)

https://arche.acdh.oeaw.ac.at/api/28694
type: Person
acl read: public
created by: admin
has available date: 2018-09-03T10:18:53.705Z
has binary updated role: admin
has first name: Laura @und
has identifier: llanig
has last name: Lanig @und
has title: Laura Lanig @und
has updated date: 2020-02-21T10:58:57.946Z
has updated role: admin

https://arche.acdh.oeaw.ac.at/api/32349
type: Place
acl read: public
created by: admin
has available date: 2018-09-03T10:18:53.705Z
has binary updated role: admin
has identifier: place-mediterraneansea
has identifier: https://sws.geonames.org/363196/
has latitude: 35
has longitude: 20
has title: Mittelmeer @de
has title: Mediterranean Sea
has updated date: 2024-09-20T08:29:09.983786
has updated role: pandorfer
has WKT: POINT(20 35)

https://arche.acdh.oeaw.ac.at/api/34665
type: Collection
acl read: public
created by: admin
has access restriction summary: öffentlich: 533 @de
has access restriction summary: public: 533
has actor: https://arche.acdh.oeaw.ac.at/api/35998
has applied method: photography @und
has applied method: scanning @und
has applied method description: Czeitschner: scanning; AAC: photography
has arrangement: folder represents complete printed volume
has author: https://arche.acdh.oeaw.ac.at/api/35998
has available date: 2018-09-03T10:18:53.705Z
has binary size: 328486698
has binary updated role: admin
has collected end date: 2004-09-15T00:00:00
has collected start date: 2004-05-05T00:00:00
has completeness: project completed, no further changes
has contact: https://arche.acdh.oeaw.ac.at/api/39799
has coverage end date: 1914-01-01T00:00:00
has coverage start date: 1914-01-01T00:00:00
has created end date: 2017-11-30T00:00:00
has created start date: 2014-12-01T00:00:00
has curator: https://arche.acdh.oeaw.ac.at/api/39799
has custom citation: author = {Czeitschner, Ulrike and {Austrian Academy Corpus}}
has depositor: https://arche.acdh.oeaw.ac.at/api/39799
has description: A collection of b/w, greyscale scans and color photographs in TIFF-format of: Karl Baedeker: Indien. Leipzig, 1914. Image creation was done in 2004 at the Austrian Academy of Sciences (AAC-Austrian Academy Corpus).
has digitising agent: https://arche.acdh.oeaw.ac.at/api/23885
has digitising agent: https://arche.acdh.oeaw.ac.at/api/39799
has extent: 533 TIFF-files (13 double pages)
has filename: Baedeker-Indien_1914
has funder: https://arche.acdh.oeaw.ac.at/api/21003
has hosting: https://arche.acdh.oeaw.ac.at/api/3313
has identifier: https://hdl.handle.net/21.11115/0000-000C-29FB-C
has identifier: Baedeker-Indien 1914
has language: German
has license: CC0 1.0
has license summary: CC0 1.0: 533 @de
has licensor: https://arche.acdh.oeaw.ac.at/api/48505
has life cycle status: completed
has metadata creator: https://arche.acdh.oeaw.ac.at/api/39799
has naming scheme: folder name consist of Editor-Title_Year: Baedeker-Indien_1914; file names consist of Editor-Title_fileNumber: e.g. Baedeker-Indien_a0001.tiff; file numbers consist of a letter indicating the location of the pages and a consecutive number indicating the page number: 'a' sorting front cover and titlepages, 'i' sorting contents and pages with Latin pagination, 'n' sorting pages with Arabic pagination, 'u' sorting pages not paginated in the back and back cover; in case of pages not considered in the pagination of the printed edition '_a', '_b' etc. is added, e.g. Baedeker-Indien_n0004_a.tiff
has next item: https://arche.acdh.oeaw.ac.at/api/342
has number of items: 533
has oai set: Kulturpool
has owner: https://arche.acdh.oeaw.ac.at/api/48505
has pid: https://hdl.handle.net/21.11115/0000-000C-29FB-C
has principal investigator: https://arche.acdh.oeaw.ac.at/api/39799
has related discipline: Digital humanities
has related discipline: Cultural anthropology
has related discipline: Cultural history
has related discipline: Linguistics and Literature
has rights holder: https://arche.acdh.oeaw.ac.at/api/67349
has spatial coverage: https://arche.acdh.oeaw.ac.at/api/25486
has subject: Karl Baedeker
has subject: historical travel guides
has tag: TEXT @und
has technical info: b/w scans: 400 dpi; greyscale scans: 400 dpi; color photographs: 180 dpi
has title: Facsimiles: Baedeker, Indien 1914
has updated date: 2021-07-15T12:59:51.499376
has updated role: uczeitschner
has url: https://traveldigital.acdh.oeaw.ac.at
has used hardware: Canon EOS D60
has used hardware: Zeutschel-OMNISCAN-7000 book scanne
has used software: Adobe Photoshop 7.0
has used software: ImageGear Version: 7.01.002
has used software: IrfanView
has version: 1
is part of: https://arche.acdh.oeaw.ac.at/api/38486
is source of: https://arche.acdh.oeaw.ac.at/api/2732

https://arche.acdh.oeaw.ac.at/api/35780
type: Place
acl read: public
created by: admin
has available date: 2018-09-03T10:18:53.705Z
has binary updated role: admin
has identifier: place-syria
has identifier: https://sws.geonames.org/163843/
has latitude: 35
has longitude: 38
has title: Syrien @de
has title: Syria
has updated date: 2020-01-28T14:23:18.513Z
has updated role: admin
has WKT: POINT(38 35)

https://arche.acdh.oeaw.ac.at/api/35998
type: Person
acl read: public
created by: admin
has available date: 2018-09-03T10:18:53.705Z
has binary updated role: admin
has first name: Karl @und
has identifier: http://viaf.org/viaf/100207476
has identifier: Q77302
has identifier: https://d-nb.info/gnd/116033290
has identifier: https://d-nb.info/gnd/189456485
has identifier: https://d-nb.info/gnd/189462434
has identifier: kbaedeker
has identifier: https://isni.org/isni/0000000118801533
has last name: Baedeker @und
has title: Karl Baedeker @und
has updated date: 2020-02-21T10:58:50.258Z
has updated role: admin

https://arche.acdh.oeaw.ac.at/api/37906
type: Person
acl read: public
created by: admin
has address line1: Bäckerstraße 13
has address line2: c/o ACDH
has available date: 2017-10-16T12:45:39.222Z
has binary updated role: admin
has city: Wien @de
has city: Vienna
has country: Österreich @de
has country: Austria
has first name: Daniel @und
has identifier: http://viaf.org/viaf/249676043
has identifier: dschopper
has identifier: https://orcid.org/0000-0003-2436-0361
has last name: Schopper @und
has personal title: Mag.
has postcode: 1010
has region: Wien @de
has region: Vienna
has title: Daniel Schopper @und
has updated date: 2025-12-15T10:35:20.330777
has updated role: init
has url: https://www.oeaw.ac.at/acdh/institute/team/staff-members/daniel-schopper
is member of: https://arche.acdh.oeaw.ac.at/api/48505

https://arche.acdh.oeaw.ac.at/api/38486
type: Collection
acl read: public
created by: admin
has access restriction summary: öffentlich: 3021 @de
has access restriction summary: public: 3021
has actor: https://arche.acdh.oeaw.ac.at/api/35998
has applied method: photography @und
has applied method: scanning @und
has applied method description: Czeitschner: scanning; AAC: photography
has arrangement: 1 folder represents one printed volume
has author: https://arche.acdh.oeaw.ac.at/api/35998
has available date: 2018-09-03T10:18:53.705Z
has binary size: 1762850251
has binary updated role: admin
has collected end date: 2004-09-15T00:00:00
has collected start date: 2004-04-28T00:00:00
has completeness: project completed, no further changes
has contact: https://arche.acdh.oeaw.ac.at/api/39799
has coverage end date: 1914-01-01T00:00:00
has coverage start date: 1875-01-01T00:00:00
has created end date: 2017-11-30T00:00:00
has created start date: 2014-12-01T00:00:00
has curator: https://arche.acdh.oeaw.ac.at/api/39799
has custom citation: author = {Czeitschner, Ulrike and {Austrian Academy Corpus}}
has depositor: https://arche.acdh.oeaw.ac.at/api/39799
has description: A collection of b/w, greyscale scans and color photographs in TIFF-format of early German travel guides on non-European countries which were released by the Baedeker publishing house between 1875 and 1914 (5 volumes, first editions). Image creation was done in 2004 at the Austrian Academy of Sciences (AAC-Austrian Academy Corpus).
has digitising agent: https://arche.acdh.oeaw.ac.at/api/23885
has digitising agent: https://arche.acdh.oeaw.ac.at/api/39799
has extent: 5 folders, 3021 TIFF-files
has filename: Images
has funder: https://arche.acdh.oeaw.ac.at/api/21003
has hosting: https://arche.acdh.oeaw.ac.at/api/3313
has identifier: https://hdl.handle.net/21.11115/0000-000C-29F4-3
has identifier: Images
has license: CC0 1.0
has license summary: CC0 1.0: 3021 @de
has licensor: https://arche.acdh.oeaw.ac.at/api/48505
has life cycle status: completed
has metadata creator: https://arche.acdh.oeaw.ac.at/api/39799
has naming scheme: folder names consist of Editor-Title_Year, e.g. Baedeker-Indien_1914; file names consist of Editor-Title_fileNumber, e.g. Baedeker-Indien_a0001.tiff; file numbers consist of a letter indicating the location of the pages and a consecutive number indicating the page number: 'a' sorting front cover and titlepages, 'i' sorting contents and pages with Latin pagination, 'n' sorting pages with Arabic pagination, 'u' sorting pages not paginated in the back and back cover; in case of pages not considered in the pagination of the printed edition '_a', '_b' etc. is added, e.g. Baedeker-Indien_n0004_a.tiff
has number of items: 3026
has owner: https://arche.acdh.oeaw.ac.at/api/48505
has pid: https://hdl.handle.net/21.11115/0000-000C-29F4-3
has principal investigator: https://arche.acdh.oeaw.ac.at/api/39799
has related discipline: Digital humanities
has related discipline: Cultural anthropology
has related discipline: Cultural history
has related discipline: Linguistics and Literature
has rights holder: https://arche.acdh.oeaw.ac.at/api/67349
has spatial coverage: https://arche.acdh.oeaw.ac.at/api/22510
has spatial coverage: https://arche.acdh.oeaw.ac.at/api/25486
has spatial coverage: https://arche.acdh.oeaw.ac.at/api/32349
has spatial coverage: https://arche.acdh.oeaw.ac.at/api/35780
has spatial coverage: https://arche.acdh.oeaw.ac.at/api/38487
has spatial coverage: https://arche.acdh.oeaw.ac.at/api/39249
has spatial coverage: https://arche.acdh.oeaw.ac.at/api/862
has subject: Karl Baedeker
has subject: historical travel guides
has technical info: b/w scans: 400 dpi; greyscale scans: 400 dpi; color photographs: 180 dpi
has title: travel!digital Facsimiles
has updated date: 2021-07-15T12:59:42.064475
has updated role: uczeitschner
has url: https://traveldigital.acdh.oeaw.ac.at
has used hardware: Canon EOS D60
has used hardware: Zeutschel-OMNISCAN-7000 book scanner
has used software: Adobe Photoshop 7.0
has used software: ImageGear Version: 7.01.002
has used software: IrfanView
has version: 1
is part of: https://arche.acdh.oeaw.ac.at/api/19641
is source of: https://arche.acdh.oeaw.ac.at/api/14006

https://arche.acdh.oeaw.ac.at/api/38487
type: Place
acl read: public
created by: admin
has available date: 2018-09-03T10:18:53.705Z
has binary updated role: admin
has identifier: place-palestine
has identifier: https://sws.geonames.org/4246560/
has identifier: https://sws.geonames.org/6254930/
has latitude: 31.92157
has longitude: 35.20329
has title: Palestina @de
has title: Palestine
has title: Palästina @und
has updated date: 2024-09-20T08:27:03.507472
has updated role: pandorfer
has WKT: POINT(35.20329 31.92157)

https://arche.acdh.oeaw.ac.at/api/39249
type: Place
acl read: public
created by: admin
has available date: 2018-09-03T10:18:53.705Z
has binary updated role: admin
has identifier: place-asiaminor
has identifier: https://pleiades.stoa.org/places/837
has latitude: 39.5941512615
has longitude: 30.7887698603
has title: Kleinasien @de
has title: Asia Minor
has updated date: 2020-01-28T14:23:17.724Z
has updated role: admin
has WKT: POINT(30.7887698603 39.5941512615)

https://arche.acdh.oeaw.ac.at/api/39799
type: Person
acl read: public
created by: admin
has address line1: Bäckerstraße 13
has address line2: c/o ACDH
has available date: 2018-08-07T10:02:06.534Z
has binary updated role: admin
has city: Wien @de
has city: Vienna
has country: Österreich @de
has country: Austria
has first name: Ulrike @und
has identifier: uczeitschner
has last name: Czeitschner @und
has personal title: Mag.
has postcode: 1010
has region: Wien @de
has region: Vienna
has title: Ulrike Czeitschner @und
has updated date: 2025-12-15T10:35:20.324684
has updated role: init
has url: https://www.oeaw.ac.at/acdh/institute/team/staff-members/ulrike-czeitschner
is member of: https://arche.acdh.oeaw.ac.at/api/48505

https://arche.acdh.oeaw.ac.at/api/48505
type: Organisation
acl read: public
created by: admin
has address line1: Bäckerstraße 13
has alternative title: ACDH
has available date: 2017-12-16T16:17:30.92Z
has binary updated role: admin
has city: Wien @de
has city: Vienna
has country: Österreich @de
has country: Austria
has identifier: http://viaf.org/viaf/6515148451584915970000
has identifier: https://d-nb.info/gnd/1123037736
has identifier: acdh
has identifier: acdh-oeaw
has postcode: 1010
has region: Wien @de
has region: Vienna
has title: Austrian Centre for Digital Humanities
has updated date: 2025-12-15T10:35:18.546367
has updated role: init
has url: https://www.oeaw.ac.at/acdh
is member of: https://arche.acdh.oeaw.ac.at/api/21003

public
source: CLARIN
type: Concept
definition: Öffentliche Ressourcen sind ohne Einschränkungen zugänglich. @de
definition: Public resources are accessible without any further restrictions.
in scheme: https://arche.acdh.oeaw.ac.at/api/67340
preferred label: öffentlich @de
top concept of: https://arche.acdh.oeaw.ac.at/api/67340
acl read: public
created by: init
has available date: 2020-07-31T12:16:21.054791
has identifier: public
has title: öffentlich @de
has title: public
has updated date: 2023-02-16T11:35:25.478661
has updated role: init
is part of: https://arche.acdh.oeaw.ac.at/api/67340

Image
type: Concept
definition: Eine visuelle Darstellung, die nicht Text ist. Digitalisierte oder digitale Bilder, Zeichnungen, Gemälde oder Fotografien. @de
definition: A visual representation other than text. Digitised or born digital images, drawings, paintings or photographs.
in scheme: https://arche.acdh.oeaw.ac.at/api/67344
narrower: https://arche.acdh.oeaw.ac.at/api/139815
preferred label: Bild @de
top concept of: https://arche.acdh.oeaw.ac.at/api/67344
created by: init
has available date: 2021-07-26T17:56:38.143735
has identifier: StillImage
has identifier: image
has title: Bild @de
has title: Image
has updated date: 2022-08-18T10:23:09.375847
has updated role: zozlak
is part of: https://arche.acdh.oeaw.ac.at/api/67344

completed
type: Concept
definition: An einem abgeschlossenen Objekt wird nicht mehr gearbeitet und die Ergebnisse können als final betrachtet werden. @de
definition: A complete object is not longer worked on and results are final.
in scheme: https://arche.acdh.oeaw.ac.at/api/67342
preferred label: abgeschlossen @de
top concept of: https://arche.acdh.oeaw.ac.at/api/67342
acl read: public
created by: init
has available date: 2020-07-31T12:16:34.124493
has identifier: completed
has title: abgeschlossen @de
has title: completed
has updated date: 2023-02-16T11:35:42.064148
has updated role: init
is part of: https://arche.acdh.oeaw.ac.at/api/67342

German
type: Concept
in scheme: https://arche.acdh.oeaw.ac.at/api/67345
preferred label: Deutsch @de
preferred label: allemand @fr
top concept of: https://arche.acdh.oeaw.ac.at/api/67345
acl read: public
created by: init
has available date: 2020-07-31T13:58:39.428401
has identifier: de
has identifier: deu
has title: Deutsch @de
has title: German
has title: allemand @fr
has updated date: 2023-02-16T17:46:19.419749
has updated role: init
is part of: https://arche.acdh.oeaw.ac.at/api/67345

Digital humanities
type: Concept
broader: https://arche.acdh.oeaw.ac.at/api/48937
in scheme: https://arche.acdh.oeaw.ac.at/api/67346
notation: 605007
preferred label: Digital Humanities @de
acl read: public
created by: init
has available date: 2020-09-22T06:24:10.318660
has identifier: https://vocabs.acdh.oeaw.ac.at/oefosdisciplines/605007
has title: Digital Humanities @de
has title: Digital humanities
has updated date: 2024-01-18T13:37:37.303276
has updated role: init
is part of: https://arche.acdh.oeaw.ac.at/api/67346

Cultural anthropology
type: Concept
broader: https://arche.acdh.oeaw.ac.at/api/49912
in scheme: https://arche.acdh.oeaw.ac.at/api/67346
notation: 504017
preferred label: Kulturanthropologie @de
acl read: public
created by: init
has available date: 2020-09-22T06:28:34.447924
has identifier: https://vocabs.acdh.oeaw.ac.at/oefosdisciplines/504017
has title: Kulturanthropologie @de
has title: Cultural anthropology
has updated date: 2024-01-18T13:36:52.718121
has updated role: init
is part of: https://arche.acdh.oeaw.ac.at/api/67346

Cultural history
type: Concept
broader: https://arche.acdh.oeaw.ac.at/api/48937
in scheme: https://arche.acdh.oeaw.ac.at/api/67346
notation: 605002
preferred label: Kulturgeschichte @de
acl read: public
created by: init
has available date: 2020-09-22T06:24:14.453944
has identifier: https://vocabs.acdh.oeaw.ac.at/oefosdisciplines/605002
has title: Kulturgeschichte @de
has title: Cultural history
has updated date: 2024-01-18T13:37:36.704933
has updated role: init
is part of: https://arche.acdh.oeaw.ac.at/api/67346

Linguistics and Literature
type: Concept
broader: https://arche.acdh.oeaw.ac.at/api/48507
in scheme: https://arche.acdh.oeaw.ac.at/api/67346
narrower: https://arche.acdh.oeaw.ac.at/api/48543
narrower: https://arche.acdh.oeaw.ac.at/api/48544
narrower: https://arche.acdh.oeaw.ac.at/api/48552
narrower: https://arche.acdh.oeaw.ac.at/api/48553
narrower: https://arche.acdh.oeaw.ac.at/api/48554
narrower: https://arche.acdh.oeaw.ac.at/api/50089
narrower: https://arche.acdh.oeaw.ac.at/api/50090
narrower: https://arche.acdh.oeaw.ac.at/api/50091
narrower: https://arche.acdh.oeaw.ac.at/api/50092
narrower: https://arche.acdh.oeaw.ac.at/api/50093
narrower: https://arche.acdh.oeaw.ac.at/api/50094
narrower: https://arche.acdh.oeaw.ac.at/api/50095
narrower: https://arche.acdh.oeaw.ac.at/api/50096
narrower: https://arche.acdh.oeaw.ac.at/api/50097
narrower: https://arche.acdh.oeaw.ac.at/api/50098
narrower: https://arche.acdh.oeaw.ac.at/api/50099
narrower: https://arche.acdh.oeaw.ac.at/api/50100
narrower: https://arche.acdh.oeaw.ac.at/api/50101
narrower: https://arche.acdh.oeaw.ac.at/api/50102
narrower: https://arche.acdh.oeaw.ac.at/api/50103
narrower: https://arche.acdh.oeaw.ac.at/api/50104
narrower: https://arche.acdh.oeaw.ac.at/api/50105
narrower: https://arche.acdh.oeaw.ac.at/api/50106
narrower: https://arche.acdh.oeaw.ac.at/api/50107
narrower: https://arche.acdh.oeaw.ac.at/api/50108
narrower: https://arche.acdh.oeaw.ac.at/api/50109
narrower: https://arche.acdh.oeaw.ac.at/api/50110
narrower: https://arche.acdh.oeaw.ac.at/api/50111
narrower: https://arche.acdh.oeaw.ac.at/api/50112
narrower: https://arche.acdh.oeaw.ac.at/api/50113
narrower: https://arche.acdh.oeaw.ac.at/api/50114
narrower: https://arche.acdh.oeaw.ac.at/api/50115
narrower: https://arche.acdh.oeaw.ac.at/api/50116
narrower: https://arche.acdh.oeaw.ac.at/api/50117
narrower: https://arche.acdh.oeaw.ac.at/api/50118
narrower: https://arche.acdh.oeaw.ac.at/api/50119
narrower: https://arche.acdh.oeaw.ac.at/api/50120
narrower: https://arche.acdh.oeaw.ac.at/api/50121
narrower: https://arche.acdh.oeaw.ac.at/api/50122
narrower: https://arche.acdh.oeaw.ac.at/api/50123
narrower: https://arche.acdh.oeaw.ac.at/api/50124
narrower: https://arche.acdh.oeaw.ac.at/api/50125
narrower: https://arche.acdh.oeaw.ac.at/api/50126
narrower: https://arche.acdh.oeaw.ac.at/api/50127
narrower: https://arche.acdh.oeaw.ac.at/api/50128
narrower: https://arche.acdh.oeaw.ac.at/api/50129
narrower: https://arche.acdh.oeaw.ac.at/api/50130
narrower: https://arche.acdh.oeaw.ac.at/api/50131
narrower: https://arche.acdh.oeaw.ac.at/api/50132
narrower: https://arche.acdh.oeaw.ac.at/api/50133
narrower: https://arche.acdh.oeaw.ac.at/api/50134
narrower: https://arche.acdh.oeaw.ac.at/api/50135
narrower: https://arche.acdh.oeaw.ac.at/api/50136
narrower: https://arche.acdh.oeaw.ac.at/api/50137
narrower: https://arche.acdh.oeaw.ac.at/api/50138
narrower: https://arche.acdh.oeaw.ac.at/api/66147
narrower: https://arche.acdh.oeaw.ac.at/api/66148
narrower: https://arche.acdh.oeaw.ac.at/api/66149
narrower: https://arche.acdh.oeaw.ac.at/api/66150
notation: 6020
preferred label: Sprach- und Literaturwissenschaften @de
acl read: public
created by: init
has available date: 2020-09-22T06:26:12.792611
has identifier: https://vocabs.acdh.oeaw.ac.at/oefosdisciplines/6020
has title: Sprach- und Literaturwissenschaften @de
has title: Linguistics and Literature
has updated date: 2024-01-18T13:37:48.487315
has updated role: init
is part of: https://arche.acdh.oeaw.ac.at/api/67346

CC BY 4.0
created: 2020-02-29T15:06:19.522758+00:00
modified: 2024-04-15T10:08:53.318304+00:00
type: Concept
alternative label: Namensnennung 4.0 International (CC BY 4.0) @de
alternative label: Attribution 4.0 International (CC BY 4.0)
definition: This license lets others distribute, remix, tweak, and build upon your work, even commercially, as long as they credit you for the original creation. This is the most accommodating of licenses offered. Recommended for maximum dissemination and use of licensed materials.
in scheme: https://arche.acdh.oeaw.ac.at/api/67343
top concept of: https://arche.acdh.oeaw.ac.at/api/67343
acl read: public
created by: init
has available date: 2020-09-30T11:06:20.479556
has identifier: https://creativecommons.org/licenses/by/4.0/
has identifier: cc-by-4-0
has title: CC BY 4.0 @de
has updated date: 2024-04-24T06:22:28.946001
has updated role: init
is part of: https://arche.acdh.oeaw.ac.at/api/67343

CC0 1.0
created: 2020-02-29T15:18:57.140974+00:00
modified: 2024-04-15T10:08:53.234687+00:00
type: Concept
alternative label: CC0 1.0 Universell (CC0 1.0) Public Domain Dedication @de
alternative label: CC0 1.0 Universal (CC0 1.0) Public Domain Dedication
definition: Die Person, die ein Werk mit dieser Deed verknüpft hat, hat dieses Werk in die Gemeinfreiheit - auch genannt Public Domain - entlassen, indem sie weltweit auf alle urheberrechtlichen und verwandten Schutzrechte verzichtet hat, soweit das gesetzlich möglich ist. Sie dürfen das Werk kopieren, verändern, verbreiten und aufführen, sogar zu kommerziellen Zwecken, ohne um weitere Erlaubnis bitten zu müssen. @de
definition: The person who associated a work with this deed has dedicated the work to the public domain by waiving all of his or her rights to the work worldwide under copyright law, including all related and neighboring rights, to the extent allowed by law. You can copy, modify, distribute and perform the work, even for commercial purposes, all without asking permission.
in scheme: https://arche.acdh.oeaw.ac.at/api/67343
top concept of: https://arche.acdh.oeaw.ac.at/api/67343
acl read: public
created by: init
has available date: 2020-09-30T11:06:18.881423
has identifier: https://creativecommons.org/publicdomain/zero/1.0/
has identifier: cc0-1-0
has title: CC0 1.0 @de
has updated date: 2024-04-24T06:22:32.062314
has updated role: init
is part of: https://arche.acdh.oeaw.ac.at/api/67343

Kulturpool
creator: Martina Trognitz
created: 2019-10-07T11:19:31.531393+00:00
modified: 2020-02-07T10:56:34.554808+00:00
type: Concept
definition: Kennzeichnet jene Sammlungen und Ressourchen in ARCHE, die durch Kulturpool (http://www.kulturpool.at) aggregiert werden sollten. Diese Daten werden weiter an Europeana (https://www.europeana.eu) gereicht. Ein besseres Verständnis über relevanten Inhalt bietet die Europeana Content Strategy (https://pro.europeana.eu/post/europeana-content-strategy). Kriterien für die Aufnahme: Bezug zu kulturellem Erbe, hoch qualitativer Inhalt, offene Daten (Metadaten müssen auf ein frei zugängliches digitales Objekt zeigen), Bezug zu Europa. @de
definition: Denotes any Collections or Resources in ARCHE that should be harvested by Kulturpool (http://www.kulturpool.at) which is further harvested by Europeana (https://www.europeana.eu). To have a better understanding of what should be included, have a look at the Europeana Content Strategy (https://pro.europeana.eu/post/europeana-content-strategy). Criteria for inlcusion: relation to cultural heritage, high-quality content, open data (metadata has to point to a freely accessible digital object), relation to Europe.
in scheme: https://arche.acdh.oeaw.ac.at/api/67341
notation: kulturpool
top concept of: https://arche.acdh.oeaw.ac.at/api/67341
created by: init
has available date: 2022-05-20T05:59:47.268375
has identifier: kulturpool
has title: Kulturpool @und
has updated date: 2023-02-16T17:46:39.986399
has updated role: init
is part of: https://arche.acdh.oeaw.ac.at/api/67341

https://arche.acdh.oeaw.ac.at/api/67349
type: Person
acl read: pandorfer
acl read: public
acl write: pandorfer
created by: pandorfer
has available date: 2020-10-22T12:39:25.881508
has description: Urheber definiert nach dem österreichischen Bundesgesetz über das Urheberrecht an Werken der Literatur und der Kunst und über verwandte Schutzrechte (Urheberrechtsgesetz) StF: BGBl. Nr. 111/1936 (StR: 39/Gu. BT: 64/Ge S. 19.) Abschnitt II. Verwendet für Rechteinhaber / Lizenzgeber von gemeinfreien Werken. @de
has description: Rights holder as defined in the Austrian Federal Law on Copyright in Literary and Artistic Works and on Related Rights (Copyright Law) StF: BGBl. Nr. 111/1936 (StR: 39/Gu. BT: 64/Ge S. 19.) paragraph II. Used for rights holders / licensors of works in public domain.
has identifier: none
has title: kein Urheber / Lizenzgeber (Rechtsträger) @de
has title: no rights holder / licensor (legal entity)
has title: none @und
has updated date: 2025-12-15T10:35:26.583066
has updated role: init
has url: https://vocabs.acdh.oeaw.ac.at/archelicenses/publicdomain-1-0

OpenAIRE
creator: Mateusz Żółtak
created: 2022-05-19T10:55:59.502484+00:00
modified: 2022-05-19T10:55:59.502484+00:00
type: Concept
definition: Denotes any Collections or Resources in ARCHE that should be harvested by the OpenAIRE (https://www.openaire.eu/). Criteria for inclusion: all top collections.
in scheme: https://arche.acdh.oeaw.ac.at/api/67341
notation: openaire_data
top concept of: https://arche.acdh.oeaw.ac.at/api/67341
created by: init
has available date: 2022-05-20T05:59:48.542914
has identifier: openaire data
has title: OpenAIRE @und
has updated date: 2023-02-16T17:46:40.073303
has updated role: init
is part of: https://arche.acdh.oeaw.ac.at/api/67341