Ontology
imports: skos-xl
version info: owl:Ontology added by TopBraid
imports: core
imports: http://purl.org/dc/elements/1.1/

skos-xl
contributor: Participants in W3C's Semantic Web Deployment Working Group.
creator: Alistair Miles
creator: Sean Bechhofer

core
creator: Sean Bechhofer
contributor: Dave Beckett
contributor: Nikki Rogers
creator: Alistair Miles
contributor: Participants in W3C's Semantic Web Deployment Working Group.

isTranslationOf
type: ObjectProperty
sub property of: labelRelation
definition: Inverse property of hasTranslation @en
inverse of: hasTranslation

hasTranslation
type: ObjectProperty
inverse of: isTranslationOf
sub property of: labelRelation
definition: Relation between different languages of a term @en

hasVariant
type: ObjectProperty
inverse of: isVariantOf
sub property of: labelRelation
definition: Term has a variant @en

isVariantOf
type: ObjectProperty
sub property of: labelRelation
definition: Inverse property of hasVariant @en
inverse of: hasVariant

narrowerTransitive
definition: skos:narrowerTransitive is a transitive superproperty of skos:narrower.

broaderTransitive
definition: skos:broaderTransitive is a transitive superproperty of skos:broader.

predicate 1
comment: The first property to compare

comment: Constraint S46b: skos:exactMatch must be disjoint with each of the properties skos:broadMatch and skos:relatedMatch

comment: Constraint S27: skos:related must be disjoint with the property skos:broaderTransitive

comment: Constraint S13: skos:hiddenLabel and skos:prefLabel must be disjoint

comment: Constraint S13: skos:altLabel and skos:prefLabel must be disjoint

predicate 1
comment: The first property to compare

comment: Constraint S46b: skos:exactMatch must be disjoint with each of the properties skos:broadMatch and skos:relatedMatch

comment: Constraint S46a: skos:exactMatch must be disjoint with each of the properties skos:broadMatch and skos:relatedMatch

comment: Constraint S13: skos:altLabel and skos:hiddenLabel must be disjoint

comment: Constraint S13: skos:altLabel and skos:hiddenLabel must be disjoint

allowed values collection

predicate 2
comment: The second property to compare

allowed values collection

comment: Constraint S27: skos:related must be disjoint with the property skos:broaderTransitive

comment: Constraint S13: skos:hiddenLabel and skos:prefLabel must be disjoint

predicate 2
comment: The second property to compare

comment: Constraint S46a: skos:exactMatch must be disjoint with each of the properties skos:broadMatch and skos:relatedMatch

comment: Constraint S13: skos:altLabel and skos:prefLabel must be disjoint

Sehenswertes
type: Collection
in scheme: travel!digital Thesaurus
member: Kunstwerke
member: Natur
member: Unterkunft/Restaurant
definition: bdk: in den Druckausgaben mit Sternen (*,**) als besonders sehenswert Gekennzeichnetes
member: Sonstiges Sehenswerte
notation: II
member: Ortschaft
member: Folklore
member: Concept02.01
member: Concept02.06
member: Inschriften
member: Concept02.08
member: Concept02.10

travel!digital Thesaurus
type: ConceptScheme
relation: traveldigital.acdh.oeaw.ac.at
publisher: ACDH - Austrian Centre for Digital Humanities @en
subject: group designations @en
has top concept: Inschriften
has top concept: Sonstiges Sehenswerte
has top concept: Kunstwerke
has top concept: Folklore
subject: sights @en
type: skos-xl
has top concept: Ethnisch/nationale Gemeinschaften
has top concept: Ortschaft
description: Der travel!digital Thesaurus ist ein Wissensorganisationssystem für das travel!digital Corpus, eine einzigartige Sammlung historischer Baedeker-Reiseführer aus dem Zeitraum von 1875 bis 1914. Digitale Volltexte und Thesaurus entstanden im Rahmen des Projekts travel!digital (Projekt-Nr.: ÖAW0204, 1.12.2014-30.11.2017) am ACDH - Austrian Centre for Digital Humanities der Österreichischen Akademie der Wissenschaften. Der Thesaurus spiegelt ausschließlich den in den Reiseführern enthaltenen Wortschatz wider und übernimmt dort vorhandene Schreibweisen und Übersetzungen. Die Primärsprache ist Deutsch (4908 Einträge), gefolgt von Englisch (177), Arabisch (81), Französisch (52), Spanisch (25) und weiteren Sprachen mit weniger als 25 Einträgen. Neben Gruppenbezeichnungen (u.a. geografisch orientierte Bezeichnungen, ethnisch/nationale, religiöse und soziale Gemeinschaften sowie Berufe) stehen ausgewählte Sehenswürdigkeiten im Mittelpunkt.
has top concept: Natur
subject: Sehenswürdigkeiten
type: core
has top concept: Soziale Gruppenbezeichnungen
has top concept: Unterkunft/Restaurant
has top concept: Geografisch orientierte Bezeichnungen
rights: https://creativecommons.org/licenses/by/4.0/
creator: Ulrike Czeitschner @en
has top concept: Concept01.04
has top concept: Concept02.08
has top concept: Concept01.01
has top concept: Concept02.06
has top concept: Concept02.01
format: application/rdf+xml
subject: historische Reiseführer
subject: historical travel guides @en
description: The travel!digital Thesaurus is a knowledge organization system for the travel!digital Corpus, a unique collection of historical Baedeker travel guides published between 1875 and 1914. The digital full-texts and the thesaurus were created within the travel!digital project (Project-Nr.: ÖAW0204, 1.12.2014-30.11.2017) at the ACDH - Austrian Centre for Digital Humanities of the Austrian Academy of Sciences. Exclusively reflecting the vocabulary contained in the travel guides, the thesaurus uses spellings and translations from there. The primary language is German (4908 entries), followed by English (177), Arabic (81), French (52), Spanish (25) and other languages with less than 25 entries. The focus is on group designations (amongst others geographical oriented designations, ethnic/national, religious and social communities as well as professions) and selected sights. @en
has top concept: Concept02.10
has top concept: Concept01.05
subject: Karl Baedeker
subject: Gruppenbezeichnungen

Inschriften
type: Concept
definition: bdk: Inschriften
notation: II.03
narrower: Inschriftstein
narrower: Schriftfries
narrower: Löwe mit hethitischer Inschrift
top concept of: travel!digital Thesaurus

Inschriftstein
type: Concept
in scheme: travel!digital Thesaurus
pref label: Inschriftstein
definition: bdk: besondere Attraktion

Inschriftstein
type: Label
in scheme: travel!digital Thesaurus

Schriftfries
type: Concept
related match: Frieze
in scheme: travel!digital Thesaurus
pref label: Schriftfries
definition: bdk: besondere Attraktion

Schriftfries
type: Label
in scheme: travel!digital Thesaurus

Löwe mit hethitischer Inschrift
type: Concept
definition: bdk: profane Kunst
in scheme: travel!digital Thesaurus
pref label: Löwe mit hethitischer Inschrift

Löwe mit hethitischer Inschrift
type: Label
in scheme: travel!digital Thesaurus

Sonstiges Sehenswerte
type: Concept
narrower: Eis-Karneval
narrower: John Brown’s Farm
narrower: Königsmumien
narrower: Columbische Weltausstellung
top concept of: travel!digital Thesaurus
notation: II.11
definition: bdk: Sehenswertes, das keiner anderen Kategorie zugeordnet werden kann

Eis-Karneval
type: Concept
pref label: Eis-Karneval
in scheme: travel!digital Thesaurus
definition: bdk: besondere Attraktion

Eis-Karneval
type: Label
in scheme: travel!digital Thesaurus

John Brown’s Farm
type: Concept
pref label: John Brown’s Farm
in scheme: travel!digital Thesaurus
definition: bdk: besondere Attraktion

John Brown’s Farm
type: Label
in scheme: travel!digital Thesaurus

Königsmumien
type: Concept
pref label: Königsmumien
related match: Mummy
in scheme: travel!digital Thesaurus
definition: bdk: besondere Attraktion | Duden: Mumie: durch Austrocknung oder Einbalsamierung vor Verwesung geschützte Leiche | Meyers Großes Konversations-Lexikon 1908: Mumĭen (v. alt franz. mumie, jetzt momie, ital. mummia, pers. mumijâ, v. mûm oder môm, Wachs oder Harz zum Einbalsamieren der Leichen), durch physikalische Verhältnisse oder chemische Zubereitung vor Verwesung geschützte und in ihrer allgemeinen Form erhaltene tierische und menschliche Körper. Natürliche M. entstehen beim Liegen der Leiche in sehr porösem und trocknem Boden, wie besonders in der Sahara (weiße M.) und in der peruanischen Wüste, oder durch einen kalten austrocknenden Luftzug, wie im Bleikeller des Doms zu Bremen oder auf dem Großen St. Bernhard, oder durch mineralische Bestandteile des Bodens (z. B. Kochsalz-, Salpeter- oder Alaungehalt). Neugeborne und magere fastlose Leichen mumifizieren am leichtesten, die M. riechen käseartig und haben pergamentartig harte, graue oder braune Haut, die fest am Knochen haftet. Unter den künstlichen, durch besondere Präparation mit fäulniswidrigen Stoffen erzeugten M. sind die ägyptischen seit alter Zeit berühmt. Der Name stammt von dem arabischen Wort mūmiá, das ursprünglich verschiedene Erdharze (Asphalt u.a.) bezeichnet zu haben scheint und darum auf die von derartigen Harzen erfüllten und durchdrungenen ägyptischen M. übertragen wurde. – Die M. liegen in den ägyptischen Gräbern zum Teil in Sarkophagen oder in Särgen, die nicht selten die äußere Form einer Mumie haben (s. Tafel »Grabmäler«, Fig. 1, und Tafel »Ornamente I«, Fig. 6); namentlich gilt dies von dem innersten Kasten, der oft nur aus einer Art von Pappe gemacht ist; sie sind mit einer außerordentlichen Menge von Binden aus Leinwand fest umwickelt. Manchmal, z. B. in thebanischen Volksgräbern, liegen die M. uneingesargt in Haufen zu Hunderten und Tausenden. Sie sind langgestreckt, mit den Händen über der Brust oder über der Schoßgegend gekreuzt oder mit eng an der Seite liegenden Armen, Frauen zuweil…
related match: Egyptian Museum

Königsmumien
type: Label
in scheme: travel!digital Thesaurus

Columbische Weltausstellung
type: Concept
pref label: Columbische Weltausstellung
in scheme: travel!digital Thesaurus
definition: bdk: besondere Attraktion

Columbische Weltausstellung
type: Label
in scheme: travel!digital Thesaurus

Kunstwerke
type: Concept
top concept of: travel!digital Thesaurus
narrower: Plastiken
narrower: Sonstige Kunstwerke
definition: bdk: Kunstwerke
notation: II.02
narrower: Malerei
narrower: Kunstsammlungen

Plastiken
type: Concept
narrower: kolossale, aus mehreren Stücken gearbeitete Statue des Apollon
narrower: Athena
narrower: Puritaner
narrower: Grabreliefs der saïtischen Zeit
narrower: Sphinx
narrower: Büste König Haremheb’s
narrower: Dâdâ oder Bâî Harîr's Wâv
narrower: Statue Alexanders des Großen
narrower: Marmorkopf
narrower: Relief einer leierspielenden Frau
narrower: Kolossalkopf des Zeus
narrower: Bronzefigur
narrower: Terrakottafigürchen
narrower: Sebîl Abd er-Rahmân’s
narrower: Reiterrelief des Dexileos
narrower: Bronzestatue des Admirals Farragut
narrower: Aphrodite-Torso
narrower: Tonfiguren
narrower: dreieckige Dreifußbasis
narrower: Jünglingsbüste
narrower: Statue des athenischen Redners Äschines
narrower: Büste des Doryphoros
narrower: Hermes Propyläos
narrower: Jünglingsstatue
narrower: Gewandstatue
narrower: obere Hälfte einer Stele mit einem Ehrendekret und einem Kopf (Pan ?) darüber
narrower: archaische Reliefs
narrower: Statue Washingtons
narrower: Eichenholzbüsten Adams
narrower: Tyler-Davidson-Brunnen
narrower: Dionysos
narrower: Ceres
narrower: Schlangensäule
narrower: Herakleskopf in Marmor
narrower: Kolossalfiguren Ramses’ II.
narrower: Holzstatue eines Mannes
definition: bdk: Plastiken, Bildhauerkunst
narrower: Kopf und Oberkörper eines Athleten
narrower: Löwe von Polonnaruwa
narrower: das berühmte Orpheusrelief
narrower: männlicher Kopf
narrower: Marsyas
narrower: Trajansbogen
narrower: der Braumeister Nofer
narrower: sogenannter Eubuleus
narrower: Venustorso
notation: II.02.02
narrower: eleusinisches Relief
narrower: Mädchenfiguren
narrower: Kolossalstatue
narrower: Shaw Monument
narrower: archaische Grabstele
narrower: Reiterstandbild Washingtons
narrower: Heiligenstatuen
narrower: Kalksteinpfeiler
narrower: Fries
narrower: Kybee [Kybele], archaische Skulpturen aus Kyme
narrower: Engel am Grabe von Erastus Dow Palmer
narrower: Marmorbasis
narrower: Bronzeherme
narrower: Särge und Beigaben
narrower: Totenfigur des Wezîrs Ptahmose
narrower: Relief aus Thasos
narrower: Napoleon’s letzte Tage [Vela]
narrower: Statue des guten Hirten
narrower: Löwenkapitäl einer Aschôkasäule
narrower: Apollo
narrower: größte Darstellung des sogenannten thrakischen Reiters
narrower: Triumphbogen
narrower: Schieferstatue Thutmosis’ II.
narrower: Kalksteinstatuen des Prinzen Ra-hotep und seiner Gemahlin Nofret
narrower: Brunnen Achmed’s III.
narrower: Karyatide
narrower: Statue eines Jünglings
narrower: Kopf einer der Schlangen vom delphischen Dreifuß
narrower: Bogen des Septimius Severus
narrower: Straßenbrunnen
narrower: Sandalenlöserin

kolossale, aus mehreren Stücken gearbeitete Statue des Apollon
type: Concept
definition: bdk: sakrale Kunst | Duden: Statue: frei stehende Plastik (1), die einen Menschen oder ein Tier in ganzer Gestalt darstellt | Meyers Großes Konversations-Lexikon 1909: Statŭe (lat. statua, franz. statue, spr. statǖ', Stand bild), die durch die Tätigkeit des bildenden Künstlers in irgendeiner, meist harten Masse dargestellte volle[869] Gestalt, besonders des Menschen. Im Altertum und in der neuern Zeit bis zur Zeit der Renaissance pflegte man statuarische Bildwerke zur Belebung und Verdeutlichung der Formen mehr oder weniger reich zu bemalen, was in unsrer Zeit wieder aufgenommen worden ist (s. Polychromie). Man unterschied schon im griechischen Altertum Idealstatuen, d. h. der Phantasie entsprungene Gestalten (Götter, Heroen etc.), und Porträtstatuen. Die Porträtstatuen kamen erst verhältnismäßig spät durch die Sitte auf, in Olympia Statuen der Sieger in den Wettkämpfen aufzustellen. Doch waren auch diese anfangs ideal, d. h. nicht porträtähnlich, gehalten. Noch später kam dazu das Genrebild, das Personen und Vorgänge aus dem Alltagsleben als Einzelstatuen oder Gruppen darstellt. In der römischen, besonders kaiserlichen, Zeit wurden in großer Menge Porträtstatuen gefertigt. Die moderne Bildhauerkunst versteht unter S. im weitesten Sinne jede plastische Einzelfigur, im engern Sinn ein stehendes Bild. Statuette, Standbildchen. Vgl. Bildhauerkunst und Säule (S. 640). | Quelle: Meyers Großes Konversations-Lexikon, Band 18. Leipzig 1909, S. 869-870. | Permalink: http://www.zeno.org/nid/20007517459
in scheme: travel!digital Thesaurus
pref label: kolossale, aus mehreren Stücken gearbeitete Statue des Apollon
related match: Statue
related match: Apollo

kolossale, aus mehreren Stücken gearbeitete Statue des Apollon
type: Label
in scheme: travel!digital Thesaurus

Athena
type: Concept
definition: bdk: sakrale Kunst | Duden: Athene: Göttin der Weisheit | Meyers Großes Konversations-Lexikon 1905: Athēne (Pallas A. genannt), in der Mythologie der Griechen die ewig jungfräuliche Tochter des Zeus (daher Parthenos, »Jungfrau«), aber ohne eigentliche Mutter, da Zeus nach der verbreitetsten Sage seine von ihm schwangere erste Gemahlin, die Okeanide Metis (»Klugheit«), aus Furcht vor der Geburt eines Sohnes, der mächtiger als er selbst werden könne, verschlungen hatte, worauf zur Zeit aus seinem von Hephästos mit einem Beil gespaltenen Haupte die Göttin in voller Rüstung als Lanzenschwingerin (Pallas) hervorsprang. Eine wie hervorragende Stellung A. von alters her im Volksglauben einnahm, zeigen die Homerischen Gedichte, welche die »hell- oder eulenäugige« (glaukōpis) Tochter als Liebling ihres Vaters schildern und sie bei feierlichen Eiden mit Zeus und Apollon so zusammenstellen, daß die drei Gottheiten als Inbegriff aller göttlichen Macht erscheinen. Ausgenommen Zeus und Apollon, hat sich bei keiner andern Gottheit die ursprüngliche Naturbedeutung so sehr nach der intellektuellen oder ethischen Seite ausgebildet wie bei A. Beide, die ursprüngliche Naturbedeutung wie die ethische Auffassung, zeigen sich am innigsten verbunden in dem Kultus des attischen Landes, dessen Hauptstadt Athen nach ihr benannt und die wichtigste Stätte ihrer Verehrung war. Schon der athenische Landesheros Erechtheus (oder Erichthonios) ist ihr Pflegling, mit ihm zusammen wurde sie in dem nach ihm benannten Erechtheion auf der Akropolis verehrt. Wie Zeus gebietet sie über Blitz und Donner und führt die Ägis mit dem Gorgonenhaupte, das Symbol der himmlischen Schrecken, daher sie auf manchen Kultbildern blitzschleudernd dargestellt war. Als Beschützerin und Förderin des Ackerbaues erscheint sie in einer ganzen Reihe von Sagen und Gebräuchen namentlich des attischen Kultus. Ihre ältesten Priesterinnen, die Kekropstöchter Aglauros, Pandrosos und Herse, sind nur Personifikationen ihrer für das ath…
narrower: Athenastatue
pref label: Athena
in scheme: travel!digital Thesaurus
narrower: Torso einer geflügelten Athena

Athenastatue
type: Concept
definition: bdk: sakrale Kunst | Duden: Statue: frei stehende Plastik (1), die einen Menschen oder ein Tier in ganzer Gestalt darstellt | Meyers Großes Konversations-Lexikon 1909: Statŭe (lat. statua, franz. statue, spr. statǖ', Stand bild), die durch die Tätigkeit des bildenden Künstlers in irgendeiner, meist harten Masse dargestellte volle[869] Gestalt, besonders des Menschen. Im Altertum und in der neuern Zeit bis zur Zeit der Renaissance pflegte man statuarische Bildwerke zur Belebung und Verdeutlichung der Formen mehr oder weniger reich zu bemalen, was in unsrer Zeit wieder aufgenommen worden ist (s. Polychromie). Man unterschied schon im griechischen Altertum Idealstatuen, d. h. der Phantasie entsprungene Gestalten (Götter, Heroen etc.), und Porträtstatuen. Die Porträtstatuen kamen erst verhältnismäßig spät durch die Sitte auf, in Olympia Statuen der Sieger in den Wettkämpfen aufzustellen. Doch waren auch diese anfangs ideal, d. h. nicht porträtähnlich, gehalten. Noch später kam dazu das Genrebild, das Personen und Vorgänge aus dem Alltagsleben als Einzelstatuen oder Gruppen darstellt. In der römischen, besonders kaiserlichen, Zeit wurden in großer Menge Porträtstatuen gefertigt. Die moderne Bildhauerkunst versteht unter S. im weitesten Sinne jede plastische Einzelfigur, im engern Sinn ein stehendes Bild. Statuette, Standbildchen. Vgl. Bildhauerkunst und Säule (S. 640). | Quelle: Meyers Großes Konversations-Lexikon, Band 18. Leipzig 1909, S. 869-870. | Permalink: http://www.zeno.org/nid/20007517459
in scheme: travel!digital Thesaurus
pref label: Athenastatue
related match: Statue
related match: Athena

Athenastatue
type: Label
in scheme: travel!digital Thesaurus

Athena
type: Label
in scheme: travel!digital Thesaurus

Torso einer geflügelten Athena
type: Concept
definition: bdk: sakrale Kunst | Duden: Torso: 1. menschlicher Körper ohne Kopf und Gliedmaßen; Rumpf | 2. (Kunstwissenschaft) (unvollständig erhaltene oder gestaltete) Statue mit fehlenden Gliedmaßen [und fehlendem Kopf] | Meyers Großes Konversations-Lexikon 1909: Torso (ital., »Strunk«), in der Kunstsprache der Rumpf einer Bildsäule, der Kopf, Arme und Beine fehlen. Berühmt ist der im Belvedere des Vatikans aufgestellte T. des Herakles (»T. vom Belvedere«, Abbildung s. Herakles, S. 186), der unter Papst Clemens VII. aus dem Besitze der Colonna in den Vatikan kam, ein Werk des Bildhauers Apollonios (s. d. 4). Von hervorragender Bedeutung ist auch der T. des sogen. Ilioneus, des jüngsten Sohnes der Niobe, in der Münchener Glyptothek (vgl. Niobe). | Quelle: Meyers Großes Konversations-Lexikon, Band 19. Leipzig 1909, S. 629. | Permalink: http://www.zeno.org/nid/20007594666
pref label: Torso einer geflügelten Athena
in scheme: travel!digital Thesaurus
related match: Athena

Torso einer geflügelten Athena
type: Label
in scheme: travel!digital Thesaurus

Puritaner
type: Concept
related: Christentum
in scheme: travel!digital Thesaurus
pref label: Puritaner
definition: bdk: sakrale Kunst
related match: Statue
related match: Puritans

Christentum
type: Concept
pref label: Christentum
narrower: Mormonentum
preferred label: christianity @en
in scheme: travel!digital Thesaurus
definition: Duden: 1. auf Jesus Christus, sein Leben und seine Lehre gegründete Religion | 2. individueller christlicher Glaube | Meyers Großes Konversations-Lexikon 1906: Christentum, die von Jesus von Nazareth als dem »Christ«, d. h. Messias (s.d.), gestiftete Religion (die christliche Religion), im weitern Sinn die ganze geschichtbildende Macht, die sich in jenem Namen verkörpert hat, mit der Summe ihrer innern Antriebe und äußern gesellschaftlichen Wirkungen, mit der Gedankenwelt, die sie herausgeführt, und mit allen neuen Ordnungen und Sitten des Völker- u. Menschheitslebens in ihrem Gefolge. Unklarheiten und Mißverständnisse, die aus der Einmischung religiöser Interessen mit Notwendigkeit sich ergeben mußten, haben einen erbitterten Kampf darüber hervorgerufen, ob das C. als ein »neuer Anfang« zu betrachten, d. h. übernatürliche Eigenschaften von seinem Stifter auszusagen, übernatürliche Wirkungen an sein Auftreten zu knüpfen seien, oder ob es in der Gesamtentwickelung des religiösen Geistes zwar einen Glanz- und Höhepunkt darstelle, der aber seine geschichtliche Bedingtheit in den vorausgegangenen Stadien des Gottesbewußtseins mehr oder weniger erkennen lasse. Jedenfalls ist das C. zunächst aus dem alttestamentlichen Gottesglauben herausgewachsen, dessen Vollendung es darstellt. Das Volk Israel als das eigentliche Religionsvolk der alten Welt hatte den Glauben an den einen Gott im Verlauf des prophetischen Zeitalters sittlich vertieft und vergeistigt und den Dienst des »Heiligen in Israel« immer bewußter in Reinigung des Herzens und Lebens gesetzt. Freilich stellt das gesetzlich verfestigte Judentum der nachexilischen und neutestamentlichen Zeit mit seinem pharisäischen Äußerlichkeitsgeist einen auffallenden Rückschritt gegenüber den prophetischen Errungenschaften dar. Eine um so unmittelbarere Fortsetzung und Vollendung fanden die letztern dort, wo der eigentliche Erklärungsgrund für die ganze Lebensfülle und schöpferische Kraft liegt, die das C. offenbarte, im Selbstbe…
pref label: christianity

Christentum
type: Label
hasTranslation: christianity
in scheme: travel!digital Thesaurus

christianity
type: Label
isTranslationOf: Christentum
in scheme: travel!digital Thesaurus

Mormonentum
type: Concept
pref label: Mormonentum
in scheme: travel!digital Thesaurus
definition: Duden: Glaube der Mormonen | Meyers Großes Konversations-Lexikon 1908: Mormōnen (Latter-Day Saints, Heilige der letzten Tage), religiöse Sekte in Nordamerika, gestiftet von Joe Smith, geb. 23. Dez. 1805 zu Sharon im Staate Vermont. Smith grub 1823 auf eine Engelserscheinung hin im Hügel Cumora bei Palmyra in County New York nach »heiligen goldenen Tafeln«, die er unter Leitung des Engels 22. Sept. d. J. fand, aber nach dessen Bestimmung erst 22. Sept. 1827 heben durfte. Sie waren in »neuformiertem Ägyptisch« geschrieben; in der Kiste lag eine Wunderbrille (Urim und Thummim) mit durchsichtigen Steinen statt Gläsern, die den des Lesens unkundigen Smith die geheimnisvollen Zeilen zu lesen befähigte, ihm auch die Zukunft enträtselte. Im J. 1830 gab Smith die gedruckte englische Übersetzung der Platten unter dem Titel: »The book of Mormon« (deutsch, neueste Aufl. Berl. 1902; übersetzt in 13 Sprachen) heraus. Das Buch erzählt in einer der biblischen nachgebildeten Sprache, wie zur Zeit des Königs Zedekia von Jerusalem ein frommer Israelit, Lehi, samt seiner Familie von Palästina nach Amerika[152] auswanderte und hier seine wunderbaren Reiseabenteuer sowie die Offenbarungen, die ihm Gott hinsichtlich der Zukunft mitteilte, auf Goldplatten auszeichnete. Mehrere seiner Söhne, vor allem Laman, gingen in die Wildnis und wurden die Stammväter und Häuptlinge der Rothäute. Die Nachkommen seines Sohnes Nephi aber waren schon mehrere Jahrhunderte vor Christus gute Christen, in deren Mitte die Priesterwürde und die Goldplatten forterbten. Dieser Familie erschien dann auch der auferstandene Christus und wählte aus ihr zwölf Apostel, die in kurzem das ganze Land zum Christentum bekehrten. Als zu Anfang des 4. Jahrh. die Kirche infolge von Spaltung und Kriegen zerfallen war, erschien Mormon (der Name wird von den M. als »mehr gut« erklärt), ein gewaltiger Kriegsheld und ein frommer Christ, und vertrieb die damals rot gewordenen und der Barbarei verfallenen Lamaniten; doch kehrten diese…

Mormonentum
type: Label
in scheme: travel!digital Thesaurus

Puritaner
type: Label
in scheme: travel!digital Thesaurus

Grabreliefs der saïtischen Zeit
type: Concept
definition: bdk: sakrale Kunst | Duden: Relief: (bildende Kunst) aus einer Fläche (aus Stein, Metall o. Ä.) erhaben herausgearbeitetes oder in sie vertieftes Bildwerk | Meyers Großes Konversations-Lexikon 1908: Relief (franz., spr. rölheff, ital. riliēvo), erhabene Arbeit, diejenige Gattung der Bildnerei, welche die Figuren aus einer Ebene oder vertieften Fläche, dem Grunde, erhaben heraustreten läßt. Das R. bildet eine Mittelgattung zwischen der eigentlichen Skulptur, von der sie die Darstellungsweise, und der Malerei, von der sie die Anordnung hat, so zwar, daß das plastische Prinzip mehr in den einfachen, ruhigen Reliefs der ältern griechischen Kunst, das malerische dagegen in den überfüllten, oft heftig bewegten der spätern römischen Kunst vorherrscht. Man unterscheidet das Flachrelief (Basrelief, basso rilievo), bei dem die Figuren nur wenig über den Grund heraustreten, von dem Hochrelief (Hautrelief, alto rilievo), bei dem sie etwa halbrund modelliert sind. Sind einzelne Teile rundplastisch herausgearbeitet oder unterschnitten, so spricht man von hocherhabener Arbeit. Reliefs sind schon in der altägyptischen und assyrischen Kunst sehr häufig. Bei den Ägyptern findet man neben dem Basrelief das Hohlrelief (R.en creux, Koilanaglyph, s. d. und Tafel »Bildhauerkunst I«, Fig. 8 u. 9; II, Fig. 3–5). Zu hoher Vollendung wurde das R. von den Griechen gebracht, die das Hochrelief vor allem bei den Metopen und Friesen der Tempel, das Flachrelief zur Ausschmükkung der Grabstelen etc. verwendeten. In der Blütezeit rollte man die Darstellung im wesentlichen auf, ohne jedoch Überschneidungen ängstlich zu vermeiden, wie denn auch die zur Raumfüllung nötige Isokephalie (gleiche Höhe der Köpfe) nicht pedantisch gehandhabt wurde (s. Tafel »Bildhauerkunst III«, Fig. 7 u. 9; IV, Fig. 4). Streng durchgeführt aber ist die Anordnung der Figuren auf einem Grunde. Durchaus malerisch gestaltet sind dagegen die hellenistischen Reliefs, die mit ihren landschaftlichen Hintergründen etc. als reine Übe…
in scheme: travel!digital Thesaurus
pref label: Grabreliefs der saïtischen Zeit
related match: Relief

Grabreliefs der saïtischen Zeit
type: Label
in scheme: travel!digital Thesaurus

Sphinx
type: Concept
definition: bdk: sakrale Kunst | Duden: Ungeheuer in Gestalt eines geflügelten Löwen mit Frauenkopf, das jeden Vorüberkommenden verschlingt, der sein ihm aufgegebenes Rätsel nicht lösen kann | Meyers Großes Konversations-Lexikon 1909: Sphinx, Name von Steinbildern in Löwengestalt mit Menschenkopf, stehend oder auf einem Sockel liegend, die Vorderbeine vorwärts gestreckt, die Hinterbeine untergeschlagen. Das Fabeltier des (männlichen) S. ist wohl in Ägypten heimisch, wo es als Verkörperung der königlichen Macht galt, und wo man es daher auch liebte, die Könige in der Gestalt eines S. darzustellen; man verlieh dann dem menschlichen Kopfe die Porträtzüge des Herrschers. Der S. trägt demgemäß auch das dem Könige eigentümliche gefältelte Kopftuch und an der Stirn sein Abzeichen, die Uräusschlange. Auch Sphinxe in Gestalt von Löwen mit Sperberköpfen kommen als Verkörperungen des Königs in Ägypten vor. Am berühmtesten ist der bei den Pyramiden von Gizeh gelegene S., der aus dem Felsen gehauen ist und eine Hohe von 20 m bei einer Länge von 57 m besitzt (s. Tafel »Architektur I«, Fig. 1); er stammt vielleicht noch aus vorgeschichtlicher Zeit und ist das älteste Denkmal auf dem Totenfelde von Memphis; neuerdings hat man ihn auch für ein Bild des Königs Amenemhet III. aus der 12. Dynastie gehalten; die Ägypter der spätern Zeit halten ihn für ein Bild des »im Horizont befindlichen« Sonnengottes Horos, des Harmachis (s. Horos). Wiederholt ist der S. von Gizeh aus dem Wüstensand ausgegraben worden, zuletzt 1886 durch Maspero. Bei vielen Tempeln führten Alleen von Sphinxen zu dem Eingangsgebäude. Auch in der assyrischen Kunst findet sich der S. als Hüter des Tempeleingangs (Palast zu Nimrud und Portal von Chorsabad). – Mannigfaltiger nach Gestalt und Bedeutung erscheinen die Sphinxe in Griechenland, wo sie immer als weibliche Gestalten aufgefaßt werden. | Ursprünglich ein geflügelter Löwenkörper mit Kopf und Brust einer Jungfrau (s. Abbildung), wurden sie später von Dichtern und Künstlern in …
pref label: Sphinx
in scheme: travel!digital Thesaurus

Sphinx
type: Label
in scheme: travel!digital Thesaurus

Büste König Haremheb’s
type: Concept
definition: bdk: sakrale Kunst | Duden: 1. Büste: plastische Darstellung eines Menschen in Halbfigur oder nur bis zur Schulter | Meyers Großes Konversations-Lexikon 1905: Büste (ital. Busto, »Brustbild«), plastisches Kunstwerk in vollrunder Arbeit, das einen menschlichen Kopf mit einem Teil der Brust (daher der Name) darstellt, unmittelbar auf einer runden, vier- oder mehreckigen Basis ruht, wodurch es sich von der Herme unterscheidet,[657] und aus Marmor, Gips, Metall, Holz, Ton, Wachs oder einer andern bildsamen Masse verfertigt ist. Die Kunstform der B. tritt in römischer Zeit an Stelle der in der griechischen Kunst allein üblich gewesenen Herme (s.d.). Damals schon kam als seltenere Abart die B. mit ganzem, auf einen runden Fuß gesetztem Oberkörper auf, eine Form, die die Florentiner Plastik im 15. Jahrh. mit und ohne Verwendung des Fußes wieder aufnahm. Man kann Porträt- und Idealbüsten unterscheiden. Während die erstern das Brustbild einer bestimmten Person geben, sind die letztern vom Künstler erfundene individuelle Bildungen idealen Charakters. Auch bei ihnen pflegt der Künstler wirklich existierende Personen als Modelle zu gebrauchen, denen er einen seiner Idee entsprechenden Ausdruck gibt. Bedeutendes haben in der Schöpfung von Büsten namentlich die Römer geleistet, die bereits in der Form des Fußes und seiner Verbindung mit dem Bruststück große Mannigfaltigkeit erreicht haben. Die Ahnenbilder der Römer (imagines) hatten nicht Büstenform, sondern waren aus Wachs über dem Leben geformte Masken (cerae). Die Benennung der uns zahlreich überkommenen Büsten wieder Porträte überhaupt bildet als Ikonographie einen Teil der Altertumswissenschaft. Vgl. Gurlitt, Versuch über die Büstenkunde (Magdeb. 1800); Visconti, Iconographie grecque (2. Aufl., Par. 1811, 3 Bde.) und Iconographie romaine (2. Aufl., das. 1817–33, 4 Bde.); Bernoulli, Römische Ikonographie (Stuttg. 1882–94, 4 Bde.). In Bezug auf die Mannigfaltigkeit der Büstenabschlüsse wurden die Römer durch die Künstler der B…
in scheme: travel!digital Thesaurus
pref label: Büste König Haremheb’s
related match: Horemheb

Büste König Haremheb’s
type: Label
in scheme: travel!digital Thesaurus

Dâdâ oder Bâî Harîr's Wâv
type: Concept
related match: Water well
definition: bdk: profane Kunst
in scheme: travel!digital Thesaurus
pref label: Dâdâ oder Bâî Harîr's Wâv

Dâdâ oder Bâî Harîr's Wâv
type: Label
in scheme: travel!digital Thesaurus

Statue Alexanders des Großen
type: Concept
definition: bdk: profane Kunst | Duden: Statue: frei stehende Plastik (1), die einen Menschen oder ein Tier in ganzer Gestalt darstellt | Meyers Großes Konversations-Lexikon 1909: Statŭe (lat. statua, franz. statue, spr. statǖ', Stand bild), die durch die Tätigkeit des bildenden Künstlers in irgendeiner, meist harten Masse dargestellte volle[869] Gestalt, besonders des Menschen. Im Altertum und in der neuern Zeit bis zur Zeit der Renaissance pflegte man statuarische Bildwerke zur Belebung und Verdeutlichung der Formen mehr oder weniger reich zu bemalen, was in unsrer Zeit wieder aufgenommen worden ist (s. Polychromie). Man unterschied schon im griechischen Altertum Idealstatuen, d. h. der Phantasie entsprungene Gestalten (Götter, Heroen etc.), und Porträtstatuen. Die Porträtstatuen kamen erst verhältnismäßig spät durch die Sitte auf, in Olympia Statuen der Sieger in den Wettkämpfen aufzustellen. Doch waren auch diese anfangs ideal, d. h. nicht porträtähnlich, gehalten. Noch später kam dazu das Genrebild, das Personen und Vorgänge aus dem Alltagsleben als Einzelstatuen oder Gruppen darstellt. In der römischen, besonders kaiserlichen, Zeit wurden in großer Menge Porträtstatuen gefertigt. Die moderne Bildhauerkunst versteht unter S. im weitesten Sinne jede plastische Einzelfigur, im engern Sinn ein stehendes Bild. Statuette, Standbildchen. Vgl. Bildhauerkunst und Säule (S. 640). | Quelle: Meyers Großes Konversations-Lexikon, Band 18. Leipzig 1909, S. 869-870. | Permalink: http://www.zeno.org/nid/20007517459
in scheme: travel!digital Thesaurus
pref label: Statue Alexanders des Großen
related match: Alexander the Great
related match: Statue

Statue Alexanders des Großen
type: Label
in scheme: travel!digital Thesaurus

Marmorkopf
type: Concept
definition: bdk: profane Kunst | Duden: Marmor: weißes oder farbiges, häufig geädertes, sehr hartes Kalkgestein, das besonders in der Bildhauerei und als Baumaterial verwendet wird | Meyers Großes Konversations-Lexikon 1908: Marmor (Marmelstein, Urkalkstein zum Teil, körniger Kalkstein), kristallinisch-körniges Aggregat von Kalkspat (kohlensaurer Kalk), grob- bis feinkörnig (zuckerartig) und dicht, Härte 3, durchscheinend bis kantendurchscheinend, weiß in allen Nuancen, grau, rot und schwarz, seltener gelb, blau, bald einfarbig, bald bunt, flammig, geädert, wolkig und fleckig, daher der Ausdruck marmoriert. Häufig enthält der M. akzessorische Bestandteile, wie Glimmer, Talk, Chlorit, Serpentin, Graphit, Granat, Vesuvian, Apatit, Spinell, Magneteisen, Eisenkies, Augit, Hornblende, Quarz, Korund, Zirkon, Turmalin etc. Während der Mineralog nur diejenigen Gesteine als M. bezeichnet, die eine kristallinische körnige Struktur besitzen und wesentlich aus kohlensaurem Kalk bestehen, vielleicht auch in geringer Menge noch kohlensaure Magnesia enthalten (alsdann Übergänge in den Dolomit bildend, Dolomitmarmor), werden in der Technik alle Kalksteine, die schön gefärbt sind und wegen ihres dichten Gefüges, ihrer Festigkeit, beim Schleifen eine schöne Politur annehmen, mit dem Namen M. belegt, zuweilen sogar solche Gesteine, die gar keinen kohlensauren Kalk oder solchen nur in verschwindend kleiner Menge enthalten. Sehen wir von den letztern, welche die Bezeichnung M. nicht verdienen, ab, so ergibt sich, daß der M., bisweilen deutlich geschichtet und in der Regel unregelmäßig zerklüftet, besonders häufig als Einlagerung im kristallinischen Grundgebirge vorkommt. Er bildet hier Lager und Stöcke von unregelmäßiger Gestalt, die sich bisweilen gangartig in das umschließende Gestein fortsetzen (so in Schlesien, in Sachsen, im Fichtelgebirge, bei Auerbach an der Bergstraße etc.). Außerdem findet sich M. im Silur (Schlesien, Erzgebirge, Insel Gotland), Devon (Nassau, Westfalen, Harz), Karbon (Bel…
in scheme: travel!digital Thesaurus
pref label: Marmorkopf
related match: Marble

Marmorkopf
type: Label
in scheme: travel!digital Thesaurus

Relief einer leierspielenden Frau
type: Concept
definition: bdk: profane Kunst | Duden: Relief: (bildende Kunst) aus einer Fläche (aus Stein, Metall o. Ä.) erhaben herausgearbeitetes oder in sie vertieftes Bildwerk | Meyers Großes Konversations-Lexikon 1908: Relief (franz., spr. rölheff, ital. riliēvo), erhabene Arbeit, diejenige Gattung der Bildnerei, welche die Figuren aus einer Ebene oder vertieften Fläche, dem Grunde, erhaben heraustreten läßt. Das R. bildet eine Mittelgattung zwischen der eigentlichen Skulptur, von der sie die Darstellungsweise, und der Malerei, von der sie die Anordnung hat, so zwar, daß das plastische Prinzip mehr in den einfachen, ruhigen Reliefs der ältern griechischen Kunst, das malerische dagegen in den überfüllten, oft heftig bewegten der spätern römischen Kunst vorherrscht. Man unterscheidet das Flachrelief (Basrelief, basso rilievo), bei dem die Figuren nur wenig über den Grund heraustreten, von dem Hochrelief (Hautrelief, alto rilievo), bei dem sie etwa halbrund modelliert sind. Sind einzelne Teile rundplastisch herausgearbeitet oder unterschnitten, so spricht man von hocherhabener Arbeit. Reliefs sind schon in der altägyptischen und assyrischen Kunst sehr häufig. Bei den Ägyptern findet man neben dem Basrelief das Hohlrelief (R.en creux, Koilanaglyph, s. d. und Tafel »Bildhauerkunst I«, Fig. 8 u. 9; II, Fig. 3–5). Zu hoher Vollendung wurde das R. von den Griechen gebracht, die das Hochrelief vor allem bei den Metopen und Friesen der Tempel, das Flachrelief zur Ausschmükkung der Grabstelen etc. verwendeten. In der Blütezeit rollte man die Darstellung im wesentlichen auf, ohne jedoch Überschneidungen ängstlich zu vermeiden, wie denn auch die zur Raumfüllung nötige Isokephalie (gleiche Höhe der Köpfe) nicht pedantisch gehandhabt wurde (s. Tafel »Bildhauerkunst III«, Fig. 7 u. 9; IV, Fig. 4). Streng durchgeführt aber ist die Anordnung der Figuren auf einem Grunde. Durchaus malerisch gestaltet sind dagegen die hellenistischen Reliefs, die mit ihren landschaftlichen Hintergründen etc. als reine Übe…
in scheme: travel!digital Thesaurus
pref label: Relief einer leierspielenden Frau
related match: Relief

Relief einer leierspielenden Frau
type: Label
in scheme: travel!digital Thesaurus

Kolossalkopf des Zeus
type: Concept
definition: bdk: sakrale Kunst
in scheme: travel!digital Thesaurus
pref label: Kolossalkopf des Zeus
related match: Zeus

Kolossalkopf des Zeus
type: Label
in scheme: travel!digital Thesaurus

Bronzefigur
type: Concept
definition: bdk: profane Kunst
in scheme: travel!digital Thesaurus
pref label: Bronzefigur
related match: Bronze

Bronzefigur
type: Label
in scheme: travel!digital Thesaurus

Terrakottafigürchen
type: Concept
related match: Terracotta
definition: bdk: profane Kunst | Duden: Terrakotta: <ohne Plural> ohne Glasur gebrannter Ton, der beim Brennen eine weiße, gelbe, braune oder rote Färbung annimmt | Meyers Großes Konversations-Lexikon 1909: Terrakotta (v. ital. terra cotta, »gebrannte Erde«, hierzu die Tafeln »Terrakotten I-III«), jedes künstlerisch ausgestaltete Produkt der Töpfer und Tonbildner wie der Bildhauer überhaupt, die sich mit Kleinplastik beschäftigen. In den alten Kulturländern Ägypten und Mesopotamien blühte schon früher die Herstellung bemalter und glasierter Tonwaren. Aus Babylonien und Persien kennen wir aus glasierten Ziegeln zusammengesetzte, figurengeschmückte Wandverkleidungen. In Griechenland wurde die eigentliche Tontechnik aufs höchste verfeinert. Die Keramik arbeitete teils im Dienste der Architektur, teils schuf sie selbständige Gebilde: Gefäße oder Figuren der verschiedensten Größe, Gestalt und Bestimmung. Kastenartige, bunt bemalte und hart gebrannte Tonplatten wurden im 7. und 6. Jahrh. v. Chr. zur Verkleidung der hölzernen und auch der steinernen Gesimsbalken an Tempeln, Schatzhäusern etc. verwendet. Auch die Stirnziegel, die Traufrinne mit den Wasserspeiern, der Firstschmuck wurden aus Ton hergestellt. Schöne Beispiele kennen wir z. B. aus Olympia und Selinus (Tafel I, Fig. 1 u. 2; vgl. die Schrift von Dörpfeld u. a.: »Über die Verwendung von Terrakotten am Geison und Dach griechischer Bauwerke«, Berl. 1881). Eine hervorragende Rolle spielte, nach griechischen Vorbildern, der Terrakottaschmuck in der archaischen etruskischen Baukunst. Schöne Beispiele aus dem Besitze des Berliner Museums geben Fig. 3–5. Zur Zeit der freien Kunst sah Italien, besonders wieder Etrurien, aber auch Unteritalien, eine Blüte der großen Tonplastik, wie in der Renaissance durch die Tätigkeit der Robbia (s. Keramik). Der ganze Figurenschmuck der Giebelfelder etruskischer Tempel wurde aus Ton hergestellt. Auch in römischer Zeit blieb diese Technik auf der Höhe. Zahlreich erhalten sind uns die zur Verkleidun…
pref label: Terrakottafigürchen
in scheme: travel!digital Thesaurus

Terrakottafigürchen
type: Label
in scheme: travel!digital Thesaurus

Sebîl Abd er-Rahmân’s
type: Concept
definition: bdk: profane Kunst | Meyers Großes Konversations-Lexikon 1909: Sebîl (arab., eigentl. ssebîl allâh, »Weg Gottes«), ursprünglich gleichbedeutend mit »Dschihâd« (s. d.), später in islamischen Ländern auf jede fromme, gottgefällige Handlung, wie z. B. das Spenden frischen Wassers, bezogen. Daher heißen so in der Türkei die meist zu einer Moschee oder zu einem Grabmal gehörigen öffentlichen Brunnen. | Quelle: Meyers Großes Konversations-Lexikon, Band 18. Leipzig 1909, S. 236. | Permalink: http://www.zeno.org/nid/20007453221
related match: Abd al-Rahman I
related match: Sebil (fountain)
related match: Abd-ar-Rahman III
in scheme: travel!digital Thesaurus
pref label: Sebîl Abd er-Rahmân’s

Sebîl Abd er-Rahmân’s
type: Label
in scheme: travel!digital Thesaurus

Reiterrelief des Dexileos
type: Concept
definition: bdk: profane Kunst | Duden: Relief: (bildende Kunst) aus einer Fläche (aus Stein, Metall o. Ä.) erhaben herausgearbeitetes oder in sie vertieftes Bildwerk | Meyers Großes Konversations-Lexikon 1908: Relief (franz., spr. rölheff, ital. riliēvo), erhabene Arbeit, diejenige Gattung der Bildnerei, welche die Figuren aus einer Ebene oder vertieften Fläche, dem Grunde, erhaben heraustreten läßt. Das R. bildet eine Mittelgattung zwischen der eigentlichen Skulptur, von der sie die Darstellungsweise, und der Malerei, von der sie die Anordnung hat, so zwar, daß das plastische Prinzip mehr in den einfachen, ruhigen Reliefs der ältern griechischen Kunst, das malerische dagegen in den überfüllten, oft heftig bewegten der spätern römischen Kunst vorherrscht. Man unterscheidet das Flachrelief (Basrelief, basso rilievo), bei dem die Figuren nur wenig über den Grund heraustreten, von dem Hochrelief (Hautrelief, alto rilievo), bei dem sie etwa halbrund modelliert sind. Sind einzelne Teile rundplastisch herausgearbeitet oder unterschnitten, so spricht man von hocherhabener Arbeit. Reliefs sind schon in der altägyptischen und assyrischen Kunst sehr häufig. Bei den Ägyptern findet man neben dem Basrelief das Hohlrelief (R.en creux, Koilanaglyph, s. d. und Tafel »Bildhauerkunst I«, Fig. 8 u. 9; II, Fig. 3–5). Zu hoher Vollendung wurde das R. von den Griechen gebracht, die das Hochrelief vor allem bei den Metopen und Friesen der Tempel, das Flachrelief zur Ausschmükkung der Grabstelen etc. verwendeten. In der Blütezeit rollte man die Darstellung im wesentlichen auf, ohne jedoch Überschneidungen ängstlich zu vermeiden, wie denn auch die zur Raumfüllung nötige Isokephalie (gleiche Höhe der Köpfe) nicht pedantisch gehandhabt wurde (s. Tafel »Bildhauerkunst III«, Fig. 7 u. 9; IV, Fig. 4). Streng durchgeführt aber ist die Anordnung der Figuren auf einem Grunde. Durchaus malerisch gestaltet sind dagegen die hellenistischen Reliefs, die mit ihren landschaftlichen Hintergründen etc. als reine Übe…
related match: Kerameikos
in scheme: travel!digital Thesaurus
pref label: Reiterrelief des Dexileos
related match: Relief

Reiterrelief des Dexileos
type: Label
in scheme: travel!digital Thesaurus

Bronzestatue des Admirals Farragut
type: Concept
related match: Statue
definition: bdk: profane Kunst | Duden: Statue: frei stehende Plastik (1), die einen Menschen oder ein Tier in ganzer Gestalt darstellt | Meyers Großes Konversations-Lexikon 1909: Statŭe (lat. statua, franz. statue, spr. statǖ', Stand bild), die durch die Tätigkeit des bildenden Künstlers in irgendeiner, meist harten Masse dargestellte volle[869] Gestalt, besonders des Menschen. Im Altertum und in der neuern Zeit bis zur Zeit der Renaissance pflegte man statuarische Bildwerke zur Belebung und Verdeutlichung der Formen mehr oder weniger reich zu bemalen, was in unsrer Zeit wieder aufgenommen worden ist (s. Polychromie). Man unterschied schon im griechischen Altertum Idealstatuen, d. h. der Phantasie entsprungene Gestalten (Götter, Heroen etc.), und Porträtstatuen. Die Porträtstatuen kamen erst verhältnismäßig spät durch die Sitte auf, in Olympia Statuen der Sieger in den Wettkämpfen aufzustellen. Doch waren auch diese anfangs ideal, d. h. nicht porträtähnlich, gehalten. Noch später kam dazu das Genrebild, das Personen und Vorgänge aus dem Alltagsleben als Einzelstatuen oder Gruppen darstellt. In der römischen, besonders kaiserlichen, Zeit wurden in großer Menge Porträtstatuen gefertigt. Die moderne Bildhauerkunst versteht unter S. im weitesten Sinne jede plastische Einzelfigur, im engern Sinn ein stehendes Bild. Statuette, Standbildchen. Vgl. Bildhauerkunst und Säule (S. 640). | Quelle: Meyers Großes Konversations-Lexikon, Band 18. Leipzig 1909, S. 869-870. | Permalink: http://www.zeno.org/nid/20007517459
related match: Bronze
related match: David Farragut
pref label: Bronzestatue des Admirals Farragut
in scheme: travel!digital Thesaurus

Bronzestatue des Admirals Farragut
type: Label
in scheme: travel!digital Thesaurus

Aphrodite-Torso
type: Concept
definition: bdk: sakrale Kunst | Duden: Torso: 1. menschlicher Körper ohne Kopf und Gliedmaßen; Rumpf | 2. (Kunstwissenschaft) (unvollständig erhaltene oder gestaltete) Statue mit fehlenden Gliedmaßen [und fehlendem Kopf] | Meyers Großes Konversations-Lexikon 1909: Torso (ital., »Strunk«), in der Kunstsprache der Rumpf einer Bildsäule, der Kopf, Arme und Beine fehlen. Berühmt ist der im Belvedere des Vatikans aufgestellte T. des Herakles (»T. vom Belvedere«, Abbildung s. Herakles, S. 186), der unter Papst Clemens VII. aus dem Besitze der Colonna in den Vatikan kam, ein Werk des Bildhauers Apollonios (s. d. 4). Von hervorragender Bedeutung ist auch der T. des sogen. Ilioneus, des jüngsten Sohnes der Niobe, in der Münchener Glyptothek (vgl. Niobe). | Quelle: Meyers Großes Konversations-Lexikon, Band 19. Leipzig 1909, S. 629. | Permalink: http://www.zeno.org/nid/20007594666
in scheme: travel!digital Thesaurus
pref label: Aphrodite-Torso
related match: Aphrodite

Aphrodite-Torso
type: Label
in scheme: travel!digital Thesaurus

Tonfiguren
type: Concept
related match: Clay
definition: bdk: sakrale Kunst | Duden: Ton: besonders zur Herstellung von Töpferwaren verwendetes lockeres, feinkörniges Sediment von gelblicher bis grauer Farbe | Meyers Großes Konversations-Lexikon 1909: Ton (Pelit), in seinen reinsten Varietäten (Kaolin, Porzellanerde) ein wasserhaltiges Aluminiumsilikat von bestimmter Zusammensetzung, in der Regel aber als Verwitterungsprodukt von Gesteinen, die Feldspat oder andre leicht in Kaolin sich umwandelnde Silikate in größerer Menge enthalten, gemengt mit den sonstigen Zersetzungsprodukten der betreffenden Gesteine, am häufigsten mit Karbonaten (und dann dem Mergel [s. d.] sich nähernd) von Calcium, Magnesium und Eisen, die sich durch Aufbrausen mit Säure verraten, ferner mit Eisenoxyd, Eisenhydroxyd,[603] gröberm oder feinerm Quarzsand, Glimmerschüppchen, kohligen Substanzen etc. Als Beispiel der chemischen Zusammensetzung mögen folgende Analysen dienen: | In trockenem Zustand sind die Tone sein- oder groberdig und zerreiblich, im feuchten Zustand in verschiedenem Grade geschmeidig und plastisch. Beim Anhauchen geben sie einen eigentümlichen Geruch (Tongeruch). Nach dem Gefühl beim Angreifen spricht man von fetten und magern Tonen; die letztern sind die unreinern. Die Tone saugen begierig Wasser ein, manche bis 70 Proz.; auch Fetten, Ölen und Salzlösungen gegenüber besitzen sie eine starke Absorptionskraft. Das aufgenommene Wasser entweicht beim Erwärmen, wobei die Tone stark schwinden und bersten (die magern Tone weniger als die fetten); beim Glühen werden sie hart, klingend, verlieren ihre Plastizität und verglasen und schmelzen je nach der Natur der Beimengungen bei verschieden hoher Temperatur. Reines Kaolin (Porzellanerde) ist nicht schmelzbar, sondern sintert nur bei hoher Temperatur zusammen; von den Verunreinigungen des Kaolins scheint besonders Magnesia die Feuerbeständigkeit abzuschwächen, weniger Kalk, noch weniger Eisenoxyd und Kali. Selten sind die Tone rein weiß, gewöhnlich grau, bräunlich, rötlich, grünlich, bläuli…
in scheme: travel!digital Thesaurus
pref label: Tonfiguren

Tonfiguren
type: Label
in scheme: travel!digital Thesaurus

dreieckige Dreifußbasis
type: Concept
related match: Sacrificial tripod
definition: bdk: sakrale Kunst
pref label: dreieckige Dreifußbasis
in scheme: travel!digital Thesaurus

dreieckige Dreifußbasis
type: Label
in scheme: travel!digital Thesaurus

Jünglingsbüste
type: Concept
definition: bdk: profane Kunst | Duden: 1. Büste: plastische Darstellung eines Menschen in Halbfigur oder nur bis zur Schulter | Meyers Großes Konversations-Lexikon 1905: Büste (ital. Busto, »Brustbild«), plastisches Kunstwerk in vollrunder Arbeit, das einen menschlichen Kopf mit einem Teil der Brust (daher der Name) darstellt, unmittelbar auf einer runden, vier- oder mehreckigen Basis ruht, wodurch es sich von der Herme unterscheidet,[657] und aus Marmor, Gips, Metall, Holz, Ton, Wachs oder einer andern bildsamen Masse verfertigt ist. Die Kunstform der B. tritt in römischer Zeit an Stelle der in der griechischen Kunst allein üblich gewesenen Herme (s.d.). Damals schon kam als seltenere Abart die B. mit ganzem, auf einen runden Fuß gesetztem Oberkörper auf, eine Form, die die Florentiner Plastik im 15. Jahrh. mit und ohne Verwendung des Fußes wieder aufnahm. Man kann Porträt- und Idealbüsten unterscheiden. Während die erstern das Brustbild einer bestimmten Person geben, sind die letztern vom Künstler erfundene individuelle Bildungen idealen Charakters. Auch bei ihnen pflegt der Künstler wirklich existierende Personen als Modelle zu gebrauchen, denen er einen seiner Idee entsprechenden Ausdruck gibt. Bedeutendes haben in der Schöpfung von Büsten namentlich die Römer geleistet, die bereits in der Form des Fußes und seiner Verbindung mit dem Bruststück große Mannigfaltigkeit erreicht haben. Die Ahnenbilder der Römer (imagines) hatten nicht Büstenform, sondern waren aus Wachs über dem Leben geformte Masken (cerae). Die Benennung der uns zahlreich überkommenen Büsten wieder Porträte überhaupt bildet als Ikonographie einen Teil der Altertumswissenschaft. Vgl. Gurlitt, Versuch über die Büstenkunde (Magdeb. 1800); Visconti, Iconographie grecque (2. Aufl., Par. 1811, 3 Bde.) und Iconographie romaine (2. Aufl., das. 1817–33, 4 Bde.); Bernoulli, Römische Ikonographie (Stuttg. 1882–94, 4 Bde.). In Bezug auf die Mannigfaltigkeit der Büstenabschlüsse wurden die Römer durch die Künstler der B…
in scheme: travel!digital Thesaurus
pref label: Jünglingsbüste

Jünglingsbüste
type: Label
in scheme: travel!digital Thesaurus

Statue des athenischen Redners Äschines
type: Concept
definition: bdk: profane Kunst | Duden: Statue: frei stehende Plastik (1), die einen Menschen oder ein Tier in ganzer Gestalt darstellt | Meyers Großes Konversations-Lexikon 1909: Statŭe (lat. statua, franz. statue, spr. statǖ', Stand bild), die durch die Tätigkeit des bildenden Künstlers in irgendeiner, meist harten Masse dargestellte volle[869] Gestalt, besonders des Menschen. Im Altertum und in der neuern Zeit bis zur Zeit der Renaissance pflegte man statuarische Bildwerke zur Belebung und Verdeutlichung der Formen mehr oder weniger reich zu bemalen, was in unsrer Zeit wieder aufgenommen worden ist (s. Polychromie). Man unterschied schon im griechischen Altertum Idealstatuen, d. h. der Phantasie entsprungene Gestalten (Götter, Heroen etc.), und Porträtstatuen. Die Porträtstatuen kamen erst verhältnismäßig spät durch die Sitte auf, in Olympia Statuen der Sieger in den Wettkämpfen aufzustellen. Doch waren auch diese anfangs ideal, d. h. nicht porträtähnlich, gehalten. Noch später kam dazu das Genrebild, das Personen und Vorgänge aus dem Alltagsleben als Einzelstatuen oder Gruppen darstellt. In der römischen, besonders kaiserlichen, Zeit wurden in großer Menge Porträtstatuen gefertigt. Die moderne Bildhauerkunst versteht unter S. im weitesten Sinne jede plastische Einzelfigur, im engern Sinn ein stehendes Bild. Statuette, Standbildchen. Vgl. Bildhauerkunst und Säule (S. 640). | Quelle: Meyers Großes Konversations-Lexikon, Band 18. Leipzig 1909, S. 869-870. | Permalink: http://www.zeno.org/nid/20007517459
pref label: Statue des athenischen Redners Äschines
in scheme: travel!digital Thesaurus
related match: Aeschines
related match: Statue

Statue des athenischen Redners Äschines
type: Label
in scheme: travel!digital Thesaurus

Büste des Doryphoros
type: Concept
definition: bdk: profane Kunst | Duden: 1. Büste: plastische Darstellung eines Menschen in Halbfigur oder nur bis zur Schulter | Duden: Doryphoros: berühmte Statue des Bildhauers Polyklet | Meyers Großes Konversations-Lexikon 1905: Büste (ital. Busto, »Brustbild«), plastisches Kunstwerk in vollrunder Arbeit, das einen menschlichen Kopf mit einem Teil der Brust (daher der Name) darstellt, unmittelbar auf einer runden, vier- oder mehreckigen Basis ruht, wodurch es sich von der Herme unterscheidet,[657] und aus Marmor, Gips, Metall, Holz, Ton, Wachs oder einer andern bildsamen Masse verfertigt ist. Die Kunstform der B. tritt in römischer Zeit an Stelle der in der griechischen Kunst allein üblich gewesenen Herme (s.d.). Damals schon kam als seltenere Abart die B. mit ganzem, auf einen runden Fuß gesetztem Oberkörper auf, eine Form, die die Florentiner Plastik im 15. Jahrh. mit und ohne Verwendung des Fußes wieder aufnahm. Man kann Porträt- und Idealbüsten unterscheiden. Während die erstern das Brustbild einer bestimmten Person geben, sind die letztern vom Künstler erfundene individuelle Bildungen idealen Charakters. Auch bei ihnen pflegt der Künstler wirklich existierende Personen als Modelle zu gebrauchen, denen er einen seiner Idee entsprechenden Ausdruck gibt. Bedeutendes haben in der Schöpfung von Büsten namentlich die Römer geleistet, die bereits in der Form des Fußes und seiner Verbindung mit dem Bruststück große Mannigfaltigkeit erreicht haben. Die Ahnenbilder der Römer (imagines) hatten nicht Büstenform, sondern waren aus Wachs über dem Leben geformte Masken (cerae). Die Benennung der uns zahlreich überkommenen Büsten wieder Porträte überhaupt bildet als Ikonographie einen Teil der Altertumswissenschaft. Vgl. Gurlitt, Versuch über die Büstenkunde (Magdeb. 1800); Visconti, Iconographie grecque (2. Aufl., Par. 1811, 3 Bde.) und Iconographie romaine (2. Aufl., das. 1817–33, 4 Bde.); Bernoulli, Römische Ikonographie (Stuttg. 1882–94, 4 Bde.). In Bezug auf die Mannigfaltigkeit d…
related match: Doryphoros
pref label: Büste des Doryphoros
in scheme: travel!digital Thesaurus

Büste des Doryphoros
type: Label
in scheme: travel!digital Thesaurus

Hermes Propyläos
type: Concept
definition: bdk: sakrale Kunst
in scheme: travel!digital Thesaurus
pref label: Hermes Propyläos
related match: Alcamenes

Hermes Propyläos
type: Label
in scheme: travel!digital Thesaurus

Jünglingsstatue
type: Concept
definition: Duden: Statue: frei stehende Plastik (1), die einen Menschen oder ein Tier in ganzer Gestalt darstellt | Meyers Großes Konversations-Lexikon 1909: Statŭe (lat. statua, franz. statue, spr. statǖ', Stand bild), die durch die Tätigkeit des bildenden Künstlers in irgendeiner, meist harten Masse dargestellte volle[869] Gestalt, besonders des Menschen. Im Altertum und in der neuern Zeit bis zur Zeit der Renaissance pflegte man statuarische Bildwerke zur Belebung und Verdeutlichung der Formen mehr oder weniger reich zu bemalen, was in unsrer Zeit wieder aufgenommen worden ist (s. Polychromie). Man unterschied schon im griechischen Altertum Idealstatuen, d. h. der Phantasie entsprungene Gestalten (Götter, Heroen etc.), und Porträtstatuen. Die Porträtstatuen kamen erst verhältnismäßig spät durch die Sitte auf, in Olympia Statuen der Sieger in den Wettkämpfen aufzustellen. Doch waren auch diese anfangs ideal, d. h. nicht porträtähnlich, gehalten. Noch später kam dazu das Genrebild, das Personen und Vorgänge aus dem Alltagsleben als Einzelstatuen oder Gruppen darstellt. In der römischen, besonders kaiserlichen, Zeit wurden in großer Menge Porträtstatuen gefertigt. Die moderne Bildhauerkunst versteht unter S. im weitesten Sinne jede plastische Einzelfigur, im engern Sinn ein stehendes Bild. Statuette, Standbildchen. Vgl. Bildhauerkunst und Säule (S. 640). | Quelle: Meyers Großes Konversations-Lexikon, Band 18. Leipzig 1909, S. 869-870. | Permalink: http://www.zeno.org/nid/20007517459
in scheme: travel!digital Thesaurus
pref label: Jünglingsstatue
related match: Statue

Jünglingsstatue
type: Label
in scheme: travel!digital Thesaurus

Gewandstatue
type: Concept
definition: bdk: profane Kunst | Duden: Statue: frei stehende Plastik (1), die einen Menschen oder ein Tier in ganzer Gestalt darstellt | Meyers Großes Konversations-Lexikon 1909: Statŭe (lat. statua, franz. statue, spr. statǖ', Stand bild), die durch die Tätigkeit des bildenden Künstlers in irgendeiner, meist harten Masse dargestellte volle[869] Gestalt, besonders des Menschen. Im Altertum und in der neuern Zeit bis zur Zeit der Renaissance pflegte man statuarische Bildwerke zur Belebung und Verdeutlichung der Formen mehr oder weniger reich zu bemalen, was in unsrer Zeit wieder aufgenommen worden ist (s. Polychromie). Man unterschied schon im griechischen Altertum Idealstatuen, d. h. der Phantasie entsprungene Gestalten (Götter, Heroen etc.), und Porträtstatuen. Die Porträtstatuen kamen erst verhältnismäßig spät durch die Sitte auf, in Olympia Statuen der Sieger in den Wettkämpfen aufzustellen. Doch waren auch diese anfangs ideal, d. h. nicht porträtähnlich, gehalten. Noch später kam dazu das Genrebild, das Personen und Vorgänge aus dem Alltagsleben als Einzelstatuen oder Gruppen darstellt. In der römischen, besonders kaiserlichen, Zeit wurden in großer Menge Porträtstatuen gefertigt. Die moderne Bildhauerkunst versteht unter S. im weitesten Sinne jede plastische Einzelfigur, im engern Sinn ein stehendes Bild. Statuette, Standbildchen. Vgl. Bildhauerkunst und Säule (S. 640). | Quelle: Meyers Großes Konversations-Lexikon, Band 18. Leipzig 1909, S. 869-870. | Permalink: http://www.zeno.org/nid/20007517459
in scheme: travel!digital Thesaurus
pref label: Gewandstatue
related match: Statue

Gewandstatue
type: Label
in scheme: travel!digital Thesaurus

obere Hälfte einer Stele mit einem Ehrendekret und einem Kopf (Pan ?) darüber
type: Concept
definition: bdk: sakrale Kunst | Duden: Stele: frei stehende, mit Relief oder Inschrift versehene Platte oder Säule (besonders als Grabstein) | Meyers Großes Konversations-Lexikon 1909: Stēle (griech.), Säule, namentlich Grabstein, gewöhnlich ein viereckiger, nach oben sich etwas verjüngender und mit Blätter- oder Blumenverzierungen (Anthemien) gekrönter Pfeiler, der den Namen des Verstorbenen trägt (s. Abbildung und Tafel »Grabmäler«, Fig. 2). | Mitunter finden sich auch auf der S. Reliefdarstellungen, die sich auf das Leben des Geschiedenen beziehen. In hellenistischer und römischer Zeit wird die S. niedriger und breiter und meist mit einem Giebel besetzt. Vgl. Brückner, Ornament und Form der attischen[922] Grabstelen (Straßb. 1886); Conze, Die attischen Grabreliefs (Berl. 1903 ff.); über spätere Grabreliefs: Pfuhl in »Athenische Mitteilungen«, Bd. 26 (1901), S. 258 ff., und im »Archäologischen Jahrbuch«, 1905, S. 47,123 ff. – In der Botanik heißt S. derjenige zentrale Gewebekomplex in der noch nicht sekundär verdickten Sproßachse und Wurzel der Gefäßpflanzen, der die Leitbündel und eventuell das Mark einschließt, und außen vom Rindengewebe, dessen innerste Zellenschicht häufig als Endodermis ausgebildet ist, umhüllt wird. Vgl. Stelärtheorie. | Quelle: Meyers Großes Konversations-Lexikon, Band 18. Leipzig 1909, S. 922-923. | Permalink: http://www.zeno.org/nid/20007522592
related match: Pan (god)
related match: Stele
in scheme: travel!digital Thesaurus
pref label: obere Hälfte einer Stele mit einem Ehrendekret und einem Kopf (Pan ?) darüber

obere Hälfte einer Stele mit einem Ehrendekret und einem Kopf (Pan ?) darüber
type: Label
in scheme: travel!digital Thesaurus

archaische Reliefs
type: Concept
definition: bdk: sakrale Kunst | Duden: Relief: (bildende Kunst) aus einer Fläche (aus Stein, Metall o. Ä.) erhaben herausgearbeitetes oder in sie vertieftes Bildwerk | Meyers Großes Konversations-Lexikon 1908: Relief (franz., spr. rölheff, ital. riliēvo), erhabene Arbeit, diejenige Gattung der Bildnerei, welche die Figuren aus einer Ebene oder vertieften Fläche, dem Grunde, erhaben heraustreten läßt. Das R. bildet eine Mittelgattung zwischen der eigentlichen Skulptur, von der sie die Darstellungsweise, und der Malerei, von der sie die Anordnung hat, so zwar, daß das plastische Prinzip mehr in den einfachen, ruhigen Reliefs der ältern griechischen Kunst, das malerische dagegen in den überfüllten, oft heftig bewegten der spätern römischen Kunst vorherrscht. Man unterscheidet das Flachrelief (Basrelief, basso rilievo), bei dem die Figuren nur wenig über den Grund heraustreten, von dem Hochrelief (Hautrelief, alto rilievo), bei dem sie etwa halbrund modelliert sind. Sind einzelne Teile rundplastisch herausgearbeitet oder unterschnitten, so spricht man von hocherhabener Arbeit. Reliefs sind schon in der altägyptischen und assyrischen Kunst sehr häufig. Bei den Ägyptern findet man neben dem Basrelief das Hohlrelief (R.en creux, Koilanaglyph, s. d. und Tafel »Bildhauerkunst I«, Fig. 8 u. 9; II, Fig. 3–5). Zu hoher Vollendung wurde das R. von den Griechen gebracht, die das Hochrelief vor allem bei den Metopen und Friesen der Tempel, das Flachrelief zur Ausschmükkung der Grabstelen etc. verwendeten. In der Blütezeit rollte man die Darstellung im wesentlichen auf, ohne jedoch Überschneidungen ängstlich zu vermeiden, wie denn auch die zur Raumfüllung nötige Isokephalie (gleiche Höhe der Köpfe) nicht pedantisch gehandhabt wurde (s. Tafel »Bildhauerkunst III«, Fig. 7 u. 9; IV, Fig. 4). Streng durchgeführt aber ist die Anordnung der Figuren auf einem Grunde. Durchaus malerisch gestaltet sind dagegen die hellenistischen Reliefs, die mit ihren landschaftlichen Hintergründen etc. als reine Übe…
in scheme: travel!digital Thesaurus
pref label: archaische Reliefs
narrower: archaisches Flachrelief
related match: Relief

archaische Reliefs
type: Label
in scheme: travel!digital Thesaurus

archaisches Flachrelief
type: Concept
definition: bdk: sakrale Kunst | Duden: Relief: (bildende Kunst) aus einer Fläche (aus Stein, Metall o. Ä.) erhaben herausgearbeitetes oder in sie vertieftes Bildwerk | Meyers Großes Konversations-Lexikon 1908: Relief (franz., spr. rölheff, ital. riliēvo), erhabene Arbeit, diejenige Gattung der Bildnerei, welche die Figuren aus einer Ebene oder vertieften Fläche, dem Grunde, erhaben heraustreten läßt. Das R. bildet eine Mittelgattung zwischen der eigentlichen Skulptur, von der sie die Darstellungsweise, und der Malerei, von der sie die Anordnung hat, so zwar, daß das plastische Prinzip mehr in den einfachen, ruhigen Reliefs der ältern griechischen Kunst, das malerische dagegen in den überfüllten, oft heftig bewegten der spätern römischen Kunst vorherrscht. Man unterscheidet das Flachrelief (Basrelief, basso rilievo), bei dem die Figuren nur wenig über den Grund heraustreten, von dem Hochrelief (Hautrelief, alto rilievo), bei dem sie etwa halbrund modelliert sind. Sind einzelne Teile rundplastisch herausgearbeitet oder unterschnitten, so spricht man von hocherhabener Arbeit. Reliefs sind schon in der altägyptischen und assyrischen Kunst sehr häufig. Bei den Ägyptern findet man neben dem Basrelief das Hohlrelief (R.en creux, Koilanaglyph, s. d. und Tafel »Bildhauerkunst I«, Fig. 8 u. 9; II, Fig. 3–5). Zu hoher Vollendung wurde das R. von den Griechen gebracht, die das Hochrelief vor allem bei den Metopen und Friesen der Tempel, das Flachrelief zur Ausschmükkung der Grabstelen etc. verwendeten. In der Blütezeit rollte man die Darstellung im wesentlichen auf, ohne jedoch Überschneidungen ängstlich zu vermeiden, wie denn auch die zur Raumfüllung nötige Isokephalie (gleiche Höhe der Köpfe) nicht pedantisch gehandhabt wurde (s. Tafel »Bildhauerkunst III«, Fig. 7 u. 9; IV, Fig. 4). Streng durchgeführt aber ist die Anordnung der Figuren auf einem Grunde. Durchaus malerisch gestaltet sind dagegen die hellenistischen Reliefs, die mit ihren landschaftlichen Hintergründen etc. als reine Übe…
in scheme: travel!digital Thesaurus
pref label: archaisches Flachrelief
related match: Relief

archaisches Flachrelief
type: Label
in scheme: travel!digital Thesaurus

Statue Washingtons
type: Concept
definition: bdk: profane Kunst | Duden: Statue: frei stehende Plastik (1), die einen Menschen oder ein Tier in ganzer Gestalt darstellt | Meyers Großes Konversations-Lexikon 1909: Statŭe (lat. statua, franz. statue, spr. statǖ', Stand bild), die durch die Tätigkeit des bildenden Künstlers in irgendeiner, meist harten Masse dargestellte volle[869] Gestalt, besonders des Menschen. Im Altertum und in der neuern Zeit bis zur Zeit der Renaissance pflegte man statuarische Bildwerke zur Belebung und Verdeutlichung der Formen mehr oder weniger reich zu bemalen, was in unsrer Zeit wieder aufgenommen worden ist (s. Polychromie). Man unterschied schon im griechischen Altertum Idealstatuen, d. h. der Phantasie entsprungene Gestalten (Götter, Heroen etc.), und Porträtstatuen. Die Porträtstatuen kamen erst verhältnismäßig spät durch die Sitte auf, in Olympia Statuen der Sieger in den Wettkämpfen aufzustellen. Doch waren auch diese anfangs ideal, d. h. nicht porträtähnlich, gehalten. Noch später kam dazu das Genrebild, das Personen und Vorgänge aus dem Alltagsleben als Einzelstatuen oder Gruppen darstellt. In der römischen, besonders kaiserlichen, Zeit wurden in großer Menge Porträtstatuen gefertigt. Die moderne Bildhauerkunst versteht unter S. im weitesten Sinne jede plastische Einzelfigur, im engern Sinn ein stehendes Bild. Statuette, Standbildchen. Vgl. Bildhauerkunst und Säule (S. 640). | Quelle: Meyers Großes Konversations-Lexikon, Band 18. Leipzig 1909, S. 869-870. | Permalink: http://www.zeno.org/nid/20007517459
related match: George Washington
related match: Statue
pref label: Statue Washingtons
in scheme: travel!digital Thesaurus

Statue Washingtons
type: Label
in scheme: travel!digital Thesaurus

Eichenholzbüsten Adams
type: Concept
definition: bdk: sakrale Kunst | Duden: 1. Büste: plastische Darstellung eines Menschen in Halbfigur oder nur bis zur Schulter | Meyers Großes Konversations-Lexikon 1905: Büste (ital. Busto, »Brustbild«), plastisches Kunstwerk in vollrunder Arbeit, das einen menschlichen Kopf mit einem Teil der Brust (daher der Name) darstellt, unmittelbar auf einer runden, vier- oder mehreckigen Basis ruht, wodurch es sich von der Herme unterscheidet,[657] und aus Marmor, Gips, Metall, Holz, Ton, Wachs oder einer andern bildsamen Masse verfertigt ist. Die Kunstform der B. tritt in römischer Zeit an Stelle der in der griechischen Kunst allein üblich gewesenen Herme (s.d.). Damals schon kam als seltenere Abart die B. mit ganzem, auf einen runden Fuß gesetztem Oberkörper auf, eine Form, die die Florentiner Plastik im 15. Jahrh. mit und ohne Verwendung des Fußes wieder aufnahm. Man kann Porträt- und Idealbüsten unterscheiden. Während die erstern das Brustbild einer bestimmten Person geben, sind die letztern vom Künstler erfundene individuelle Bildungen idealen Charakters. Auch bei ihnen pflegt der Künstler wirklich existierende Personen als Modelle zu gebrauchen, denen er einen seiner Idee entsprechenden Ausdruck gibt. Bedeutendes haben in der Schöpfung von Büsten namentlich die Römer geleistet, die bereits in der Form des Fußes und seiner Verbindung mit dem Bruststück große Mannigfaltigkeit erreicht haben. Die Ahnenbilder der Römer (imagines) hatten nicht Büstenform, sondern waren aus Wachs über dem Leben geformte Masken (cerae). Die Benennung der uns zahlreich überkommenen Büsten wieder Porträte überhaupt bildet als Ikonographie einen Teil der Altertumswissenschaft. Vgl. Gurlitt, Versuch über die Büstenkunde (Magdeb. 1800); Visconti, Iconographie grecque (2. Aufl., Par. 1811, 3 Bde.) und Iconographie romaine (2. Aufl., das. 1817–33, 4 Bde.); Bernoulli, Römische Ikonographie (Stuttg. 1882–94, 4 Bde.). In Bezug auf die Mannigfaltigkeit der Büstenabschlüsse wurden die Römer durch die Künstler der B…
pref label: Eichenholzbüsten Adams
in scheme: travel!digital Thesaurus
related: Christentum
related match: Adam and Eve

Eichenholzbüsten Adams
type: Label
in scheme: travel!digital Thesaurus

Tyler-Davidson-Brunnen
type: Concept
related match: Water well
definition: bdk: profane Kunst
pref label: Tyler-Davidson-Brunnen
in scheme: travel!digital Thesaurus

Tyler-Davidson-Brunnen
type: Label
in scheme: travel!digital Thesaurus

Dionysos
type: Concept
definition: bdk: sakrale Kunst | Duden: Gott des Weines, des Rausches und der Fruchtbarkeit | Meyers Großes Konversations-Lexikon 1906: Diónysos, bei den Griechen der Gott der schwellenden Triebkraft der Natur, wie sie sich in den Bäumen und besonders im Weinstock zeigt, daher als erster Pflanzer desselben und Weinbereiter (Lenäos, »Kelterer«) angesehen. Sein Kult scheint thrakischen Ursprungs und von Thrakern in Mittelgriechenland am Parnaß, wo D. als Mitbesitzer von Delphi erscheint, und am Kithäron eingeführt zu sein. In der gewöhnlichen Sage gilt er als Sohn des Zeus und der thebanischen Königstochter Semele (s. d.); als diese, von Zeus' Blitz getroffen, das erst sechsmonatliche Kind gebar, barg es Zeus in seiner Hüfte bis zur Reise und gab es dann den Nymphen von Nysa (s. d.) oder Dodona zur Pflege. Herangewachsen, pflanzt D. den Weinstock und zieht mit seinem vom Wein begeisterten Gefolge (Thiasos), seinen Ammen und andern Nymphen, Satyrn, Silenen und sonstigen Dämonen umher,| [27] um seinen Kult und den Weinbau zu verbreiten, trotz seiner Jugend ein wunderstarker Gott, der seine Widersacher furchtbar straft; eine Reihe von Sagen läßt erkennen, daß der neue Kult an manchen Orten auf heftigen Widerstand stieß (s. Lykurgos und Pentheus). Nachdem er sich überall Anerkennung verschafft und neben Herakles in Löwengestalt den Göttern zum Gigantensiege verholfen, wurde er in den Olymp aufgenommen, in dem er bei Homer noch nicht erscheint. [...] | Quelle: Meyers Großes Konversations-Lexikon, Band 5. Leipzig 1906, S. 27-29. | Permalink: http://www.zeno.org/nid/20006494102
pref label: Dionysos
in scheme: travel!digital Thesaurus
narrower: Kopf des bärtigen Dionysos

Dionysos
type: Label
in scheme: travel!digital Thesaurus

Kopf des bärtigen Dionysos
type: Concept
definition: bdk: profane Kunst
pref label: Kopf des bärtigen Dionysos
in scheme: travel!digital Thesaurus
related match: Dionysus

Kopf des bärtigen Dionysos
type: Label
in scheme: travel!digital Thesaurus

Ceres
type: Concept
definition: bdk: sakrale Kunst | Duden: Göttin der Feldfrucht, des Ackerbaus | Meyers Großes Konversations-Lexikon 1905: Ceres, bei den Römern eine der griechischen Demeter nachgebildete Personifikation des Getreides. Der 496 v. Chr. bei einer Hungersnot auf Anordnung der Sibyllinischen Bücher in Rom eingeführte, allmählich über Italien verbreitete Kult war so griechisch, daß der 493 am Abhang des Aventin geweihte Tempel nach griechischer Weise und von griechischen Künstlern ausgeführt und der Dienst der Göttin von italischen Griechinnen in griechischer Sprache und mit völliger Anlehnung an die Sage der Demeter und der mit der italischen Libera gleichgesetzten Persephone versehen wurde. Die Göttin wurde vorzugsweise von den Plebejern verehrt. Ihr Tempel stand unter der Aussicht der plebejischen Ädilen, die als Aufseher des Kornmarktes bei demselben ihr Amtslokal hatten; die von ihnen auferlegten Strafgelder fielen dem Heiligtum zu, ebenso das Vermögen derer, die sich gegen plebejische Beamte vergangen hatten. An den Festspielen der C. (ludi Cereris oder Cerealia), die später vom 12.–19. April und zwar gleichfalls von den Ädilen gegeben wurden, bewirteten sich die Plebejer gegenseitig, wie an den Megalesien (s.d.) vom 4.–10. April die Patrizier. Ein andres Jahresfest wurde im August zur Feier der Wiedervereinigung der C. und Proserpina von den Frauen begangen, die in weißer Kleidung der Göttin die Erstlinge der Früchte darbrachten. Dazu kam noch seit 191 v. Chr. ein gleichfalls auf Anordnung der Sibyllinischen Bücher eingeführtes Fasten der C. (jejunium Cereris), ursprünglich alle fünf Jahre, später jährlich am 4. Okt. Über die bildlichen Darstellungen der C. s. Demeter. | Quelle: Meyers Großes Konversations-Lexikon, Band 3. Leipzig 1905, S. 843. | Permalink: http://www.zeno.org/nid/20006408435
in scheme: travel!digital Thesaurus
pref label: Ceres

Ceres
type: Label
in scheme: travel!digital Thesaurus

Schlangensäule
type: Concept
definition: bdk: sakrale Kunst | Duden: Säule: 1. a. walzenförmige [sich nach oben leicht verjüngende], meist aus Basis, Schaft und Kapitell bestehende senkrechte Stütze eines Bauwerks, die aber auch frei stehend dekorativen Zwecken dienen kann
related match: Column
in scheme: travel!digital Thesaurus
pref label: Schlangensäule

Schlangensäule
type: Label
in scheme: travel!digital Thesaurus

Herakleskopf in Marmor
type: Concept
definition: bdk: sakrale Kunst | Duden: Marmor: weißes oder farbiges, häufig geädertes, sehr hartes Kalkgestein, das besonders in der Bildhauerei und als Baumaterial verwendet wird | Meyers Großes Konversations-Lexikon 1908: Marmor (Marmelstein, Urkalkstein zum Teil, körniger Kalkstein), kristallinisch-körniges Aggregat von Kalkspat (kohlensaurer Kalk), grob- bis feinkörnig (zuckerartig) und dicht, Härte 3, durchscheinend bis kantendurchscheinend, weiß in allen Nuancen, grau, rot und schwarz, seltener gelb, blau, bald einfarbig, bald bunt, flammig, geädert, wolkig und fleckig, daher der Ausdruck marmoriert. Häufig enthält der M. akzessorische Bestandteile, wie Glimmer, Talk, Chlorit, Serpentin, Graphit, Granat, Vesuvian, Apatit, Spinell, Magneteisen, Eisenkies, Augit, Hornblende, Quarz, Korund, Zirkon, Turmalin etc. Während der Mineralog nur diejenigen Gesteine als M. bezeichnet, die eine kristallinische körnige Struktur besitzen und wesentlich aus kohlensaurem Kalk bestehen, vielleicht auch in geringer Menge noch kohlensaure Magnesia enthalten (alsdann Übergänge in den Dolomit bildend, Dolomitmarmor), werden in der Technik alle Kalksteine, die schön gefärbt sind und wegen ihres dichten Gefüges, ihrer Festigkeit, beim Schleifen eine schöne Politur annehmen, mit dem Namen M. belegt, zuweilen sogar solche Gesteine, die gar keinen kohlensauren Kalk oder solchen nur in verschwindend kleiner Menge enthalten. Sehen wir von den letztern, welche die Bezeichnung M. nicht verdienen, ab, so ergibt sich, daß der M., bisweilen deutlich geschichtet und in der Regel unregelmäßig zerklüftet, besonders häufig als Einlagerung im kristallinischen Grundgebirge vorkommt. Er bildet hier Lager und Stöcke von unregelmäßiger Gestalt, die sich bisweilen gangartig in das umschließende Gestein fortsetzen (so in Schlesien, in Sachsen, im Fichtelgebirge, bei Auerbach an der Bergstraße etc.). Außerdem findet sich M. im Silur (Schlesien, Erzgebirge, Insel Gotland), Devon (Nassau, Westfalen, Harz), Karbon (Bel…
in scheme: travel!digital Thesaurus
pref label: Herakleskopf in Marmor
related match: Heracles
related match: Marble

Herakleskopf in Marmor
type: Label
in scheme: travel!digital Thesaurus

Kolossalfiguren Ramses’ II.
type: Concept
definition: bdk: sakrale Kunst
in scheme: travel!digital Thesaurus
pref label: Kolossalfiguren Ramses’ II.
related match: Ramesses II

Kolossalfiguren Ramses’ II.
type: Label
in scheme: travel!digital Thesaurus

Holzstatue eines Mannes
type: Concept
definition: bdk: sakrale Kunst | Duden: Statue: frei stehende Plastik (1), die einen Menschen oder ein Tier in ganzer Gestalt darstellt | Meyers Großes Konversations-Lexikon 1909: Statŭe (lat. statua, franz. statue, spr. statǖ', Stand bild), die durch die Tätigkeit des bildenden Künstlers in irgendeiner, meist harten Masse dargestellte volle[869] Gestalt, besonders des Menschen. Im Altertum und in der neuern Zeit bis zur Zeit der Renaissance pflegte man statuarische Bildwerke zur Belebung und Verdeutlichung der Formen mehr oder weniger reich zu bemalen, was in unsrer Zeit wieder aufgenommen worden ist (s. Polychromie). Man unterschied schon im griechischen Altertum Idealstatuen, d. h. der Phantasie entsprungene Gestalten (Götter, Heroen etc.), und Porträtstatuen. Die Porträtstatuen kamen erst verhältnismäßig spät durch die Sitte auf, in Olympia Statuen der Sieger in den Wettkämpfen aufzustellen. Doch waren auch diese anfangs ideal, d. h. nicht porträtähnlich, gehalten. Noch später kam dazu das Genrebild, das Personen und Vorgänge aus dem Alltagsleben als Einzelstatuen oder Gruppen darstellt. In der römischen, besonders kaiserlichen, Zeit wurden in großer Menge Porträtstatuen gefertigt. Die moderne Bildhauerkunst versteht unter S. im weitesten Sinne jede plastische Einzelfigur, im engern Sinn ein stehendes Bild. Statuette, Standbildchen. Vgl. Bildhauerkunst und Säule (S. 640). | Quelle: Meyers Großes Konversations-Lexikon, Band 18. Leipzig 1909, S. 869-870. | Permalink: http://www.zeno.org/nid/20007517459
in scheme: travel!digital Thesaurus
pref label: Holzstatue eines Mannes
related match: Statue

Holzstatue eines Mannes
type: Label
in scheme: travel!digital Thesaurus

Kopf und Oberkörper eines Athleten
type: Concept
definition: bdk: profane Kunst | Duden: Athlet: 1. (umgangssprachlich) kräftig gebauter, muskulöser Mann; Kraftmensch | 2. (Sport) Wettkämpfer | Brockhaus' Kleines Konversations-Lexikon 1911: Athlēt (grch.), im Altertum zunftmäßig ausgebildeter, seine Kunst (Athlētik) handwerksmäßig betreibender Wettkämpfer; jetzt Schaukünstler von großer Körperkraft; athlētisch, kraftvoll, muskelkräftig. | Quelle: Brockhaus' Kleines Konversations-Lexikon, fünfte Auflage, Band 1. Leipzig 1911., S. 116. | Permalink: http://www.zeno.org/nid/2000092296X
related match: Athlete
in scheme: travel!digital Thesaurus
pref label: Kopf und Oberkörper eines Athleten

Kopf und Oberkörper eines Athleten
type: Label
in scheme: travel!digital Thesaurus

Löwe von Polonnaruwa
type: Concept
definition: bdk: profane Kunst
related match: Polonnaruwa
in scheme: travel!digital Thesaurus
pref label: Löwe von Polonnaruwa

Löwe von Polonnaruwa
type: Label
in scheme: travel!digital Thesaurus

das berühmte Orpheusrelief
type: Concept
definition: bdk: sakrale Kunst | Duden: Relief: (bildende Kunst) aus einer Fläche (aus Stein, Metall o. Ä.) erhaben herausgearbeitetes oder in sie vertieftes Bildwerk | Meyers Großes Konversations-Lexikon 1908: Relief (franz., spr. rölheff, ital. riliēvo), erhabene Arbeit, diejenige Gattung der Bildnerei, welche die Figuren aus einer Ebene oder vertieften Fläche, dem Grunde, erhaben heraustreten läßt. Das R. bildet eine Mittelgattung zwischen der eigentlichen Skulptur, von der sie die Darstellungsweise, und der Malerei, von der sie die Anordnung hat, so zwar, daß das plastische Prinzip mehr in den einfachen, ruhigen Reliefs der ältern griechischen Kunst, das malerische dagegen in den überfüllten, oft heftig bewegten der spätern römischen Kunst vorherrscht. Man unterscheidet das Flachrelief (Basrelief, basso rilievo), bei dem die Figuren nur wenig über den Grund heraustreten, von dem Hochrelief (Hautrelief, alto rilievo), bei dem sie etwa halbrund modelliert sind. Sind einzelne Teile rundplastisch herausgearbeitet oder unterschnitten, so spricht man von hocherhabener Arbeit. Reliefs sind schon in der altägyptischen und assyrischen Kunst sehr häufig. Bei den Ägyptern findet man neben dem Basrelief das Hohlrelief (R.en creux, Koilanaglyph, s. d. und Tafel »Bildhauerkunst I«, Fig. 8 u. 9; II, Fig. 3–5). Zu hoher Vollendung wurde das R. von den Griechen gebracht, die das Hochrelief vor allem bei den Metopen und Friesen der Tempel, das Flachrelief zur Ausschmükkung der Grabstelen etc. verwendeten. In der Blütezeit rollte man die Darstellung im wesentlichen auf, ohne jedoch Überschneidungen ängstlich zu vermeiden, wie denn auch die zur Raumfüllung nötige Isokephalie (gleiche Höhe der Köpfe) nicht pedantisch gehandhabt wurde (s. Tafel »Bildhauerkunst III«, Fig. 7 u. 9; IV, Fig. 4). Streng durchgeführt aber ist die Anordnung der Figuren auf einem Grunde. Durchaus malerisch gestaltet sind dagegen die hellenistischen Reliefs, die mit ihren landschaftlichen Hintergründen etc. als reine Übe…
in scheme: travel!digital Thesaurus
pref label: das berühmte Orpheusrelief
related match: Orpheus
related match: Relief

das berühmte Orpheusrelief
type: Label
in scheme: travel!digital Thesaurus

männlicher Kopf
type: Concept
definition: bdk: sakrale Kunst
pref label: männlicher Kopf
in scheme: travel!digital Thesaurus

männlicher Kopf
type: Label
in scheme: travel!digital Thesaurus

Marsyas
type: Concept
definition: bdk: sakrale Kunst
in scheme: travel!digital Thesaurus
pref label: Marsyas

Marsyas
type: Label
in scheme: travel!digital Thesaurus

Trajansbogen
type: Concept
definition: bdk: profane Kunst
in scheme: travel!digital Thesaurus
pref label: Trajansbogen
related match: Trajan

Trajansbogen
type: Label
in scheme: travel!digital Thesaurus

der Braumeister Nofer
type: Concept
definition: bdk: sakrale Kunst
pref label: der Braumeister Nofer
in scheme: travel!digital Thesaurus

der Braumeister Nofer
type: Label
in scheme: travel!digital Thesaurus

sogenannter Eubuleus
type: Concept
definition: bdk: sakrale Kunst | Meyers Großes Konversations-Lexikon 1906: Eubūleus (griech., »der Wohlwollende, Wohlratende«), Beiname des Hades, des Unterweltgottes, besonders in der eleusinischen und orphischen Überlieferung. | Quelle: Meyers Großes Konversations-Lexikon, Band 6. Leipzig 1906, S. 149. | Permalink: http://www.zeno.org/nid/20006574599
pref label: sogenannter Eubuleus
in scheme: travel!digital Thesaurus

sogenannter Eubuleus
type: Label
in scheme: travel!digital Thesaurus

Venustorso
type: Concept
definition: bdk: sakrale Kunst | Duden: Torso: 1. menschlicher Körper ohne Kopf und Gliedmaßen; Rumpf | 2. (Kunstwissenschaft) (unvollständig erhaltene oder gestaltete) Statue mit fehlenden Gliedmaßen [und fehlendem Kopf] | Meyers Großes Konversations-Lexikon 1909: Torso (ital., »Strunk«), in der Kunstsprache der Rumpf einer Bildsäule, der Kopf, Arme und Beine fehlen. Berühmt ist der im Belvedere des Vatikans aufgestellte T. des Herakles (»T. vom Belvedere«, Abbildung s. Herakles, S. 186), der unter Papst Clemens VII. aus dem Besitze der Colonna in den Vatikan kam, ein Werk des Bildhauers Apollonios (s. d. 4). Von hervorragender Bedeutung ist auch der T. des sogen. Ilioneus, des jüngsten Sohnes der Niobe, in der Münchener Glyptothek (vgl. Niobe). | Quelle: Meyers Großes Konversations-Lexikon, Band 19. Leipzig 1909, S. 629. | Permalink: http://www.zeno.org/nid/20007594666
in scheme: travel!digital Thesaurus
pref label: Venustorso
related match: Venus (mythology)

Venustorso
type: Label
in scheme: travel!digital Thesaurus

eleusinisches Relief
type: Concept
definition: bdk: sakrale Kunst | Duden: Relief: (bildende Kunst) aus einer Fläche (aus Stein, Metall o. Ä.) erhaben herausgearbeitetes oder in sie vertieftes Bildwerk | Meyers Großes Konversations-Lexikon 1908: Relief (franz., spr. rölheff, ital. riliēvo), erhabene Arbeit, diejenige Gattung der Bildnerei, welche die Figuren aus einer Ebene oder vertieften Fläche, dem Grunde, erhaben heraustreten läßt. Das R. bildet eine Mittelgattung zwischen der eigentlichen Skulptur, von der sie die Darstellungsweise, und der Malerei, von der sie die Anordnung hat, so zwar, daß das plastische Prinzip mehr in den einfachen, ruhigen Reliefs der ältern griechischen Kunst, das malerische dagegen in den überfüllten, oft heftig bewegten der spätern römischen Kunst vorherrscht. Man unterscheidet das Flachrelief (Basrelief, basso rilievo), bei dem die Figuren nur wenig über den Grund heraustreten, von dem Hochrelief (Hautrelief, alto rilievo), bei dem sie etwa halbrund modelliert sind. Sind einzelne Teile rundplastisch herausgearbeitet oder unterschnitten, so spricht man von hocherhabener Arbeit. Reliefs sind schon in der altägyptischen und assyrischen Kunst sehr häufig. Bei den Ägyptern findet man neben dem Basrelief das Hohlrelief (R.en creux, Koilanaglyph, s. d. und Tafel »Bildhauerkunst I«, Fig. 8 u. 9; II, Fig. 3–5). Zu hoher Vollendung wurde das R. von den Griechen gebracht, die das Hochrelief vor allem bei den Metopen und Friesen der Tempel, das Flachrelief zur Ausschmükkung der Grabstelen etc. verwendeten. In der Blütezeit rollte man die Darstellung im wesentlichen auf, ohne jedoch Überschneidungen ängstlich zu vermeiden, wie denn auch die zur Raumfüllung nötige Isokephalie (gleiche Höhe der Köpfe) nicht pedantisch gehandhabt wurde (s. Tafel »Bildhauerkunst III«, Fig. 7 u. 9; IV, Fig. 4). Streng durchgeführt aber ist die Anordnung der Figuren auf einem Grunde. Durchaus malerisch gestaltet sind dagegen die hellenistischen Reliefs, die mit ihren landschaftlichen Hintergründen etc. als reine Übe…
in scheme: travel!digital Thesaurus
pref label: eleusinisches Relief
related match: Relief

eleusinisches Relief
type: Label
in scheme: travel!digital Thesaurus

Mädchenfiguren
type: Concept
definition: bdk: profane Kunst
in scheme: travel!digital Thesaurus
pref label: Mädchenfiguren

Mädchenfiguren
type: Label
in scheme: travel!digital Thesaurus

Kolossalstatue
type: Concept
definition: bdk: profane Kunst | Duden: Statue: frei stehende Plastik (1), die einen Menschen oder ein Tier in ganzer Gestalt darstellt | Meyers Großes Konversations-Lexikon 1909: Statŭe (lat. statua, franz. statue, spr. statǖ', Stand bild), die durch die Tätigkeit des bildenden Künstlers in irgendeiner, meist harten Masse dargestellte volle[869] Gestalt, besonders des Menschen. Im Altertum und in der neuern Zeit bis zur Zeit der Renaissance pflegte man statuarische Bildwerke zur Belebung und Verdeutlichung der Formen mehr oder weniger reich zu bemalen, was in unsrer Zeit wieder aufgenommen worden ist (s. Polychromie). Man unterschied schon im griechischen Altertum Idealstatuen, d. h. der Phantasie entsprungene Gestalten (Götter, Heroen etc.), und Porträtstatuen. Die Porträtstatuen kamen erst verhältnismäßig spät durch die Sitte auf, in Olympia Statuen der Sieger in den Wettkämpfen aufzustellen. Doch waren auch diese anfangs ideal, d. h. nicht porträtähnlich, gehalten. Noch später kam dazu das Genrebild, das Personen und Vorgänge aus dem Alltagsleben als Einzelstatuen oder Gruppen darstellt. In der römischen, besonders kaiserlichen, Zeit wurden in großer Menge Porträtstatuen gefertigt. Die moderne Bildhauerkunst versteht unter S. im weitesten Sinne jede plastische Einzelfigur, im engern Sinn ein stehendes Bild. Statuette, Standbildchen. Vgl. Bildhauerkunst und Säule (S. 640). | Quelle: Meyers Großes Konversations-Lexikon, Band 18. Leipzig 1909, S. 869-870. | Permalink: http://www.zeno.org/nid/20007517459
in scheme: travel!digital Thesaurus
pref label: Kolossalstatue
related match: Statue

Kolossalstatue
type: Label
in scheme: travel!digital Thesaurus

Shaw Monument
type: Concept
related match: Robert Gould Shaw
definition: bdk: profane Kunst | Duden: Monument: großes Denkmal, Ehren-, Mahnmal
related match: Monument
pref label: Shaw Monument
in scheme: travel!digital Thesaurus

Shaw Monument
type: Label
in scheme: travel!digital Thesaurus

archaische Grabstele
type: Concept
definition: bdk: sakrale Kunst | Duden: Stele: frei stehende, mit Relief oder Inschrift versehene Platte oder Säule (besonders als Grabstein) | Meyers Großes Konversations-Lexikon 1909: Stēle (griech.), Säule, namentlich Grabstein, gewöhnlich ein viereckiger, nach oben sich etwas verjüngender und mit Blätter- oder Blumenverzierungen (Anthemien) gekrönter Pfeiler, der den Namen des Verstorbenen trägt (s. Abbildung und Tafel »Grabmäler«, Fig. 2). | Mitunter finden sich auch auf der S. Reliefdarstellungen, die sich auf das Leben des Geschiedenen beziehen. In hellenistischer und römischer Zeit wird die S. niedriger und breiter und meist mit einem Giebel besetzt. Vgl. Brückner, Ornament und Form der attischen[922] Grabstelen (Straßb. 1886); Conze, Die attischen Grabreliefs (Berl. 1903 ff.); über spätere Grabreliefs: Pfuhl in »Athenische Mitteilungen«, Bd. 26 (1901), S. 258 ff., und im »Archäologischen Jahrbuch«, 1905, S. 47,123 ff. – In der Botanik heißt S. derjenige zentrale Gewebekomplex in der noch nicht sekundär verdickten Sproßachse und Wurzel der Gefäßpflanzen, der die Leitbündel und eventuell das Mark einschließt, und außen vom Rindengewebe, dessen innerste Zellenschicht häufig als Endodermis ausgebildet ist, umhüllt wird. Vgl. Stelärtheorie. | Quelle: Meyers Großes Konversations-Lexikon, Band 18. Leipzig 1909, S. 922-923. | Permalink: http://www.zeno.org/nid/20007522592
in scheme: travel!digital Thesaurus
pref label: archaische Grabstele

archaische Grabstele
type: Label
in scheme: travel!digital Thesaurus

Reiterstandbild Washingtons
type: Concept
related match: George Washington
related match: Equestrian statue
definition: bdk: profane Kunst | Duden: Standbild eines Reiters auf dem Pferd
pref label: Reiterstandbild Washingtons
in scheme: travel!digital Thesaurus

Reiterstandbild Washingtons
type: Label
in scheme: travel!digital Thesaurus

Heiligenstatuen
type: Concept
related match: Saint
definition: bdk: sakrale Kunst | Duden: Statue: frei stehende Plastik (1), die einen Menschen oder ein Tier in ganzer Gestalt darstellt | Meyers Großes Konversations-Lexikon 1909: Statŭe (lat. statua, franz. statue, spr. statǖ', Stand bild), die durch die Tätigkeit des bildenden Künstlers in irgendeiner, meist harten Masse dargestellte volle[869] Gestalt, besonders des Menschen. Im Altertum und in der neuern Zeit bis zur Zeit der Renaissance pflegte man statuarische Bildwerke zur Belebung und Verdeutlichung der Formen mehr oder weniger reich zu bemalen, was in unsrer Zeit wieder aufgenommen worden ist (s. Polychromie). Man unterschied schon im griechischen Altertum Idealstatuen, d. h. der Phantasie entsprungene Gestalten (Götter, Heroen etc.), und Porträtstatuen. Die Porträtstatuen kamen erst verhältnismäßig spät durch die Sitte auf, in Olympia Statuen der Sieger in den Wettkämpfen aufzustellen. Doch waren auch diese anfangs ideal, d. h. nicht porträtähnlich, gehalten. Noch später kam dazu das Genrebild, das Personen und Vorgänge aus dem Alltagsleben als Einzelstatuen oder Gruppen darstellt. In der römischen, besonders kaiserlichen, Zeit wurden in großer Menge Porträtstatuen gefertigt. Die moderne Bildhauerkunst versteht unter S. im weitesten Sinne jede plastische Einzelfigur, im engern Sinn ein stehendes Bild. Statuette, Standbildchen. Vgl. Bildhauerkunst und Säule (S. 640). | Quelle: Meyers Großes Konversations-Lexikon, Band 18. Leipzig 1909, S. 869-870. | Permalink: http://www.zeno.org/nid/20007517459
related: Christentum
in scheme: travel!digital Thesaurus
pref label: Heiligenstatuen
related match: Statue

Heiligenstatuen
type: Label
in scheme: travel!digital Thesaurus

Kalksteinpfeiler
type: Concept
related match: Pier (architecture)
definition: bdk: profane Kunst | Duden: Kalkstein: meist aus [Meer]wasser abgesetztes, vorwiegend aus Kalkspat bestehendes Sedimentgestein, das als Rohstoff besonders in der chemischen und der Bauindustrie Verwendung findet | Duden: Statue: frei stehende Plastik (1), die einen Menschen oder ein Tier in ganzer Gestalt darstellt | Duden: Pfeiler: 1. [frei stehende] senkrechte Stütze [aus Mauerwerk, Beton o. Ä.] mit meist eckigem Querschnitt zum Tragen von Teilen eines größeren Bauwerks | Meyers Großes Konversations-Lexikon 1907: Kalkstein, Gestein, das wesentlich aus Kalkspat oder Calcit besteht und grob- oder feinkörnig, dicht, oolithisch, kompakt und zellig, porös (Kalktuff, s. d.) sowie erdig (Kreide, s. d.) und sandig (Kalksand) auftritt. Der körnige K. heißt Marmor (s. d.), aber auch der dichte K. erweist sich unter dem Mikroskop sehr feinkörnig. Während der Marmor oft ganz weiß ist, ist der dichte K. meist grau oder gelblichgrau, auch schwarz, rötlich oder bräunlich. Mancher K. ist reiner kohlensaurer Kalk, andre gehen durch steigenden Magnesiagehalt in Dolomit oder durch Tongehalt in Mergel, einige auch in Sandstein über; die rötlich oder braun, auch ockergelb gefärbten enthalten Eisenoxyd oder Eisenhydroxyd (sogen. Eisenkalkstein), die dunkeln organische, zuweilen beim Anschlagen stark bituminös riechende Substanz (sogen. Stinkkalke), vielen ist Kieselsäure beigemengt (vgl. Kieselkalkstein). Kalksteine sind durch alle sedimentären Formationen verbreitet (vgl. Tafel »Bergformen II«, Fig. 2 u. 4); hervorzuheben sind die körnigen Kalke der kristallinischen Schiefer, die Lager von dichtem K. im Silur und Devon, der Kohlenkalk, der Zechstein (des obern Perm), der »Muschelkalk« der mittlern Trias, der K. der Juraformation, der Hippuritenkalk der Kreide, der tertiäre (eocäne) Nummulitenkalk, auch der Grobkalk des Pariser Beckens. Seiner Entstehung nach ist der K. entweder eine marine Bildung und dann unter Mitwirkung von kalkabsondernden Organismen (Kalkalgen, Foraminiferen, Spo…
related match: Limestone
in scheme: travel!digital Thesaurus
pref label: Kalksteinpfeiler

Kalksteinpfeiler
type: Label
in scheme: travel!digital Thesaurus

Fries
type: Concept
definition: bdk: profane, sakrale Kunst | Duden: mit plastischen oder gemalten Ornamenten und figürlichen Darstellungen ausgestaltete Fläche als Gliederung und Schmuck einer Wand | Meyers Großes Konversations-Lexikon 1907: Fries, im allgemein ästhetischen Sinne die Vermittelung einer Fläche mit einer ihrer Begrenzungslinien durch Einschaltung einer schmalen oder »linearen« Fläche; in der Architektur der schmale Flächenstreifen zwischen einer größern Wandfläche und deren oberm Rande. Diese Friesstreifen wurden in der romanischen und gotischen Architektur mit geometrischen, seltener vegetabilischen und figürlichen Zierformen versehen, deren Elemente die Bezeichnungen für die verschiedenen Gattungen der Friese bestimmt haben, von denen die Abbildungen auf S. 147 einige darstellen. So in der romanischen Baukunst der Rundbogenfries (Fig. 1), bestehend aus aneinander gereihten halbkreisförmigen, mit ihren Schenkeln auf kleinen Konsolen aufsetzenden Bogen, die sich unterhalb des Dachgesimses hinziehen; der Kreuzungsbogenfries (Fig. 2), eine Reihe sich durchschneidender Rundbogen; der Schuppenfries (Fig. 3), der Zahnfries (deutsches Band, Stromschicht, Fig. 4), bestehend aus diagonal auf die hohe Kaute gestellten Backsteinen; der aus abwechselnden quadratischen, schachbrettartig geordneten Erhöhungen und Vertiefungen gebildete Schachbrettfries (Würfelfries, Fig. 5); der Tierfries, bestehend aus aneinander gereihten, durch vegetabilische Ornamente verbundenen Tierfiguren von z. T. symbolischer Bedeutung[146] (s. Tafel »Tierornamente II«, Fig. 15), im anglonormannischen Baustil der Schnabelkopffries (Fig. 6 u. 7), der mit Zylinderabschnitten besetzte Rollenfries (Fig. 8) und der Doppelkegelfries (Fig. 9); der Rautenfries (Fig. 10 u. 11). F. heißt auch der horizontale Flächenstreifen zwischen dem Architrav und dem Kranzgesims der griechischen Säulenordnungen (s. die Tafel »Säulenordnungen«, Fia. 1–9), zwischen dem Fenstersturz und der Verdachung von Fenstern und Türen, zwischen der Wand u…
narrower: Schriftfries
pref label: Fries
in scheme: travel!digital Thesaurus
narrower: Parthenonfries

Fries
type: Label
in scheme: travel!digital Thesaurus

Parthenonfries
type: Concept
related match: Frieze
definition: bdk: sakrale Kunst
related match: Acropolis
pref label: Parthenonfries
in scheme: travel!digital Thesaurus
related match: Parthenon

Parthenonfries
type: Label
in scheme: travel!digital Thesaurus

Kybee [Kybele], archaische Skulpturen aus Kyme
type: Concept
definition: bdk: sakrale Kunst | Duden: Kybele: phrygische Fruchtbarkeitsgöttin | Meyers Großes Konversations-Lexikon 1907: Kybĕle (auch Kybēbe), in Phrygien heimische, aber auch in ganz Kleinasien verehrte Natur- und Kulturgöttin, Vertreterin der gebärenden Kraft der Natur, Urheberin des Acker- und Weinbaues und aller darauf beruhenden Zivilisation sowie Begründerin der Städte, »die große Göttin«, »die große Mutter« (griech. megálē métēr, lat. magna mater), auch schlechthin »die Mutter« genannt. Hauptsächlich dachte man sie sich auf Bergen und in Wäldern waltend, auf einem Löwen, ihrem heiligen Tier, oder einem von Löwen gezogenen Wagen; auf Bergen hatte sie vorzugsweise ihre Heiligtümer, wie auf dem Dindymos (danach auch Dindymēne genannt, wie nach dem Berekyntos Berekyntia), bei dem phrygischen Pessinus, wo sie als Agdistis (Angdistis) unter dem Symbol eines Meteorsteins verehrt wurde, und auf dem Ida in Troas (daher »Idäische Mutter«). Ihr Dienst war mit orgiastischen Gebräuchen verbunden, wilden Tänzen, rauschender Musik mit Handpauken, Becken, Flöten und Selbstverstümmelungen ihrer Priester (s. Galli und Korybanten). Seit sie von den Griechen mit Rhea (s. d.) gleichgestellt wurde, verbreitete sich ihr Kult über die griechischen Inseln nach dem eigentlichen Griechenland. In Rom wurde er 204 v. Chr. auf Geheiß der Sibyllinischen Bücher eingeführt, indem der heilige Stein aus Pessinus geholt wurde, und von phrygischen Priestern versehen. Über das ihr 194 v. Chr. gestiftete Fest der Megalesia oder Ludi Megalenses s. Megalesien. Zu hohem Ansehen kam sie in der Kaiserzeit. Geheiligt war ihr außer dem Löwen die Fichte. Dargestellt wird sie als anmutige Frauengestalt mit kräftigen Formen und vollbekleidet, auf dem Haupt eine Mauerkrone, in der Linken die Handpauke, meist auf einem Thron sitzend mit Löwen zur Seite (vgl. Abbildung); auf einem Löwen erscheint sie in der Pergamenischen Gigantomachie. Vgl. Göhler, De Matris Magnae apud Romanos cultu (Meißen 1886). | Quelle: Meyers Gr…
in scheme: travel!digital Thesaurus
pref label: Kybee [Kybele], archaische Skulpturen aus Kyme
related match: Cybele

Kybee [Kybele], archaische Skulpturen aus Kyme
type: Label
in scheme: travel!digital Thesaurus

Engel am Grabe von Erastus Dow Palmer
type: Concept
related match: Erastus Dow Palmer
definition: bdk: sakrale Kunst
pref label: Engel am Grabe von Erastus Dow Palmer
in scheme: travel!digital Thesaurus
related: Christentum

Engel am Grabe von Erastus Dow Palmer
type: Label
in scheme: travel!digital Thesaurus

Marmorbasis
type: Concept
definition: bdk: profane Kunst | Duden: Marmor: weißes oder farbiges, häufig geädertes, sehr hartes Kalkgestein, das besonders in der Bildhauerei und als Baumaterial verwendet wird | Meyers Großes Konversations-Lexikon 1908: Marmor (Marmelstein, Urkalkstein zum Teil, körniger Kalkstein), kristallinisch-körniges Aggregat von Kalkspat (kohlensaurer Kalk), grob- bis feinkörnig (zuckerartig) und dicht, Härte 3, durchscheinend bis kantendurchscheinend, weiß in allen Nuancen, grau, rot und schwarz, seltener gelb, blau, bald einfarbig, bald bunt, flammig, geädert, wolkig und fleckig, daher der Ausdruck marmoriert. Häufig enthält der M. akzessorische Bestandteile, wie Glimmer, Talk, Chlorit, Serpentin, Graphit, Granat, Vesuvian, Apatit, Spinell, Magneteisen, Eisenkies, Augit, Hornblende, Quarz, Korund, Zirkon, Turmalin etc. Während der Mineralog nur diejenigen Gesteine als M. bezeichnet, die eine kristallinische körnige Struktur besitzen und wesentlich aus kohlensaurem Kalk bestehen, vielleicht auch in geringer Menge noch kohlensaure Magnesia enthalten (alsdann Übergänge in den Dolomit bildend, Dolomitmarmor), werden in der Technik alle Kalksteine, die schön gefärbt sind und wegen ihres dichten Gefüges, ihrer Festigkeit, beim Schleifen eine schöne Politur annehmen, mit dem Namen M. belegt, zuweilen sogar solche Gesteine, die gar keinen kohlensauren Kalk oder solchen nur in verschwindend kleiner Menge enthalten. Sehen wir von den letztern, welche die Bezeichnung M. nicht verdienen, ab, so ergibt sich, daß der M., bisweilen deutlich geschichtet und in der Regel unregelmäßig zerklüftet, besonders häufig als Einlagerung im kristallinischen Grundgebirge vorkommt. Er bildet hier Lager und Stöcke von unregelmäßiger Gestalt, die sich bisweilen gangartig in das umschließende Gestein fortsetzen (so in Schlesien, in Sachsen, im Fichtelgebirge, bei Auerbach an der Bergstraße etc.). Außerdem findet sich M. im Silur (Schlesien, Erzgebirge, Insel Gotland), Devon (Nassau, Westfalen, Harz), Karbon (Bel…
pref label: Marmorbasis
in scheme: travel!digital Thesaurus
related match: Marble

Marmorbasis
type: Label
in scheme: travel!digital Thesaurus

Bronzeherme
type: Concept
definition: bdk: profane Kunst | Duden: Herme: Pfeiler oder Säule, die mit einer Büste (ursprünglich des Gottes Hermes) gekrönt ist | Meyers Großes Konversations-Lexikon 1907: Hermen (griech.), im eigentlichen Wortsinne Bilder des Hermes (Mercurius), der häufig unter dem Bild eines viereckigen, oben breitern, unten schmäler zulaufenden Pfeilers (Herme) verehrt wurde; dann allgemeiner gebraucht für vierseitige Pfeiler, die in Büsten enden oder mit dem Oberkörper einer menschlichen Figur verbunden sind (s. Abbildung) und im alten Griechenland häufig auf öffentlichen Plätzen, Straßen und besonders an Kreuzwegen (als Wegweiser) aufgestellt wurden. | Von letzterer Form finden sich die schönsten, aus Griechenland stammenden Beispiele in der Villa Ludovisi in Rom. Die erstere pflegt an den Seiten des Pfeilers nahe am Kopfe je einen würfelartigen Vorsprung (Hände, griech. cheires, genannt) zum Aufhängen von Kränzen, vorn einen ausgerichteten Phallos (s. d.) zu haben. Die Entstehungszeit dieser Kunstform ist noch dunkel. Die älteste Zeit kennt sie noch nicht. Erst in der letzten Epoche der altertümlichen Kunst finden sich Beispiele; diese verbinden aber den menschlichen Oberkörper, der bis zu den Hüften reicht, mit dem vierseitigen Pfeiler und lassen sogar lebhafte Bewegung der Figur zu (so die Herme eines Diskobols in der Villa Ludovisi zu Rom). Später wird gewöhnlich Kopf und Pfeiler zusammen verbunden. Wenn auf der Herme das Bild eines andern Gottes oder Heros als des Merkur stand, so verband man den Namen Herme mit dem Namen des aufgestellten Kopfes; daher die Benennungen Hermares (Herme des Ares), Hermathene (der Athene), Hermerakles (des Herakles), Hermeros (des Eros), Hermapollon (des Apollon), Hermamithras (des Mithras), Hermalkibiades (des Alkibiades, sehr zahlreich in Athen). Gewöhnlich waren die H. nackt, selten bekleidet oder mit charakteristischen Attributen, desto häufiger mit Inschriften versehen, auch meist männlich. In der spätern Zeit wurde die Hermenform auch allgemei…
related match: Herma
in scheme: travel!digital Thesaurus
pref label: Bronzeherme
related match: Bronze

Bronzeherme
type: Label
in scheme: travel!digital Thesaurus

Särge und Beigaben
type: Concept
pref label: Särge und Beigaben
related match: Coffin
related match: Grave goods
in scheme: travel!digital Thesaurus
definition: bdk: sakrale Kunst | Duden: Sarg: (meist aus Holz, auch aus Metall gefertigtes) kastenförmiges, längliches Behältnis mit Deckel, in das ein Toter gelegt wird | Duden: Grabbeigabe: einem Toten ins Grab mitgegebener Gegenstand

Särge und Beigaben
type: Label
in scheme: travel!digital Thesaurus

Totenfigur des Wezîrs Ptahmose
type: Concept
definition: bdk: sakrale Kunst
in scheme: travel!digital Thesaurus
pref label: Totenfigur des Wezîrs Ptahmose
related match: Ptahmose (vizier)

Totenfigur des Wezîrs Ptahmose
type: Label
in scheme: travel!digital Thesaurus

Relief aus Thasos
type: Concept
definition: bdk: sakrale Kunst | Duden: Relief: (bildende Kunst) aus einer Fläche (aus Stein, Metall o. Ä.) erhaben herausgearbeitetes oder in sie vertieftes Bildwerk | Meyers Großes Konversations-Lexikon 1908: Relief (franz., spr. rölheff, ital. riliēvo), erhabene Arbeit, diejenige Gattung der Bildnerei, welche die Figuren aus einer Ebene oder vertieften Fläche, dem Grunde, erhaben heraustreten läßt. Das R. bildet eine Mittelgattung zwischen der eigentlichen Skulptur, von der sie die Darstellungsweise, und der Malerei, von der sie die Anordnung hat, so zwar, daß das plastische Prinzip mehr in den einfachen, ruhigen Reliefs der ältern griechischen Kunst, das malerische dagegen in den überfüllten, oft heftig bewegten der spätern römischen Kunst vorherrscht. Man unterscheidet das Flachrelief (Basrelief, basso rilievo), bei dem die Figuren nur wenig über den Grund heraustreten, von dem Hochrelief (Hautrelief, alto rilievo), bei dem sie etwa halbrund modelliert sind. Sind einzelne Teile rundplastisch herausgearbeitet oder unterschnitten, so spricht man von hocherhabener Arbeit. Reliefs sind schon in der altägyptischen und assyrischen Kunst sehr häufig. Bei den Ägyptern findet man neben dem Basrelief das Hohlrelief (R.en creux, Koilanaglyph, s. d. und Tafel »Bildhauerkunst I«, Fig. 8 u. 9; II, Fig. 3–5). Zu hoher Vollendung wurde das R. von den Griechen gebracht, die das Hochrelief vor allem bei den Metopen und Friesen der Tempel, das Flachrelief zur Ausschmükkung der Grabstelen etc. verwendeten. In der Blütezeit rollte man die Darstellung im wesentlichen auf, ohne jedoch Überschneidungen ängstlich zu vermeiden, wie denn auch die zur Raumfüllung nötige Isokephalie (gleiche Höhe der Köpfe) nicht pedantisch gehandhabt wurde (s. Tafel »Bildhauerkunst III«, Fig. 7 u. 9; IV, Fig. 4). Streng durchgeführt aber ist die Anordnung der Figuren auf einem Grunde. Durchaus malerisch gestaltet sind dagegen die hellenistischen Reliefs, die mit ihren landschaftlichen Hintergründen etc. als reine Übe…
related match: Thasos
in scheme: travel!digital Thesaurus
pref label: Relief aus Thasos
related match: Relief

Relief aus Thasos
type: Label
in scheme: travel!digital Thesaurus

Napoleon’s letzte Tage [Vela]
type: Concept
related match: Napoleon
related match: Vincenzo Vela
definition: bdk: profane Kunst
in scheme: travel!digital Thesaurus
pref label: Napoleon’s letzte Tage [Vela]

Napoleon’s letzte Tage [Vela]
type: Label
in scheme: travel!digital Thesaurus

Statue des guten Hirten
type: Concept
definition: bdk: sakrale Kunst | Duden: Statue: frei stehende Plastik (1), die einen Menschen oder ein Tier in ganzer Gestalt darstellt | Meyers Großes Konversations-Lexikon 1909: Statŭe (lat. statua, franz. statue, spr. statǖ', Stand bild), die durch die Tätigkeit des bildenden Künstlers in irgendeiner, meist harten Masse dargestellte volle[869] Gestalt, besonders des Menschen. Im Altertum und in der neuern Zeit bis zur Zeit der Renaissance pflegte man statuarische Bildwerke zur Belebung und Verdeutlichung der Formen mehr oder weniger reich zu bemalen, was in unsrer Zeit wieder aufgenommen worden ist (s. Polychromie). Man unterschied schon im griechischen Altertum Idealstatuen, d. h. der Phantasie entsprungene Gestalten (Götter, Heroen etc.), und Porträtstatuen. Die Porträtstatuen kamen erst verhältnismäßig spät durch die Sitte auf, in Olympia Statuen der Sieger in den Wettkämpfen aufzustellen. Doch waren auch diese anfangs ideal, d. h. nicht porträtähnlich, gehalten. Noch später kam dazu das Genrebild, das Personen und Vorgänge aus dem Alltagsleben als Einzelstatuen oder Gruppen darstellt. In der römischen, besonders kaiserlichen, Zeit wurden in großer Menge Porträtstatuen gefertigt. Die moderne Bildhauerkunst versteht unter S. im weitesten Sinne jede plastische Einzelfigur, im engern Sinn ein stehendes Bild. Statuette, Standbildchen. Vgl. Bildhauerkunst und Säule (S. 640). | Quelle: Meyers Großes Konversations-Lexikon, Band 18. Leipzig 1909, S. 869-870. | Permalink: http://www.zeno.org/nid/20007517459
related: Christentum
in scheme: travel!digital Thesaurus
pref label: Statue des guten Hirten
related match: Statue

Statue des guten Hirten
type: Label
in scheme: travel!digital Thesaurus

Löwenkapitäl einer Aschôkasäule
type: Concept
definition: bdk: sakrale Kunst | Duden: Kapitell: oberer Abschluss einer Säule, eines Pfeilers oder eines Pilasters | Meyers Großes Konversations-Lexikon 1907: Kapitäl, Säulenknauf, s. Kapitell. – In der Buchbinderei der mit Seide oder Zwirn bestochene, oben und unten am Rande des Rückens angeleimte Streifen Pergament oder Band. | Quelle: Meyers Großes Konversations-Lexikon, Band 10. Leipzig 1907, S. 590. | Permalink: http://www.zeno.org/nid/20006867332
related match: Capital (architecture)
pref label: Löwenkapitäl einer Aschôkasäule
in scheme: travel!digital Thesaurus
related: Buddhismus
related match: Ashoka

Löwenkapitäl einer Aschôkasäule
type: Label
in scheme: travel!digital Thesaurus

Buddhismus
type: Concept
definition: Duden: nach Buddha benannte Weltreligion | Meyers Großes Konversations-Lexikon 1905: Buddhismus (Buddhaismus), eine Religionsform, die, vom nördlichen Indien ausgehend, sich dem Brahmanismus (s.d.) entgegensetzte. Der Name B. kommt her von dem Sanskritwort Buddha (»der Erweckte«), worunter man einen versteht, der durch die Erkenntnis der Wahrheit und Überwindung aller Sünde zur vollständigen Erlösung von den Banden der Existenz gelangt ist. Man unterscheidet »Pratjekabuddhas«, die diese Erlösung nur für sich selbst erwerben, und »Samjaksambuddhas«, die vor ihrem gänzlichen Entschwinden aus der Welt die zu solcher Erlösung führenden Lehren der Welt mitteilen. Die Zahl der Buddhas, die diese vollkommene Erkenntnis (Bôdhi) erlangt haben, als vollkommene Lehrer aufgetreten sind und noch auftreten werden, ist nach dem Dogma der Buddhisten unendlich. Der historische Buddha, der wirkliche Begründer des B., ist der Adlige (nach späterer Vorstellung Prinz) Siddhârtha aus dem Geschlechte der Çàkja, dem im 6. Jahrh. v. Chr. ein kleines Reich am Fuße des Himalaja untertan war; die Hauptstadt war Kapilavastu; sie ist am 1. Dez. 1896 durch A. A. Führer (s.d.) bei dem nepalesischen Dorf Paderia wiedergefunden worden. Nach der Legende wurde B. auf unbefleckte Weise empfangen, indem er sich als weißer Elefant aus der Götterregion herabsenkte und in den Leib seiner Mutter einging. Schon in frühester Jugend gab er Proben seiner außerordentlichen Begabung; Hang zu einsamer Meditation zeichnete ihn von jeher aus, daher auch sein Name Çâkjamuni (»Einsiedler der Çakja«). Er heißt auch Gautama, nach dem Namen eines vedischen Sängergeschlechts, den die Çâkja angenommen hatten. Nachdenken über die Hinfälligkeit des menschlichen Körpers und Lebens soll ihn dazu bestimmt haben, dem Thron zu entsagen, Weib und hohe Umgebung zu verlassen. Nachdem er sieben Jahre lang als Schüler zweier damals angesehener Lehrer und in harten Kasteiungen der erlösenden Erkenntnis vergeblich nachgetrachtet, soll i…
in scheme: travel!digital Thesaurus
narrower: Lamaismus
pref label: Buddhismus

Lamaismus
type: Concept
definition: Duden: tibetischer Buddhismus | Meyers Großes Konversations-Lexikon 1908: Lamaïsmus, die eigentümliche Form, die der Buddhismus (s. d.) bei den Tibetern, Mongolen etc. angenommen hat, die deshalb Lamaïten oder Lamaïsten heißen. Der L. hat seinen Namen von Lama (tibet. »der Obere«), bei den Buddhisten in Tibet und in der Mongolei Titel der Äbte der Klöster, doch aus Höflichkeit auch andern Mönchen gegeben. Unter der Mongolenherrschaft wurde der Abt des Sâkjaklosters, seitdem unter dem Namen Paspa ('Phagss pa, »der Hochwürdige«) bekannt, tributärer Herrscher von Tibet und Haupt der lamaischen Hierarchie. Da dieselbe bald übermächtig wurde, suchte die Mingdynastie in China sie durch Erteilung der Königswürde an mehrere andre tibetische Patriarchen zu schwächen. Die Schüler des berühmten Tsongkhapa (geb. 1357, gest. 1417 oder 1429), der bei den Lamaisten fast ebensohoch gefeiert war wie Buddha, begründeten ein neues System der Hierarchie. Tsongkhapa selbst war Gründer der Gelugpa oder Tugendsekte gewesen (nach ihrem Heimatskloster auch Galdanpa genannt), die als unterscheidendes Merkmal die gelbe Mütze im Gegensatz gegen die übliche rote annahm. Er trat den Auswüchsen der unter den Rotmützen üblichen Zaubergaukeleien entgegen und richtete die großen gemeinschaftlichen Gebete »Monlam« ein. In der Folge führte diese Reform zu einer neuen Entwickelung der Hierarchie und zur Gründung eines doppelten Papsttums mit eigentümlicher Nachfolge. An der Spitze der lamaischen Kirche stehen nämlich seitdem zwei oberste Bischöfe, der Dalai Lama (»Ozeanpriester«, d.h. Priester, groß wie der Ozean) zu Lhassa und der Bogdo Lama zu Taschi Lhuupo, beide an Heiligkeit und Würde einander gleich (s. Dalai Lama). Beide werden, wenn sie sterben, stets für dieselbe Stellung wiedergeboren: mit andern Worten, diese Würden werden mit Kindern besetzt, die für Inkarnationen der frühern Inhaber dieser Würde gelten. Als unter dem fünften Dalai Lama die Rotmützen die geistliche Herrschaft der Gelbmützen…
related match: Tibetan Buddhism
in scheme: travel!digital Thesaurus
pref label: Lamaismus

Lamaismus
type: Label
in scheme: travel!digital Thesaurus

Buddhismus
type: Label
in scheme: travel!digital Thesaurus

Apollo
type: Concept
definition: bdk: sakrale Kunst | Duden: Gott der Dichtkunst | Meyers Großes Konversations-Lexikon 1905: Apollon (lat. Apollo), in der griech. Mythologie Sohn des Zeus und der Leto, die ihn nebst seiner Zwillingsschwester Artemis nach der verbreitetsten Sage auf der Insel Delos gebar. Seinem ursprünglichen Wesen nach erscheint A. als ein Gott des Lichtes in seiner heilsamen wie verderblichen Wirkung; zum eigentlichen Sonnengott an Stelle des Helios ist er erst im Laufe der Zeit geworden. Als den »Lichten«, »Leuchtenden« bezeichnet ihn sein Beiname Phöbos, zugleich als den »Reinen«, »Heiligen«; denn als Gott des reinen Lichtes ist er Feind aller Finsternis und alles ihr verwandten Unreinen, Unholden und Frevelhaften. Als Gott des Lichtes war er auch Ordner der Zeiten, und so waren ihm alle Neu- und Vollmondstage sowie der 7. und 20. Tag jedes Monats heilig. Nach der an manchen seiner Kultstätten herrschenden Anschauung zog er im Winter nach Lykien oder Äthiopien oder zu den im fernsten Norden in ewigem [620] Lichte wohnenden Hyperboreern, um im Frühling zurückzukehren und mit seinen Strahlen die Macht des Winters zu brechen. Wenn der Mythus erzählt, er habe gleich nach seiner Geburt mit den ersten Pfeilen seines Bogens den Drachen Python (s. d.) erlegt, so bedeutet dies den Sieg des Frühlingsgottes über den Winter. Als Lichtgott hatte er im Frühling, Sommer und Herbst seine Feste, von denen manche seine natürliche Bedeutung in einzelnen Zügen noch klar erkennen lassen. So bezog sich das ihm im April in Athen gefeierte Fest der Delphinien auf die nach den Winterstürmen eintretende Beruhigung des Meeres und die damit verbundene Wiedereröffnung der Schiffahrt. Die im folgenden Monat in Athen und anderwärts gefeierten Thargelien (s. d.) galten dem Sommergotte, dem man für das Reisen der Feldfrüchte deren Erstlinge, zugleich aber auch Sühnopfer darbrachte, um die verderbliche Hitze abzuwenden. Gleiche Bedeutung hatten die Delien auf Delos. Zur Zeit des höchsten Sonnenstandes, im Juli …
narrower: Torso des Apollon
in scheme: travel!digital Thesaurus
pref label: Apollo

Torso des Apollon
type: Concept
definition: bdk: sakrale Kunst | Duden: Torso: 1. menschlicher Körper ohne Kopf und Gliedmaßen; Rumpf | 2. (Kunstwissenschaft) (unvollständig erhaltene oder gestaltete) Statue mit fehlenden Gliedmaßen [und fehlendem Kopf] | Meyers Großes Konversations-Lexikon 1909: Torso (ital., »Strunk«), in der Kunstsprache der Rumpf einer Bildsäule, der Kopf, Arme und Beine fehlen. Berühmt ist der im Belvedere des Vatikans aufgestellte T. des Herakles (»T. vom Belvedere«, Abbildung s. Herakles, S. 186), der unter Papst Clemens VII. aus dem Besitze der Colonna in den Vatikan kam, ein Werk des Bildhauers Apollonios (s. d. 4). Von hervorragender Bedeutung ist auch der T. des sogen. Ilioneus, des jüngsten Sohnes der Niobe, in der Münchener Glyptothek (vgl. Niobe). | Quelle: Meyers Großes Konversations-Lexikon, Band 19. Leipzig 1909, S. 629. | Permalink: http://www.zeno.org/nid/20007594666
in scheme: travel!digital Thesaurus
pref label: Torso des Apollon
related match: Apollo

Torso des Apollon
type: Label
in scheme: travel!digital Thesaurus

Apollo
type: Label
in scheme: travel!digital Thesaurus

größte Darstellung des sogenannten thrakischen Reiters
type: Concept
definition: bdk: sakrale Kunst
in scheme: travel!digital Thesaurus
pref label: größte Darstellung des sogenannten thrakischen Reiters

größte Darstellung des sogenannten thrakischen Reiters
type: Label
in scheme: travel!digital Thesaurus

Triumphbogen
type: Concept
definition: bdk: profane Kunst | Dude: 1. (besonders in der Antike) meist aus Anlass eines Sieges, zur Ehrung eines Feldherrn oder Kaisers errichtetes Bauwerk in Gestalt eines großen, frei stehenden Tores mit einem oder mehreren bogenförmigen Durchgängen | 2. (besonders in mittelalterlichen Kirchen) Bogen vor der Apsis oder dem Querschiff, der häufig mit einer Darstellung des Triumphes Christi oder der Kirche geschmückt ist | Meyers Großes Konversations-Lexikon 1909: Triumphbogen (Arcus oder Fornix triumphalis), ein frei stehendes, torförmiges Gebäude, das ursprünglich in Rom zu Ehren triumphierender Kaiser oder Feldherren errichtet wurde und entweder nur einen Durchgang oder einen Hauptdurchgang und zwei Nebendurchgänge, sämtlich mit halbkreisförmigem Abschluß, enthält. Noch erhaltene T. in Rom sind, außer den Trümmern des Triumphbogens des Drusus, diejenigen des Titus, Septimius Severus und Constantinus (s. Tafel »Architektur V«, Fig. 7). Andre Bauten der Art sind Ehrenbogen, wie der des Gallienus, oder Durchgangsbogen, wie die des Janus und der des Dolabella. Außerhalb Roms sind erhalten:[731] der T. des Augustus zu Rimini. dann die zu Susa, Aosta und Fano; die des Trajan zu Ancona und Benevent, der des Hadrian in Athen, der des Marius zu Orange in Frankreich. Außerdem gibt es noch T. zu Pola, Verona, St.-Remy in Südfrankreich und Capara in Spanien. In neuerer Zeit sind T. in Paris (Arc de triomphe du Carrousel und de l'Étoile), Mailand (Arco della Pace), Innsbruck, München (Siegestor) u. a. O. errichtet worden. Alle diese T. sind mit reichem bildnerischen Schmuck, besonders mit Reliefs (s. Tafel »Bildhauerkunst VI«, Fig. 7) ausgestattet. In der altchristlichen und armenischen Basilika heißt T. der vor dem Sanktuarium, in der gotischen Kirche der zwischen Schiff und Chor befindliche hohe Scheidebogen, über dem gewöhnlich der triumphierende Erlöser dargestellt war, oder in dem ein mächtiges Kruzifix hing. | Quelle: Meyers Großes Konversations-Lexikon, Band 19. Leipzig 1909, S…
in scheme: travel!digital Thesaurus
pref label: Triumphbogen

Triumphbogen
type: Label
in scheme: travel!digital Thesaurus

Schieferstatue Thutmosis’ II.
type: Concept
definition: bdk: sakrale Kunst | Duden: Statue: frei stehende Plastik (1), die einen Menschen oder ein Tier in ganzer Gestalt darstellt | Meyers Großes Konversations-Lexikon 1909: Statŭe (lat. statua, franz. statue, spr. statǖ', Stand bild), die durch die Tätigkeit des bildenden Künstlers in irgendeiner, meist harten Masse dargestellte volle[869] Gestalt, besonders des Menschen. Im Altertum und in der neuern Zeit bis zur Zeit der Renaissance pflegte man statuarische Bildwerke zur Belebung und Verdeutlichung der Formen mehr oder weniger reich zu bemalen, was in unsrer Zeit wieder aufgenommen worden ist (s. Polychromie). Man unterschied schon im griechischen Altertum Idealstatuen, d. h. der Phantasie entsprungene Gestalten (Götter, Heroen etc.), und Porträtstatuen. Die Porträtstatuen kamen erst verhältnismäßig spät durch die Sitte auf, in Olympia Statuen der Sieger in den Wettkämpfen aufzustellen. Doch waren auch diese anfangs ideal, d. h. nicht porträtähnlich, gehalten. Noch später kam dazu das Genrebild, das Personen und Vorgänge aus dem Alltagsleben als Einzelstatuen oder Gruppen darstellt. In der römischen, besonders kaiserlichen, Zeit wurden in großer Menge Porträtstatuen gefertigt. Die moderne Bildhauerkunst versteht unter S. im weitesten Sinne jede plastische Einzelfigur, im engern Sinn ein stehendes Bild. Statuette, Standbildchen. Vgl. Bildhauerkunst und Säule (S. 640). | Quelle: Meyers Großes Konversations-Lexikon, Band 18. Leipzig 1909, S. 869-870. | Permalink: http://www.zeno.org/nid/20007517459
in scheme: travel!digital Thesaurus
pref label: Schieferstatue Thutmosis’ II.
related match: Thutmose II
related match: Statue

Schieferstatue Thutmosis’ II.
type: Label
in scheme: travel!digital Thesaurus

Kalksteinstatuen des Prinzen Ra-hotep und seiner Gemahlin Nofret
type: Concept
related match: Statue
in scheme: travel!digital Thesaurus
definition: bdk: sakrale Kunst | Duden: Kalkstein: meist aus [Meer]wasser abgesetztes, vorwiegend aus Kalkspat bestehendes Sedimentgestein, das als Rohstoff besonders in der chemischen und der Bauindustrie Verwendung findet | Duden: Statue: frei stehende Plastik (1), die einen Menschen oder ein Tier in ganzer Gestalt darstellt | Meyers Großes Konversations-Lexikon 1907: Kalkstein, Gestein, das wesentlich aus Kalkspat oder Calcit besteht und grob- oder feinkörnig, dicht, oolithisch, kompakt und zellig, porös (Kalktuff, s. d.) sowie erdig (Kreide, s. d.) und sandig (Kalksand) auftritt. Der körnige K. heißt Marmor (s. d.), aber auch der dichte K. erweist sich unter dem Mikroskop sehr feinkörnig. Während der Marmor oft ganz weiß ist, ist der dichte K. meist grau oder gelblichgrau, auch schwarz, rötlich oder bräunlich. Mancher K. ist reiner kohlensaurer Kalk, andre gehen durch steigenden Magnesiagehalt in Dolomit oder durch Tongehalt in Mergel, einige auch in Sandstein über; die rötlich oder braun, auch ockergelb gefärbten enthalten Eisenoxyd oder Eisenhydroxyd (sogen. Eisenkalkstein), die dunkeln organische, zuweilen beim Anschlagen stark bituminös riechende Substanz (sogen. Stinkkalke), vielen ist Kieselsäure beigemengt (vgl. Kieselkalkstein). Kalksteine sind durch alle sedimentären Formationen verbreitet (vgl. Tafel »Bergformen II«, Fig. 2 u. 4); hervorzuheben sind die körnigen Kalke der kristallinischen Schiefer, die Lager von dichtem K. im Silur und Devon, der Kohlenkalk, der Zechstein (des obern Perm), der »Muschelkalk« der mittlern Trias, der K. der Juraformation, der Hippuritenkalk der Kreide, der tertiäre (eocäne) Nummulitenkalk, auch der Grobkalk des Pariser Beckens. Seiner Entstehung nach ist der K. entweder eine marine Bildung und dann unter Mitwirkung von kalkabsondernden Organismen (Kalkalgen, Foraminiferen, Spongien, Korallen, Echinodermen, Mollusken, Würmer etc.), deren Reste z. T. noch vom K. umschlossen werden, gebildet (Lithothamnienkalk, Korallenkalk, Krinoidenka…
related match: Prince Rahotep
related match: Limestone
pref label: Kalksteinstatuen des Prinzen Ra-hotep und seiner Gemahlin Nofret
related match: Nofret

Kalksteinstatuen des Prinzen Ra-hotep und seiner Gemahlin Nofret
type: Label
in scheme: travel!digital Thesaurus

Brunnen Achmed’s III.
type: Concept
pref label: Brunnen Achmed’s III.
alternative label: Brunnen Ahmeds III.
related match: Water well
alt label: Brunnen Ahmeds III.
in scheme: travel!digital Thesaurus
definition: bdk: profane Kunst
related match: Ahmed III

Brunnen Achmed’s III.
type: Label
hasVariant: Brunnen Ahmeds III.
in scheme: travel!digital Thesaurus

Brunnen Ahmeds III.
type: Label
isVariantOf: Brunnen Achmed’s III.
in scheme: travel!digital Thesaurus

Karyatide
type: Concept
definition: bdk: profane Kunst | Duden: weibliche Statue mit langem Gewand, die anstelle einer Säule das Gebälk eines Bauwerks trägt (in der Architektur der Antike) | Meyers Großes Konversations-Lexikon 1907: Karyatīden (griech.), in lange, faltenreiche Gewänder gekleidete weibliche Gestalten, die, auf einer meist gegliederten Plinthe stehend, eine Art Kapitell tragen und so das Gebälk einer Vorhalle oder eines sonstigen Vorbaues unterstützen. | Nach Vitruv waren die K. Nachbilder griechischer Frauen aus der Stadt Karyä im Peloponnes, die zur Strafe für ihre Unterstützung der Perser in Gefangenschaft abgeführt, zu öffentlichen Arbeiten gebraucht und dann von den Architekten zur Hindeutung auf ihre Dienstbarkeit als Lastträgerinnen dargestellt wurden. Lessing dagegen leitet ihren Ursprung von den Jungfrauen ab, die am Feste der Diana im Tempel zu Karyä tanzten. Noch andre identifizieren sie mit den Kanephoren (s. d.) der Panathenäen. Übrigens haben schon die Ägypter menschliche Figuren zu Säulen verwendet, wie denn später auch männliche, zu gleichem Zweck dienende Figuren K., richtiger aber Atlanten, Telamonen oder persische Bildsäulen genannt werden. Die künstlerisch vollendetsten K. des Altertums sind die sechs weiblichen Statuen, die das Gebälk der auf der Südseite des Erechtheions zu Athen in ionischem Stil erbauten Vorhalle tragen (s. diese auf Tafel »Architektur III«, Fig. 8, und die obenstehende Abbildung). Daher karyandische Ordnung die Bauart, bei der statt der Säulen weibliche Figuren zum Tragen der Decke oder des Gebälks angebracht werden. Vgl. Wolters, Karyatiden (»Zeitschrift für bildende Kunst«, neue Folge, Bd. 6, 1895).[703] | Quelle: Meyers Großes Konversations-Lexikon, Band 10. Leipzig 1907, S. 703-704. | Permalink: http://www.zeno.org/nid/2000687472X
in scheme: travel!digital Thesaurus
pref label: Karyatide

Karyatide
type: Label
in scheme: travel!digital Thesaurus

Statue eines Jünglings
type: Concept
definition: bdk: profane Kunst | Duden: Statue: frei stehende Plastik (1), die einen Menschen oder ein Tier in ganzer Gestalt darstellt | Meyers Großes Konversations-Lexikon 1909: Statŭe (lat. statua, franz. statue, spr. statǖ', Stand bild), die durch die Tätigkeit des bildenden Künstlers in irgendeiner, meist harten Masse dargestellte volle[869] Gestalt, besonders des Menschen. Im Altertum und in der neuern Zeit bis zur Zeit der Renaissance pflegte man statuarische Bildwerke zur Belebung und Verdeutlichung der Formen mehr oder weniger reich zu bemalen, was in unsrer Zeit wieder aufgenommen worden ist (s. Polychromie). Man unterschied schon im griechischen Altertum Idealstatuen, d. h. der Phantasie entsprungene Gestalten (Götter, Heroen etc.), und Porträtstatuen. Die Porträtstatuen kamen erst verhältnismäßig spät durch die Sitte auf, in Olympia Statuen der Sieger in den Wettkämpfen aufzustellen. Doch waren auch diese anfangs ideal, d. h. nicht porträtähnlich, gehalten. Noch später kam dazu das Genrebild, das Personen und Vorgänge aus dem Alltagsleben als Einzelstatuen oder Gruppen darstellt. In der römischen, besonders kaiserlichen, Zeit wurden in großer Menge Porträtstatuen gefertigt. Die moderne Bildhauerkunst versteht unter S. im weitesten Sinne jede plastische Einzelfigur, im engern Sinn ein stehendes Bild. Statuette, Standbildchen. Vgl. Bildhauerkunst und Säule (S. 640). | Quelle: Meyers Großes Konversations-Lexikon, Band 18. Leipzig 1909, S. 869-870. | Permalink: http://www.zeno.org/nid/20007517459
in scheme: travel!digital Thesaurus
pref label: Statue eines Jünglings
related match: Statue

Statue eines Jünglings
type: Label
in scheme: travel!digital Thesaurus

Kopf einer der Schlangen vom delphischen Dreifuß
type: Concept
definition: bdk: sakrale Kunst
alternative label: Schlangenkopf vom Dreifuß
in scheme: travel!digital Thesaurus
pref label: Kopf einer der Schlangen vom delphischen Dreifuß
alt label: Schlangenkopf vom Dreifuß
related match: Sacrificial tripod

Kopf einer der Schlangen vom delphischen Dreifuß
type: Label
in scheme: travel!digital Thesaurus

Schlangenkopf vom Dreifuß
type: Label
in scheme: travel!digital Thesaurus

Bogen des Septimius Severus
type: Concept
definition: bdk: profane Kunst
pref label: Bogen des Septimius Severus
in scheme: travel!digital Thesaurus
related match: Septimius Severus

Bogen des Septimius Severus
type: Label
in scheme: travel!digital Thesaurus

Straßenbrunnen
type: Concept
related match: Water well
definition: bdk: profane Kunst
in scheme: travel!digital Thesaurus
pref label: Straßenbrunnen

Straßenbrunnen
type: Label
in scheme: travel!digital Thesaurus

Sandalenlöserin
type: Concept
definition: bdk: profane Kunst
in scheme: travel!digital Thesaurus
pref label: Sandalenlöserin

Sandalenlöserin
type: Label
in scheme: travel!digital Thesaurus

Philosophen-Herme
type: Concept
definition: bdk: profane Kunst | Duden: Herme: Pfeiler oder Säule, die mit einer Büste (ursprünglich des Gottes Hermes) gekrönt ist | Meyers Großes Konversations-Lexikon 1907: Hermen (griech.), im eigentlichen Wortsinne Bilder des Hermes (Mercurius), der häufig unter dem Bild eines viereckigen, oben breitern, unten schmäler zulaufenden Pfeilers (Herme) verehrt wurde; dann allgemeiner gebraucht für vierseitige Pfeiler, die in Büsten enden oder mit dem Oberkörper einer menschlichen Figur verbunden sind (s. Abbildung) und im alten Griechenland häufig auf öffentlichen Plätzen, Straßen und besonders an Kreuzwegen (als Wegweiser) aufgestellt wurden. | Von letzterer Form finden sich die schönsten, aus Griechenland stammenden Beispiele in der Villa Ludovisi in Rom. Die erstere pflegt an den Seiten des Pfeilers nahe am Kopfe je einen würfelartigen Vorsprung (Hände, griech. cheires, genannt) zum Aufhängen von Kränzen, vorn einen ausgerichteten Phallos (s. d.) zu haben. Die Entstehungszeit dieser Kunstform ist noch dunkel. Die älteste Zeit kennt sie noch nicht. Erst in der letzten Epoche der altertümlichen Kunst finden sich Beispiele; diese verbinden aber den menschlichen Oberkörper, der bis zu den Hüften reicht, mit dem vierseitigen Pfeiler und lassen sogar lebhafte Bewegung der Figur zu (so die Herme eines Diskobols in der Villa Ludovisi zu Rom). Später wird gewöhnlich Kopf und Pfeiler zusammen verbunden. Wenn auf der Herme das Bild eines andern Gottes oder Heros als des Merkur stand, so verband man den Namen Herme mit dem Namen des aufgestellten Kopfes; daher die Benennungen Hermares (Herme des Ares), Hermathene (der Athene), Hermerakles (des Herakles), Hermeros (des Eros), Hermapollon (des Apollon), Hermamithras (des Mithras), Hermalkibiades (des Alkibiades, sehr zahlreich in Athen). Gewöhnlich waren die H. nackt, selten bekleidet oder mit charakteristischen Attributen, desto häufiger mit Inschriften versehen, auch meist männlich. In der spätern Zeit wurde die Hermenform auch allgemei…
related match: Herma
in scheme: travel!digital Thesaurus
pref label: Philosophen-Herme

Philosophen-Herme
type: Label
in scheme: travel!digital Thesaurus

Statue der Freiheit
type: Concept
definition: bdk: profane Kunst | Duden: große Statue im Hafen von New York, die eine Frau mit hoch erhobener Fackel darstellt und die [politische] Freiheit symbolisiert | Duden: Statue: frei stehende Plastik (1), die einen Menschen oder ein Tier in ganzer Gestalt darstellt | Meyers Großes Konversations-Lexikon 1909: Statŭe (lat. statua, franz. statue, spr. statǖ', Stand bild), die durch die Tätigkeit des bildenden Künstlers in irgendeiner, meist harten Masse dargestellte volle[869] Gestalt, besonders des Menschen. Im Altertum und in der neuern Zeit bis zur Zeit der Renaissance pflegte man statuarische Bildwerke zur Belebung und Verdeutlichung der Formen mehr oder weniger reich zu bemalen, was in unsrer Zeit wieder aufgenommen worden ist (s. Polychromie). Man unterschied schon im griechischen Altertum Idealstatuen, d. h. der Phantasie entsprungene Gestalten (Götter, Heroen etc.), und Porträtstatuen. Die Porträtstatuen kamen erst verhältnismäßig spät durch die Sitte auf, in Olympia Statuen der Sieger in den Wettkämpfen aufzustellen. Doch waren auch diese anfangs ideal, d. h. nicht porträtähnlich, gehalten. Noch später kam dazu das Genrebild, das Personen und Vorgänge aus dem Alltagsleben als Einzelstatuen oder Gruppen darstellt. In der römischen, besonders kaiserlichen, Zeit wurden in großer Menge Porträtstatuen gefertigt. Die moderne Bildhauerkunst versteht unter S. im weitesten Sinne jede plastische Einzelfigur, im engern Sinn ein stehendes Bild. Statuette, Standbildchen. Vgl. Bildhauerkunst und Säule (S. 640). | Quelle: Meyers Großes Konversations-Lexikon, Band 18. Leipzig 1909, S. 869-870. | Permalink: http://www.zeno.org/nid/20007517459
related match: Statue
pref label: Statue der Freiheit
in scheme: travel!digital Thesaurus

Statue der Freiheit
type: Label
in scheme: travel!digital Thesaurus

Metopen
type: Concept
definition: bdk: profane Kunst | Duden: Metope: im Gebälkfries des dorischen Tempels mit Triglyphen wechselnde, fast quadratische, bemalte oder mit Reliefs verzierte Platte aus gebranntem Ton oder Stein | Meyers Großes Konversations-Lexikon 1908: Metōpen (v. griech. metōpon, Stirn, Vorderseite; Zwischenfelder), in der Baukunst Bezeichnung der zwischen den Triglyphen befindlichen Öffnungen oder Zwischenfelder des dorischen Frieses, die auf dem über die Säulen gestreckten Architrav ruhen u. das Hauptgesims tragen. | Anfangs waren die M. offen und wurden dann mit Vasen oder Schädeln von Opfertieren besetzt; später wurden sie geschlossen, doch stets etwas hinter die Balkenköpfe zurückgerückt, nachmals auch mit Skulpturen verziert. Da sie fast quadratisch waren, so machte ihre Einteilung, wenn größere Säulenweite angenommen ward, Schwierigkeiten, daher die ionische Säulenordnung nur noch den glatten Fries und M. nur am Kranzgesims zeigt. S. die Abbildung und Tafel »Säulenordnungen«, Fig. 1–3. | Quelle: Meyers Großes Konversations-Lexikon, Band 13. Leipzig 1908, S. 715. | Permalink: http://www.zeno.org/nid/20007083149
related match: Selinunte
pref label: Metopen
in scheme: travel!digital Thesaurus

Metopen
type: Label
in scheme: travel!digital Thesaurus

Fragmente reich skulptierter Säulen
type: Concept
definition: bdk: profane Kunst | Duden: Säule: 1. a. walzenförmige [sich nach oben leicht verjüngende], meist aus Basis, Schaft und Kapitell bestehende senkrechte Stütze eines Bauwerks, die aber auch frei stehend dekorativen Zwecken dienen kann
related match: Column
in scheme: travel!digital Thesaurus
pref label: Fragmente reich skulptierter Säulen

Fragmente reich skulptierter Säulen
type: Label
in scheme: travel!digital Thesaurus

Minute Man
type: Concept
related match: Daniel Chester French
definition: bdk: profane Kunst
pref label: Minute Man
in scheme: travel!digital Thesaurus

Minute Man
type: Label
in scheme: travel!digital Thesaurus

William Henry Rinehart, Samariterin
type: Concept
related match: Parable of the Good Samaritan
definition: bdk: sakrale Kunst | Duden: samariter: selbstlos helfender Mensch | Meyers Großes Konversations-Lexikon 1909: Samarīter, soviel wie Samaritaner; nach Luk. 10, 33 sprichwörtlich für: barmherziger Mann. Die biblische Erzählung vom barmherzigen S. wurde häufig in der Malerei dargestellt, so von Jacopo Bassano (Nationalgalerie in London und kaiserliche Galerie in Wien), Paolo Veronese (in der Galerie zu Dresden), Rembrandt (London, Wallace-Sammlung; Paris, Louvre, u. ö.), auch in einer plastischen Gruppe von Kundmann. | Quelle: Meyers Großes Konversations-Lexikon, Band 17. Leipzig 1909, S. 512. | Permalink: http://www.zeno.org/nid/20007392206
related: Christentum
in scheme: travel!digital Thesaurus
pref label: William Henry Rinehart, Samariterin
related match: William Henry Rinehart

William Henry Rinehart, Samariterin
type: Label
in scheme: travel!digital Thesaurus

Skulpturen
type: Concept
narrower: Skulpturen vom Boroboedoer
pref label: Skulpturen
in scheme: travel!digital Thesaurus
definition: bdk: profane, sakrale Kunst | Duden: Skulptur: 1. Werk eines Bildhauers, Plastik | 2. <ohne Plural> Bildhauerkunst | Meyers Großes Konversations-Lexikon 1909: Skulptur (lat.), diejenige Art der Bildnerei, die ihre Werke mit Schlägel und Meißel aus dem harten Stoff heraushaut, s. Bildhauerkunst; auch soviel wie Bildhauerarbeit, Schnitzwerk. | Quelle: Meyers Großes Konversations-Lexikon, Band 18. Leipzig 1909, S. 535. | Permalink: http://www.zeno.org/nid/20007485077

Skulpturen vom Boroboedoer
type: Concept
definition: bdk: profane Kunst
related: Buddhismus
in scheme: travel!digital Thesaurus
pref label: Skulpturen vom Boroboedoer
related match: Borobudur

Skulpturen vom Boroboedoer
type: Label
in scheme: travel!digital Thesaurus

Skulpturen
type: Label
in scheme: travel!digital Thesaurus

Reiterstandbild Des General Lee
type: Concept
related match: Robert E. Lee
definition: bdk: profane Kunst | Duden: Standbild eines Reiters auf dem Pferd
related match: Equestrian statue
pref label: Reiterstandbild Des General Lee
in scheme: travel!digital Thesaurus

Reiterstandbild Des General Lee
type: Label
in scheme: travel!digital Thesaurus

Kruzifix
type: Concept
definition: bdk: sakrale Kunst | Duden: Nachbildung, plastische Darstellung des gekreuzigten Christus; Kreuz mit dem gekreuzigten Christus | Meyers Großes Konversations-Lexikon 1907: Kruzifix (eigentlich der K., vom lat. crucifixus, »der Gekreuzigte«; holländ. Kruisbeeld, »Kreuzbild«), das Bild Christi am Kreuz, in Holz, Metall, Elfenbein etc. ausgeführt. Es trat erst seit dem 5. Jahrh. an Stelle des Kreuzes, das bis dahin das Symbol Christi gewesen war. Bis zum Ende des 9. Jahrh. wurde der Gekreuzigte lebend dargestellt. Man findet ihn sowohl mit einem schmalen Schurz als auch mit einem langen Gewand oder mit einer von den Hüften bis auf die Füße reichenden Tunika bekleidet. | Im Mittelalter kommt nur der schmale Schurz vor. Auf den ältesten noch vorhandenen Kruzifixen (in einer syrischen Evangelienhandschrift vom Mönch Rabula und dem zu Monza aus dem 6. und Anfang des 7. Jahrh.) ist Christus mit vier Nägeln an Händen und Füßen dargestellt. Die byzantinischen Kruzifixe sind besonders an der starken Ausbiegung des Körpers kenntlich, die in geringerm Maß auch von deutschen und italienischen Künstlern nachgeahmt worden ist. Gegen das Ende des Mittelalters gewann die Kreuzigung mit gekreuzten Füßen (also im ganzen mit drei Nägeln) immer mehr Verbreitung. Man unterschied Altarkreuze und Vortragkreuze. Erstere waren mit einem Fuß, letztere unten mit einer eisernen Spitze versehen, um auf Stangen gesteckt zu werden, da sie bei den Prozessionen vorausgetragen wurden (s. Abbildungen 1–3). Bisweilen wurden zu den Vortragkreuzen Füße gearbeitet, so daß sie auch als Altarkreuze verwendet werden konnten (s. Tafel »Goldschmiedekunst«, Fig. 10). Als[754] vornehmster Altarschmuck erhielt das K. frühzeitig eine kostbare Ausstattung. Wenn es aus Metall (Gold, Silber, Bronze, Kupfer) gefertigt war, wurde es mit Email, mit (meist antiken) Gemmen, Kameen, Edelsteinen, Bergkristallen, Filigran etc. verziert. Die künstlerisch bedeutendsten Kruzifixe gehören der romanischen und der gotischen Epoche a…
related: Christentum
in scheme: travel!digital Thesaurus
pref label: Kruzifix

Kruzifix
type: Label
in scheme: travel!digital Thesaurus

Marmorbildwerke
type: Concept
definition: bdk: sakrale Kunst | Duden: Marmor: weißes oder farbiges, häufig geädertes, sehr hartes Kalkgestein, das besonders in der Bildhauerei und als Baumaterial verwendet wird | Meyers Großes Konversations-Lexikon 1908: Marmor (Marmelstein, Urkalkstein zum Teil, körniger Kalkstein), kristallinisch-körniges Aggregat von Kalkspat (kohlensaurer Kalk), grob- bis feinkörnig (zuckerartig) und dicht, Härte 3, durchscheinend bis kantendurchscheinend, weiß in allen Nuancen, grau, rot und schwarz, seltener gelb, blau, bald einfarbig, bald bunt, flammig, geädert, wolkig und fleckig, daher der Ausdruck marmoriert. Häufig enthält der M. akzessorische Bestandteile, wie Glimmer, Talk, Chlorit, Serpentin, Graphit, Granat, Vesuvian, Apatit, Spinell, Magneteisen, Eisenkies, Augit, Hornblende, Quarz, Korund, Zirkon, Turmalin etc. Während der Mineralog nur diejenigen Gesteine als M. bezeichnet, die eine kristallinische körnige Struktur besitzen und wesentlich aus kohlensaurem Kalk bestehen, vielleicht auch in geringer Menge noch kohlensaure Magnesia enthalten (alsdann Übergänge in den Dolomit bildend, Dolomitmarmor), werden in der Technik alle Kalksteine, die schön gefärbt sind und wegen ihres dichten Gefüges, ihrer Festigkeit, beim Schleifen eine schöne Politur annehmen, mit dem Namen M. belegt, zuweilen sogar solche Gesteine, die gar keinen kohlensauren Kalk oder solchen nur in verschwindend kleiner Menge enthalten. Sehen wir von den letztern, welche die Bezeichnung M. nicht verdienen, ab, so ergibt sich, daß der M., bisweilen deutlich geschichtet und in der Regel unregelmäßig zerklüftet, besonders häufig als Einlagerung im kristallinischen Grundgebirge vorkommt. Er bildet hier Lager und Stöcke von unregelmäßiger Gestalt, die sich bisweilen gangartig in das umschließende Gestein fortsetzen (so in Schlesien, in Sachsen, im Fichtelgebirge, bei Auerbach an der Bergstraße etc.). Außerdem findet sich M. im Silur (Schlesien, Erzgebirge, Insel Gotland), Devon (Nassau, Westfalen, Harz), Karbon (Bel…
in scheme: travel!digital Thesaurus
pref label: Marmorbildwerke
related match: Marble

Marmorbildwerke
type: Label
in scheme: travel!digital Thesaurus

Tänzerin
type: Concept
definition: bdk: profane, sakrale Kunst (?)
in scheme: travel!digital Thesaurus
pref label: Tänzerin
related match: Dance

Tänzerin
type: Label
in scheme: travel!digital Thesaurus

keltischer Krieger
type: Concept
definition: bdk: profane Kunst
pref label: keltischer Krieger
in scheme: travel!digital Thesaurus

keltischer Krieger
type: Label
in scheme: travel!digital Thesaurus

Büste eines hellenistischen Dichters mit Efeukranz
type: Concept
definition: bdk: profane Kunst | Duden: 1. Büste: plastische Darstellung eines Menschen in Halbfigur oder nur bis zur Schulter | Meyers Großes Konversations-Lexikon 1905: Büste (ital. Busto, »Brustbild«), plastisches Kunstwerk in vollrunder Arbeit, das einen menschlichen Kopf mit einem Teil der Brust (daher der Name) darstellt, unmittelbar auf einer runden, vier- oder mehreckigen Basis ruht, wodurch es sich von der Herme unterscheidet,[657] und aus Marmor, Gips, Metall, Holz, Ton, Wachs oder einer andern bildsamen Masse verfertigt ist. Die Kunstform der B. tritt in römischer Zeit an Stelle der in der griechischen Kunst allein üblich gewesenen Herme (s.d.). Damals schon kam als seltenere Abart die B. mit ganzem, auf einen runden Fuß gesetztem Oberkörper auf, eine Form, die die Florentiner Plastik im 15. Jahrh. mit und ohne Verwendung des Fußes wieder aufnahm. Man kann Porträt- und Idealbüsten unterscheiden. Während die erstern das Brustbild einer bestimmten Person geben, sind die letztern vom Künstler erfundene individuelle Bildungen idealen Charakters. Auch bei ihnen pflegt der Künstler wirklich existierende Personen als Modelle zu gebrauchen, denen er einen seiner Idee entsprechenden Ausdruck gibt. Bedeutendes haben in der Schöpfung von Büsten namentlich die Römer geleistet, die bereits in der Form des Fußes und seiner Verbindung mit dem Bruststück große Mannigfaltigkeit erreicht haben. Die Ahnenbilder der Römer (imagines) hatten nicht Büstenform, sondern waren aus Wachs über dem Leben geformte Masken (cerae). Die Benennung der uns zahlreich überkommenen Büsten wieder Porträte überhaupt bildet als Ikonographie einen Teil der Altertumswissenschaft. Vgl. Gurlitt, Versuch über die Büstenkunde (Magdeb. 1800); Visconti, Iconographie grecque (2. Aufl., Par. 1811, 3 Bde.) und Iconographie romaine (2. Aufl., das. 1817–33, 4 Bde.); Bernoulli, Römische Ikonographie (Stuttg. 1882–94, 4 Bde.). In Bezug auf die Mannigfaltigkeit der Büstenabschlüsse wurden die Römer durch die Künstler der B…
in scheme: travel!digital Thesaurus
pref label: Büste eines hellenistischen Dichters mit Efeukranz

Büste eines hellenistischen Dichters mit Efeukranz
type: Label
in scheme: travel!digital Thesaurus

Reliefdarstellung eines Schiffers (?)
type: Concept
definition: bdk: sakrale Kunst | Duden: Relief: (bildende Kunst) aus einer Fläche (aus Stein, Metall o. Ä.) erhaben herausgearbeitetes oder in sie vertieftes Bildwerk | Meyers Großes Konversations-Lexikon 1908: Relief (franz., spr. rölheff, ital. riliēvo), erhabene Arbeit, diejenige Gattung der Bildnerei, welche die Figuren aus einer Ebene oder vertieften Fläche, dem Grunde, erhaben heraustreten läßt. Das R. bildet eine Mittelgattung zwischen der eigentlichen Skulptur, von der sie die Darstellungsweise, und der Malerei, von der sie die Anordnung hat, so zwar, daß das plastische Prinzip mehr in den einfachen, ruhigen Reliefs der ältern griechischen Kunst, das malerische dagegen in den überfüllten, oft heftig bewegten der spätern römischen Kunst vorherrscht. Man unterscheidet das Flachrelief (Basrelief, basso rilievo), bei dem die Figuren nur wenig über den Grund heraustreten, von dem Hochrelief (Hautrelief, alto rilievo), bei dem sie etwa halbrund modelliert sind. Sind einzelne Teile rundplastisch herausgearbeitet oder unterschnitten, so spricht man von hocherhabener Arbeit. Reliefs sind schon in der altägyptischen und assyrischen Kunst sehr häufig. Bei den Ägyptern findet man neben dem Basrelief das Hohlrelief (R.en creux, Koilanaglyph, s. d. und Tafel »Bildhauerkunst I«, Fig. 8 u. 9; II, Fig. 3–5). Zu hoher Vollendung wurde das R. von den Griechen gebracht, die das Hochrelief vor allem bei den Metopen und Friesen der Tempel, das Flachrelief zur Ausschmükkung der Grabstelen etc. verwendeten. In der Blütezeit rollte man die Darstellung im wesentlichen auf, ohne jedoch Überschneidungen ängstlich zu vermeiden, wie denn auch die zur Raumfüllung nötige Isokephalie (gleiche Höhe der Köpfe) nicht pedantisch gehandhabt wurde (s. Tafel »Bildhauerkunst III«, Fig. 7 u. 9; IV, Fig. 4). Streng durchgeführt aber ist die Anordnung der Figuren auf einem Grunde. Durchaus malerisch gestaltet sind dagegen die hellenistischen Reliefs, die mit ihren landschaftlichen Hintergründen etc. als reine Übe…
in scheme: travel!digital Thesaurus
pref label: Reliefdarstellung eines Schiffers (?)
related match: Relief

Reliefdarstellung eines Schiffers (?)
type: Label
in scheme: travel!digital Thesaurus

Mosaiken
type: Concept
narrower: Glasmosaiken
narrower: Mosaik der Alexanderschlacht
narrower: Chebba [Mosaiken]
related match: Chora Church
in scheme: travel!digital Thesaurus
definition: bdk: profane, sakrale Kunst | Duden: Mosaik: aus kleinen bunten Steinen, Glasstücken o. Ä. zusammengesetztes Bild, Ornament zur Verzierung von Wänden, Gewölben, Fußböden | Meyers Großes Konversations-Lexikon 1908: Mosaīk (v. arab. musauik, »geschmückt«, lat. Opus musivum, ital. Musaico, franz. Mosaïque, musivische Arbeit), jede Flächenzeichnung oder Flächenmalerei, die durch eine Nebeneinanderreihung von verschieden farbigen festen Körpern hervorgebracht wird. Wahrscheinlich stammt die Kunst der M. aus dem Orient, wo sie schon Ägypter und Perser geübt haben sollen. Anfänglich wurde sie nur zur Verzierung der Fußböden benutzt, und zwar begann man mit großen Mustern, die aus geometrisch zugeschnittenen Scheiben von Stein oder Marmor gebildet wurden (pavimenta sectilia) und auch später noch im Gebrauch blieben. Allmählich wurden kleinere Würfel benutzt und die Zeichnung dadurch reichhaltiger, sie blieb aber zunächst auf den Fußboden beschränkt (pav. tendata, lithostrata), der in Tempeln, Säulengängen, Prachtgemächern immer prunkender wurde und in der alexandrinischen Zeit selbst figürliche Darstellungen aufnahm. Dann wendete man kleinste Stein- oder Glasflußstifte zur Erreichung feinerer Zeichnung an, behielt jedoch die Bestimmung des Fußbodens im Auge und ahmte im M. entweder Teppichmuster mit breiten Borten (so in dem Mosaikfußboden der Vorhalle des Zeustempels zu Olympia, s. auch Tafel »Ornamente I«, Fig. 45 u. 46) oder für Speisezimmer den Abfall der Mahlzeit nach, den man unter den Tisch zu werfen pflegte. Mosaiken dieser Art, oikos asarōtos (»ungekehrter Fußboden«) genannt, führte besonders Sosos von Pergamon in hoher Vollendung aus. Ein andres, vermutlich aus dieser Zeit stammendes Motiv gibt das berühmte Taubenmosaik aus Hadrians Villa bei Tivoli wieder, jetzt im kapitolinischen Museum, ein auf dem Boden stehendes Wasserbecken, auf dessen Rändern vier Tauben sitzen. Erst der überhandnehmende Luxus der ersten Kaiserzeit hielt die natürlichen Schranken des M. als…
pref label: Mosaiken
related match: Lambaesis
narrower: Sarkophag-Mosaiken

Glasmosaiken
type: Concept
related match: Mosaic
definition: bdk: sakrale Kunst
related match: Dome of the Rock
pref label: Glasmosaiken
in scheme: travel!digital Thesaurus

Glasmosaiken
type: Label
in scheme: travel!digital Thesaurus

Mosaik der Alexanderschlacht
type: Concept
related match: The Battle of Alexander at Issus
pref label: Mosaik der Alexanderschlacht
related match: Alexander the Great
in scheme: travel!digital Thesaurus
related match: Mosaic
definition: bdk: profane Kunst

Mosaik der Alexanderschlacht
type: Label
in scheme: travel!digital Thesaurus

Chebba [Mosaiken]
type: Concept
related match: Mosaic
definition: bdk: sakrale Kunst
in scheme: travel!digital Thesaurus
pref label: Chebba [Mosaiken]
related match: Chebba

Chebba [Mosaiken]
type: Label
in scheme: travel!digital Thesaurus

Mosaiken
type: Label
in scheme: travel!digital Thesaurus

Sarkophag-Mosaiken
type: Concept
related: Sarkophag
in scheme: travel!digital Thesaurus
related: Christentum
definition: bdk: sakrale Kunst
related match: Sarcophagus
related match: Mosaic
pref label: Sarkophag-Mosaiken

Sarkophag
type: Concept
narrower: spätrömischer Sarkophag
narrower: Alexandersarkophag
narrower: Sarkophag des Satrapen
related match: Sarcophagus
narrower: lykischer Sarkophag
in scheme: travel!digital Thesaurus
definition: bdk: sakrale Kunst | Duden: (meist aus Stein oder Metall gefertigter) prunkvoller, großer, in einer Grabkammer oder der Krypta einer Kirche o. Ä. aufgestellter Sarg, in dem hochgestellte Persönlichkeiten beigesetzt werden | Meyers Großes Konversations-Lexikon 1909: Sarkophág (griech., »Fleisch verzehrend«), ursprünglich eine Steinart, die bei Assos in Troas gegraben oder gebrochen ward, sich spalten ließ und Leichname in Särgen aus diesem Material innerhalb 40 Tagen, mit Ausnahme der Zähne, verzehren sollte. Dies Gestein war ein Alaunschiefer (der Alumen schisti Linnés), mit dem man übrigens die Särge zur Beförderung der Verwesung gewöhnlich nur auslegte. Der Name S. ward dann auch auf jeden andern Steinsarg übertragen. Die ägyptischen Sarkophage, die ältesten, die man gefunden, sind meist von Kalkstein, seltener von Basalt oder Marmor, meist mit Hieroglyphen und Reliefbildern geschmückt, der Sargdeckel auf der Kopfseite das Bildnis des Verstorbenen zeigend (s. Tafel »Grabmäler«, Fig. 1). Ähnlich sind die Sarkophage phönikischer Herkunft. In Sarkophagen von rotem oder schwärzlichem Granit wurden Könige und Priester beigesetzt. Im Gebiet der griechischen Welt kennen wir reichbemalte Stein- und Tonsärge der sogen. mykenischen Periode (Mitte des 2. Jahrtausends v. Chr.) aus Kreta. Zahlreiche bemalte Tonsärge des 6. Jahrh. v. Chr. sind in Klazomenä gefunden, jüngerer Zeit gehören griechische Holzsärge aus Südrußland und Ägypten an. Steinsarkophage, kastenartige Behälter mit flachem, gewölbtem oder giebelförmigem Deckel, mitunter architektonisch gegliedert, auch mit Malerei oder Reliefs geschmückt, kommen bei den Griechen schon in alter Zeit vor; prachtvolle, mit großen Relieffriesen verzierte Marmorsärge, die zu den Werken der alexandrinischen Epoche überführen, sind uns aus dem 4. Jahrh. erhalten (Amazonensarkophag in Wien, die Sarkophage von Sidon, darunter der Alexandersarkophag). Auch die Etrusker hatten Sarkophage aus Stein und Ton, später auch die Aschenkisten, kl…
narrower: Sarkophage griechischen Stils
narrower: Sarkophag der klagenden Frauen
pref label: Sarkophag

spätrömischer Sarkophag
type: Concept
definition: bdk: sakrale Kunst
pref label: spätrömischer Sarkophag
in scheme: travel!digital Thesaurus
related match: Sarcophagus

spätrömischer Sarkophag
type: Label
in scheme: travel!digital Thesaurus

Alexandersarkophag
type: Concept
related match: Sarcophagus
in scheme: travel!digital Thesaurus
pref label: Alexandersarkophag
definition: bdk: sakrale Kunst
related match: Alexander the Great

Alexandersarkophag
type: Label
in scheme: travel!digital Thesaurus

Sarkophag des Satrapen
type: Concept
alt label: sogenannter Sarg des Satrapen
related match: Satrap
alternative label: sogenannter Sarg des Satrapen
in scheme: travel!digital Thesaurus
definition: bdk: sakrale Kunst
related match: Sarcophagus
pref label: Sarkophag des Satrapen

sogenannter Sarg des Satrapen
type: Label
in scheme: travel!digital Thesaurus

Sarkophag des Satrapen
type: Label
in scheme: travel!digital Thesaurus

lykischer Sarkophag
type: Concept
definition: bdk: sakrale Kunst
in scheme: travel!digital Thesaurus
pref label: lykischer Sarkophag
related match: Sarcophagus

lykischer Sarkophag
type: Label
in scheme: travel!digital Thesaurus

Sarkophage griechischen Stils
type: Concept
definition: bdk: sakrale Kunst
in scheme: travel!digital Thesaurus
pref label: Sarkophage griechischen Stils
related match: Sarcophagus

Sarkophage griechischen Stils
type: Label
in scheme: travel!digital Thesaurus

Sarkophag der klagenden Frauen
type: Concept
definition: bdk: sakrale Kunst
in scheme: travel!digital Thesaurus
pref label: Sarkophag der klagenden Frauen
related match: Sarcophagus

Sarkophag der klagenden Frauen
type: Label
in scheme: travel!digital Thesaurus

Sarkophag
type: Label
in scheme: travel!digital Thesaurus

Sarkophag-Mosaiken
type: Label
in scheme: travel!digital Thesaurus

Gewandfiguren
type: Concept
definition: bdk: profane Kunst
in scheme: travel!digital Thesaurus
pref label: Gewandfiguren

Gewandfiguren
type: Label
in scheme: travel!digital Thesaurus

Relief mit dem Porträtbild des Euripides
type: Concept
related match: Euripides
definition: bdk: sakrale Kunst | Duden: Relief: (bildende Kunst) aus einer Fläche (aus Stein, Metall o. Ä.) erhaben herausgearbeitetes oder in sie vertieftes Bildwerk | Duden: Euripides: altgriechischer Tragiker | Meyers Großes Konversations-Lexikon 1908: Relief (franz., spr. rölheff, ital. riliēvo), erhabene Arbeit, diejenige Gattung der Bildnerei, welche die Figuren aus einer Ebene oder vertieften Fläche, dem Grunde, erhaben heraustreten läßt. Das R. bildet eine Mittelgattung zwischen der eigentlichen Skulptur, von der sie die Darstellungsweise, und der Malerei, von der sie die Anordnung hat, so zwar, daß das plastische Prinzip mehr in den einfachen, ruhigen Reliefs der ältern griechischen Kunst, das malerische dagegen in den überfüllten, oft heftig bewegten der spätern römischen Kunst vorherrscht. Man unterscheidet das Flachrelief (Basrelief, basso rilievo), bei dem die Figuren nur wenig über den Grund heraustreten, von dem Hochrelief (Hautrelief, alto rilievo), bei dem sie etwa halbrund modelliert sind. Sind einzelne Teile rundplastisch herausgearbeitet oder unterschnitten, so spricht man von hocherhabener Arbeit. Reliefs sind schon in der altägyptischen und assyrischen Kunst sehr häufig. Bei den Ägyptern findet man neben dem Basrelief das Hohlrelief (R.en creux, Koilanaglyph, s. d. und Tafel »Bildhauerkunst I«, Fig. 8 u. 9; II, Fig. 3–5). Zu hoher Vollendung wurde das R. von den Griechen gebracht, die das Hochrelief vor allem bei den Metopen und Friesen der Tempel, das Flachrelief zur Ausschmükkung der Grabstelen etc. verwendeten. In der Blütezeit rollte man die Darstellung im wesentlichen auf, ohne jedoch Überschneidungen ängstlich zu vermeiden, wie denn auch die zur Raumfüllung nötige Isokephalie (gleiche Höhe der Köpfe) nicht pedantisch gehandhabt wurde (s. Tafel »Bildhauerkunst III«, Fig. 7 u. 9; IV, Fig. 4). Streng durchgeführt aber ist die Anordnung der Figuren auf einem Grunde. Durchaus malerisch gestaltet sind dagegen die hellenistischen Reliefs, die mit ihren land…
in scheme: travel!digital Thesaurus
pref label: Relief mit dem Porträtbild des Euripides
related match: Relief

Relief mit dem Porträtbild des Euripides
type: Label
in scheme: travel!digital Thesaurus

Griechische Sklavin [Hiram Powers]
type: Concept
related match: Hiram Powers
pref label: Griechische Sklavin [Hiram Powers]
in scheme: travel!digital Thesaurus
definition: bdk: profane Kunst

Griechische Sklavin [Hiram Powers]
type: Label
in scheme: travel!digital Thesaurus

Denkmäler
type: Concept
narrower: Nationaldenkmal der Pilger
narrower: Denkmal Colleoni’s
pref label: Denkmäler
narrower: Lysikrates-Denkmal
narrower: Garfield-Denkmal
in scheme: travel!digital Thesaurus
definition: bdk: profane Kunst | Duden: Denkmal: 1. zum Gedächtnis an eine Person oder ein Ereignis errichtete, größere plastische Darstellung; Monument | 2. erhaltenes [Kunst]werk, das für eine frühere Kultur Zeugnis ablegt | Meyers Großes Konversations-Lexikon 1906: Denkmal (lat. Monumentum), ein Mal (Zeichen), welches das Andenken an gewisse Personen oder bestimmte Begebenheiten in dauernder Weise erhalten soll; also ganz allgemein jedes Erinnerungszeichen vom einfachen Erdhaufen oder Stein bis zum vollendeten Kunstwerk. Man unterscheidet Grabdenkmäler, Ehrendenkmäler und Denkmäler für Kriege, Schlachten, Friedensschlüsse oder andre denkwürdige Ereignisse. – Die bekanntesten und am weitesten verbreiteten Denkmäler sind die Grabdenkmäler, die schon in den ältesten Zeiten vorkommen (weiteres s. im Art. »Grabmal«, mit Tafel). Ehrendenkmäler für einzelne Personen, anfangs Idealstatuen, später Porträtstatuen, waren bei den alten Griechen und Römern sehr häufig. Eine besondere Gattung bildeten die Siegerstatuen, die in Olympia aufgestellt wurden. Zuletzt wurde ein arger Mißbrauch damit getrieben, und man pflegte die Porträtstatuen auf Vorrat zu arbeiten, so daß auf den typisch aufgefaßten Rumpf erst nach der Bestellung der betreffende Kopf gesetzt wurde. Im Mittelalter war diese Art von Denkmälern selten. Die Reiterstatuen Kaiser Ottos I. auf dem Marktplatze zu Magdeburg und König Konrads III. im Dom zu Bamberg sind vereinzelte Beispiele. Im Zeitalter der Renaissance kamen sie wieder in Gebrauch, zunächst aber nur für Herrscher oder Feldherren, was gleichwohl zu allgemeinem Tadel Veranlassung gab (Reiterstatue des Gattamelata zu Padua und des Colleoni zu Venedig); die Kosten wurden von den Geehrten selbst bestritten. In unsern Tagen sind die Denkmäler sehr allgemein geworden und bestehen in Inschrifttafeln, Porträtmedaillons, Büsten, sitzenden oder stehenden Porträtfiguren, Reiterstatuen oder Statuengruppen. Monumente für Ereignisse bestehen in Inschriften, Reliefs, allegorischen …

Nationaldenkmal der Pilger
type: Concept
related match: Monument
definition: bdk: sakrale Kunst
pref label: Nationaldenkmal der Pilger
in scheme: travel!digital Thesaurus
related: Christentum

Nationaldenkmal der Pilger
type: Label
in scheme: travel!digital Thesaurus

Denkmal Colleoni’s
type: Concept
related match: Monument
definition: bdk: profane Kunst
related match: Bartolomeo Colleoni
related match: Andrea del Verrocchio
in scheme: travel!digital Thesaurus
pref label: Denkmal Colleoni’s

Denkmal Colleoni’s
type: Label
in scheme: travel!digital Thesaurus

Denkmäler
type: Label
in scheme: travel!digital Thesaurus

Lysikrates-Denkmal
type: Concept
related match: Monument
definition: bdk: profane Kunst | Meyers Großes Konversations-Lexikon 1906: Chorēgische Monumente (Choragische Monumente), Bildwerke und Denkmäler, die zur Erinnerung an einen in den griechischen Festspielen mit Hilfe eines Chores errungenen Sieg gestiftet wurden (vgl. Chor,[96] S. 92). Viele standen in Athen bei dem Dionysostheater in der sogen. Dreifußstraße. Erhalten sind davon nur das Denkmal des Lysikrates (s. Tafel »Architektur III«, Fig. 9), das einst auf seiner Spitze das Weihgeschenk, einen bronzenen Dreifuß, trug, und Teile des Denkmals des Thrasyllos (319 v. Chr.). Das Denkmal des Lysikrates, dem Dionysos vom Sieger geweiht, daher ein Relieffries am Gebälk eine Wundertat des Gottes (die Bestrafung der tyrrhenischen Seeräuber) schildert, wurde 334 v. Chr. errichtet und ist auch unter dem volkstümlichen Namen »Laterne des Demosthenes« bekannt. Ähnliche Bedeutung hatten die sogen. choregischen Reliefs, Weihgeschenke von Siegern in den musikalischen Wettkämpfen (den Pythien) zu Delphi, daher sie in typischer Weise Apollon als Kitharaspieler und Sänger, in langem Gewand, begleitet von Artemis und Leto, darstellen; ihnen gegenüber und sie bewillkommnend eine Nike mit Kanne u. Schale. Diese Darstellungen gehen wahrscheinlich auf ein archaisches Original zurück. | Quelle: Meyers Großes Konversations-Lexikon, Band 4. Leipzig 1906, S. 96-97. | Permalink: http://www.zeno.org/nid/20006423655
in scheme: travel!digital Thesaurus
pref label: Lysikrates-Denkmal

Lysikrates-Denkmal
type: Label
in scheme: travel!digital Thesaurus

Garfield-Denkmal
type: Concept
related match: Monument
related match: James A. Garfield
definition: bdk: profane Kunst
pref label: Garfield-Denkmal
in scheme: travel!digital Thesaurus

Garfield-Denkmal
type: Label
in scheme: travel!digital Thesaurus

Humboldt
type: Concept
related match: Alexander von Humboldt
related match: Statue
definition: bdk: profane Kunst
pref label: Humboldt
in scheme: travel!digital Thesaurus

Humboldt
type: Label
in scheme: travel!digital Thesaurus

Statue Buddhas
type: Concept
definition: bdk: sakrale Kunst | Duden: Statue: frei stehende Plastik (1), die einen Menschen oder ein Tier in ganzer Gestalt darstellt | Meyers Großes Konversations-Lexikon 1909: Statŭe (lat. statua, franz. statue, spr. statǖ', Stand bild), die durch die Tätigkeit des bildenden Künstlers in irgendeiner, meist harten Masse dargestellte volle[869] Gestalt, besonders des Menschen. Im Altertum und in der neuern Zeit bis zur Zeit der Renaissance pflegte man statuarische Bildwerke zur Belebung und Verdeutlichung der Formen mehr oder weniger reich zu bemalen, was in unsrer Zeit wieder aufgenommen worden ist (s. Polychromie). Man unterschied schon im griechischen Altertum Idealstatuen, d. h. der Phantasie entsprungene Gestalten (Götter, Heroen etc.), und Porträtstatuen. Die Porträtstatuen kamen erst verhältnismäßig spät durch die Sitte auf, in Olympia Statuen der Sieger in den Wettkämpfen aufzustellen. Doch waren auch diese anfangs ideal, d. h. nicht porträtähnlich, gehalten. Noch später kam dazu das Genrebild, das Personen und Vorgänge aus dem Alltagsleben als Einzelstatuen oder Gruppen darstellt. In der römischen, besonders kaiserlichen, Zeit wurden in großer Menge Porträtstatuen gefertigt. Die moderne Bildhauerkunst versteht unter S. im weitesten Sinne jede plastische Einzelfigur, im engern Sinn ein stehendes Bild. Statuette, Standbildchen. Vgl. Bildhauerkunst und Säule (S. 640). | Quelle: Meyers Großes Konversations-Lexikon, Band 18. Leipzig 1909, S. 869-870. | Permalink: http://www.zeno.org/nid/20007517459
related: Buddhismus
in scheme: travel!digital Thesaurus
pref label: Statue Buddhas
related match: Statue
related match: Buddhahood

Statue Buddhas
type: Label
in scheme: travel!digital Thesaurus

Sonstige Kunstwerke
type: Concept
narrower: Teppiche aus dem Gebiet des Djebel Amour
narrower: Fayencefliesen
narrower: Goldschatz von Pietroasa
narrower: Washington Obelisk
narrower: Liberty Bell
narrower: Goldbecher aus Waphio
narrower: Cleopatra’s Needle
narrower: Schmucksachen
narrower: Alhambra-Vase
narrower: Goldfund aus Szilágy-Somlyó
narrower: Silberschale
narrower: Schatz von Tuch el-Karâmûs
narrower: Grabsteine
narrower: Spitzen
narrower: Opferschale
narrower: Stickereien
narrower: Fayencen
notation: II.02.04
narrower: persische Teppiche
narrower: Dolche
narrower: Streitwagen Thutmosis’ IV.
definition: bdk: sonstige Kunstwerke
narrower: Grabfunde von Dahschûr
narrower: Darstellungen des Lebens

Teppiche aus dem Gebiet des Djebel Amour
type: Concept
definition: bdk: profane Kunst
in scheme: travel!digital Thesaurus
pref label: Teppiche aus dem Gebiet des Djebel Amour
related match: Carpet
related match: Amour Range

Teppiche aus dem Gebiet des Djebel Amour
type: Label
in scheme: travel!digital Thesaurus

Fayencefliesen
type: Concept
definition: bdk: profane Kunst
pref label: Fayencefliesen
in scheme: travel!digital Thesaurus
related match: Faience

Fayencefliesen
type: Label
in scheme: travel!digital Thesaurus

Goldschatz von Pietroasa
type: Concept
definition: bdk: profane Kunst
in scheme: travel!digital Thesaurus
pref label: Goldschatz von Pietroasa

Goldschatz von Pietroasa
type: Label
in scheme: travel!digital Thesaurus

Washington Obelisk
type: Concept
definition: bdk: profane Kunst
pref label: Washington Obelisk
in scheme: travel!digital Thesaurus

Washington Obelisk
type: Label
in scheme: travel!digital Thesaurus

Liberty Bell
type: Concept
definition: bdk: profane Kunst
pref label: Liberty Bell
in scheme: travel!digital Thesaurus

Liberty Bell
type: Label
in scheme: travel!digital Thesaurus

Goldbecher aus Waphio
type: Concept
definition: bdk: profane Kunst
pref label: Goldbecher aus Waphio
in scheme: travel!digital Thesaurus

Goldbecher aus Waphio
type: Label
in scheme: travel!digital Thesaurus

Cleopatra’s Needle
type: Concept
definition: bdk: profane Kunst
pref label: Cleopatra’s Needle
in scheme: travel!digital Thesaurus

Cleopatra’s Needle
type: Label
in scheme: travel!digital Thesaurus

Schmucksachen
type: Concept
definition: bdk: sakrale Kunst
in scheme: travel!digital Thesaurus
pref label: Schmucksachen

Schmucksachen
type: Label
in scheme: travel!digital Thesaurus

Alhambra-Vase
type: Concept
definition: bdk: profane Kunst
related match: Alhambra
pref label: Alhambra-Vase
related: Alhambra
in scheme: travel!digital Thesaurus

Alhambra-Vase
type: Label
in scheme: travel!digital Thesaurus

Alhambra
type: Concept
definition: bdk: Profanbau | Duden: Palast bei Granada | Meyers Großes Konversations-Lexikon 1905: Alhámbra (die »rote«, nämlich Feste), einst maur. Festung und Königsburg, das herrlichste Denkmal arabischer Baukunst in Europa, östlich von Granada, am Darro auf einer von Gärten und Parkanlagen umgebenen Anhöhe gelegen. Die ersten Bauanlagen, aus dem 9. Jahrh. stammend, wurden von Mohammed I. (1232–72) und Mohammed II. ausgebaut. 1273 ist die Hauptmasse der Festung, die Prachtbauten und innern Dekorationen aber erst im 15. Jahrh. vollendet. Karl V. zerstörte einen großen Teil der A., um ihn durch einen unvollendet gebliebenen Palast in schwerem Renaissancestil zu ersetzen. Die Schloßanlage gruppiert sich um zwei mit Bassins, Fontänen und Säulenhallen geschmückte offene Höfe. Hohe, einfache, zinnenbekrönte Mauermassen schließen die A. nach außen ab; unter den vier Toren zeichnet sich nur das hufeisenförmig gewölbte Tor der Gerechtigkeit durch reiche Arabesken aus. Durch dieses Tor gelangt man auf die Plaza de los Algibes (»Platz der Zisternen«),[327] die westlich durch die Alcazaba, die ehemalige Zitadelle, mit zwei Türmen, darunter die eine herrliche Aussicht gewährende Torre de la Vela (»Turm der Wache«), östlich von dem Palast Karls V. begrenzt wird. Nördlich davon liegt das eigentliche maurische Königsschloß. Man betritt zunächst den 22 m breiten, 40 m langen Myrtenhof, dessen Schmalseiten von einer Säulenhalle eingefaßt werden. Dem Eingang entgegengesetzt, an der Nordseite, liegt hinter einem Vestibül in dem gewaltigen, viereckigen Comaresturm der Saal der Gesandten, ein Quadrat von 11 m, auf drei Seiten durch Fensternischen erweitert, mit Stalaktitenkuppel. Am besten erhalten sind die östlich von dem genannten Hof gelegenen Räume, und zwar der Löwenhof, so genannt nach der auf zwölf Löwen von schwarzem Marmor ruhenden Fontäne, der Saal des Gerichts, der Saal der beiden Schwestern (zwei Marmorplatten des Fußbodens), die nach der berühmten Familie der Abencerragen (s. d.) ben…
alternative label: Alhambrapalast
in scheme: travel!digital Thesaurus
alt label: Alhambrapalast
pref label: Alhambra

Alhambrapalast
type: Label
in scheme: travel!digital Thesaurus

Alhambra
type: Label
in scheme: travel!digital Thesaurus

Goldfund aus Szilágy-Somlyó
type: Concept
definition: bdk: profane Kunst
in scheme: travel!digital Thesaurus
pref label: Goldfund aus Szilágy-Somlyó
related match: Șimleu Silvaniei

Goldfund aus Szilágy-Somlyó
type: Label
in scheme: travel!digital Thesaurus

Silberschale
type: Concept
definition: bdk: profane Kunst
in scheme: travel!digital Thesaurus
pref label: Silberschale

Silberschale
type: Label
in scheme: travel!digital Thesaurus

Schatz von Tuch el-Karâmûs
type: Concept
definition: bdk: sakrale Kunst
in scheme: travel!digital Thesaurus
pref label: Schatz von Tuch el-Karâmûs

Schatz von Tuch el-Karâmûs
type: Label
in scheme: travel!digital Thesaurus

Grabsteine
type: Concept
definition: bdk: sakrale Kunst
pref label: Grabsteine
in scheme: travel!digital Thesaurus

Grabsteine
type: Label
in scheme: travel!digital Thesaurus

Spitzen
type: Concept
definition: bdk: profane Kunst | Duden: 8. in unterschiedlichen Techniken aus Fäden hergestelltes Material mit kunstvoll durchbrochenen Mustern | Meyers Großes Konversations-Lexikon 1909: Spitzen (hierzu Tafel »Spitzen I u. II«), niederdeutsch Kant, Kante; franz: dentelle (Zähnchen), point (Punkt, Stich); ital.: merletto (Zäckchen), punto (Punkt, Stich, Spitze); engl.: point (Spitze), lace (Litze), Produkte der Textilkunst aus allen Arten von Gespinsten, deren Vorläufer aus verbundenen Ketten- oder Schußfäden (s. Franse und Posamenten) bis ins Altertum zurückgehen, woran sich im Mittelalter solche aus Netzwerk (vgl. die Artikel »Filet, Gipüre, Netzarbeiten«) anschließen. Hieraus und im Zusammenhange mit dem Leinendurchbruch (s. d., vgl. auch Hohlsaum, Hardanger Arbeit, Madeirastickereien, Renaissancestickerei) entwickelten sich im 16. Jahrh. die S. von Italien aus als selbständige Erzeugnisse: vornehmlich in Leinenfäden genäht (Nähspitzen), geklöppelt (Klöppelspitzen); später auch in Leinen- und Baumwollengarn gewebt (Maschinenspitzen). Blonden sind qeklöppelte oder gewebte Seidenspitzen. In gleicher Technik werden S. aus Gold- und Silberfäden (s. Goldspitzen) hergestellt. Seidene, leinene, baumwollene und wollene S. entstehen auch durch Häkeln (s. d.), Knüpfen (s. Macramé) und Stricken (s. d.). S. in Handstickerei sind seltener; wohl aber haben Ätz- oder Luftspitzen durch Maschinenstickerei in neuerer Zeit weite Verbreitung gefunden. Applizierte S. entstehen durch Aufnähen genähter oder geklöppelter Muster auf einen vorhandenen genähten, geklöppelten oder gewebten Maschen- oder Tüllgrund. Die vielseitigen Bezeichnungen der S. (vgl. Point und Punto) gehen zum Teil von der Technik, anderseits von ihrem Ursprungsland aus, daher erklären sich bei ältern Arten die italienischen Namen, für die später französische, niederländische, englische oder deutsche allgemein wurden. – Die Technik der eigentlichen Nähspitze (franz. point à l'aiguille; engl. pointed needle-work) beruht in ihren …
related match: Lace
pref label: Spitzen
in scheme: travel!digital Thesaurus

Spitzen
type: Label
in scheme: travel!digital Thesaurus

Opferschale
type: Concept
definition: bdk: sakrale Kunst
in scheme: travel!digital Thesaurus
pref label: Opferschale

Opferschale
type: Label
in scheme: travel!digital Thesaurus

Stickereien
type: Concept
definition: bdk: profane Kunst
in scheme: travel!digital Thesaurus
pref label: Stickereien

Stickereien
type: Label
in scheme: travel!digital Thesaurus

Fayencen
type: Concept
definition: bdk: profane Kunst | Duden: Fayence: farbig oder weiß glasierte, bemalte Tonware | Meyers Großes Konversations-Lexikon 1906: Fayence (Faience), s. Tonwaren und Keramik. | Quelle: Meyers Großes Konversations-Lexikon, Band 6. Leipzig 1906, S. 364. | Permalink: http://www.zeno.org/nid/20006594050
related: Fayencefliesen
pref label: Fayencen
in scheme: travel!digital Thesaurus

Fayencen
type: Label
in scheme: travel!digital Thesaurus

persische Teppiche
type: Concept
definition: bdk: profane Kunst
in scheme: travel!digital Thesaurus
pref label: persische Teppiche
related match: Carpet

persische Teppiche
type: Label
in scheme: travel!digital Thesaurus

Dolche
type: Concept
pref label: Dolche
in scheme: travel!digital Thesaurus
definition: bdk: profane Kunst | Duden: Dolch: Stichwaffe mit kurzer, fest stehender, spitzer, meist zweischneidiger Klinge | (umgangssprachlich) Messer

Dolche
type: Label
in scheme: travel!digital Thesaurus

Streitwagen Thutmosis’ IV.
type: Concept
definition: bdk: sakrale Kunst | Duden: Streitwagen: (in Altertum und Antike im Kampf, auf der Jagd und bei Wettkämpfen verwendeter) mit Pferden bespannter, hinten offener, zwei- oder vierrädriger Wagen, den der Lenker stehend lenkt | Meyers Großes Konversations-Lexikon 1909: Streitwagen dienten entweder dazu, die Streiter im Gefecht schneller fortzuschaffen, worauf diese beim Zusammenstoß mit dem Feinde vom Wagen herab kämpften oder auch zu diesem Zweck abstiegen, oder sie sollten durch ihren Einbruch den Feind selbst schädigen, wie die Sichelwagen (s. d.). | Die S., von einem Wagenführer gelenkt, von einem, auch mehreren Kämpfenden besetzt, fanden sich namentlich bei den Griechen (s. Abbildung) in ihrer Heldenzeit und ersetzten die Reiterei. Im Mittelalter waren die S. stark bemannt und dienten den Armbrust- und Büchsenschützen auch wohl gleichzeitig als Verschanzung, wie bei den Hussiten und Flamen im 14. Jahrh., die ihre Walkerkarren (ribeaudequins) sogar mit Geschützen besetzten. | Quelle: Meyers Großes Konversations-Lexikon, Band 19. Leipzig 1909, S. 117. | Permalink: http://www.zeno.org/nid/20007536445
in scheme: travel!digital Thesaurus
pref label: Streitwagen Thutmosis’ IV.
related match: Thutmose IV

Streitwagen Thutmosis’ IV.
type: Label
in scheme: travel!digital Thesaurus

Grabfunde von Dahschûr
type: Concept
definition: bdk: sakrale Kunst
in scheme: travel!digital Thesaurus
pref label: Grabfunde von Dahschûr
related match: Dahshur

Grabfunde von Dahschûr
type: Label
in scheme: travel!digital Thesaurus

Darstellungen des Lebens
type: Concept
definition: bdk: sakrale Kunst
in scheme: travel!digital Thesaurus
pref label: Darstellungen des Lebens

Darstellungen des Lebens
type: Label
in scheme: travel!digital Thesaurus

Malerei
type: Concept
narrower: Jan van der Meer, junge Frau am Fenster
narrower: Bild dieses Heiligen [Santiago] [Juan de las Roelas]
narrower: Edouard Detaille, Verteidigung von Champigny
narrower: Rosa Bonheur, Pferdemarkt
narrower: Van Marcke, Kühe
narrower: Millet, Angelus
narrower: Eugen Delacroix, Kreuzigung
narrower: François Auguste Bonheur, Waldlandschaft mit Vieh
narrower: Jules Breton, Prozession in der Normandie
narrower: Corot, Ville d’Avray
narrower: Anbetung der Hirten [Rembrandt]
narrower: Frans Hals, Bildnis
narrower: Paul Delaroche, Hémycicle du Palais des Beaux-Arts
narrower: Frans Hals, männliches Bildnis
narrower: Van Dyck, heilige Martha das Aufhören der Pest erflehend
narrower: Frans Hals, Bildnis seiner Frau
narrower: Barbara von Palma Vecchio
narrower: Ludwig Knaus, heilige Familie
narrower: Rembrandt, Portät aus seiner letzten Zeit
narrower: Frans Hals, der Raucher
narrower: Bilder von Murillo
narrower: Alma Tadema, eine Vorlesung des Homer
narrower: Alma Tadema, Sappho
narrower: Troyon, holländisches Vieh
narrower: Meissonier, Friedland
narrower: Gabriel Max, das letzte Zeichen
notation: II.02.01
definition: bdk: Malerei
narrower: Millet, Schafhürde
narrower: Cuyp, Landschaft mit Vieh
narrower: Théodore Rousseau, Le Givre
narrower: Giotto, Frauenkopf (Freske)
narrower: Jordaens, der jugendliche Johannes der Täufer besucht das Jesuskind
narrower: Rubens, Rückkehr der heiligen Famlie aus Ägypten
narrower: Leonardo da Vinci, Mädchen mit Kirschen
narrower: Corot, Holzleser
narrower: Van Dyck, Dame mit Halskrause
narrower: Flügelaltar [Jan Mabuse]
narrower: Gentile Bellini, Katharina Cornaro
narrower: Jan de Heem, Stillleben
narrower: Sir Joshua Reynolds, Honorable Henry Fane und seine Vormünder Inigo Jones und Charels Blair
narrower: Gilbert Stuart, George Washington
narrower: Las Casas die Indianer beschützend [Felix Parra]
narrower: Mariano Fortuny, indische Schlangenzauberer
narrower: Selbstbildnis [Velasquez]
narrower: Pierre Auguste Cot, das Gewitter
narrower: Fortuny, spanische Dame
narrower: Millet, der Sämann
narrower: Meissonier, „1814“
narrower: Gérôme, das Duell nach dem Maskenball
narrower: Bilder von Domenico Theotokópuli
narrower: Jean Baptiste Corot, heiliger Sebastian
narrower: Meissonier, Adriaan und Willem van de Velde
narrower: Mann mit breitkrämpigem Hut und großem Kragen [Rembrandt]
narrower: Millet, Kartoffelernte
narrower: Flügelbild [Dieric Bouts]
narrower: Gilbert Stuart, Portrait Washingtons unvollendet
narrower: Jacopo Bassano, Bildnis eines Kardinals
narrower: Frans Hals, Hille Bobbe, die Matrosenvenus von Harlem
narrower: Sir Peter Lely, Portät
narrower: Gérôme, Gebet in einer Moschee
narrower: Tizian
narrower: Hendrik Leys, Edikt Karls V.

Jan van der Meer, junge Frau am Fenster
type: Concept
definition: bdk: profane Kunst
pref label: Jan van der Meer, junge Frau am Fenster
in scheme: travel!digital Thesaurus
related match: Johannes Vermeer

Jan van der Meer, junge Frau am Fenster
type: Label
in scheme: travel!digital Thesaurus

Bild dieses Heiligen [Santiago] [Juan de las Roelas]
type: Concept
definition: bdk: sakrale Kunst
related match: Juan de las Roelas
related: Christentum
in scheme: travel!digital Thesaurus
pref label: Bild dieses Heiligen [Santiago] [Juan de las Roelas]

Bild dieses Heiligen [Santiago] [Juan de las Roelas]
type: Label
in scheme: travel!digital Thesaurus

Edouard Detaille, Verteidigung von Champigny
type: Concept
definition: bdk: profane Kunst
pref label: Edouard Detaille, Verteidigung von Champigny
in scheme: travel!digital Thesaurus
related match: Édouard Detaille

Edouard Detaille, Verteidigung von Champigny
type: Label
in scheme: travel!digital Thesaurus

Rosa Bonheur, Pferdemarkt
type: Concept
definition: bdk: profane Kunst
pref label: Rosa Bonheur, Pferdemarkt
in scheme: travel!digital Thesaurus
related match: Rosa Bonheur

Rosa Bonheur, Pferdemarkt
type: Label
in scheme: travel!digital Thesaurus

Van Marcke, Kühe
type: Concept
definition: bdk: profane Kunst
pref label: Van Marcke, Kühe
in scheme: travel!digital Thesaurus
related match: Émile van Marcke

Van Marcke, Kühe
type: Label
in scheme: travel!digital Thesaurus

Millet, Angelus
type: Concept
definition: bdk: sakrale Kunst
pref label: Millet, Angelus
in scheme: travel!digital Thesaurus
related: Christentum
related match: Jean-François Millet

Millet, Angelus
type: Label
in scheme: travel!digital Thesaurus

Eugen Delacroix, Kreuzigung
type: Concept
definition: bdk: sakrale Kunst
pref label: Eugen Delacroix, Kreuzigung
in scheme: travel!digital Thesaurus
related: Christentum
related match: Eugène Delacroix

Eugen Delacroix, Kreuzigung
type: Label
in scheme: travel!digital Thesaurus

François Auguste Bonheur, Waldlandschaft mit Vieh
type: Concept
definition: bdk: profane Kunst
pref label: François Auguste Bonheur, Waldlandschaft mit Vieh
in scheme: travel!digital Thesaurus
related match: Auguste Bonheur

François Auguste Bonheur, Waldlandschaft mit Vieh
type: Label
in scheme: travel!digital Thesaurus

Jules Breton, Prozession in der Normandie
type: Concept
definition: bdk: sakrale Kunst
pref label: Jules Breton, Prozession in der Normandie
in scheme: travel!digital Thesaurus
related: Christentum
related match: Jules Breton

Jules Breton, Prozession in der Normandie
type: Label
in scheme: travel!digital Thesaurus

Corot, Ville d’Avray
type: Concept
definition: bdk: profane Kunst
pref label: Corot, Ville d’Avray
in scheme: travel!digital Thesaurus
related match: Jean-Baptiste-Camille Corot

Corot, Ville d’Avray
type: Label
in scheme: travel!digital Thesaurus

Anbetung der Hirten [Rembrandt]
type: Concept
definition: bdk: sakrale Kunst
related: Christentum
pref label: Anbetung der Hirten [Rembrandt]
in scheme: travel!digital Thesaurus
related match: Rembrandt

Anbetung der Hirten [Rembrandt]
type: Label
in scheme: travel!digital Thesaurus

Frans Hals, Bildnis
type: Concept
definition: bdk: profane Kunst
pref label: Frans Hals, Bildnis
in scheme: travel!digital Thesaurus
related match: Frans Hals

Frans Hals, Bildnis
type: Label
in scheme: travel!digital Thesaurus

Paul Delaroche, Hémycicle du Palais des Beaux-Arts
type: Concept
definition: bdk: profane Kunst
pref label: Paul Delaroche, Hémycicle du Palais des Beaux-Arts
in scheme: travel!digital Thesaurus
related match: Paul Delaroche

Paul Delaroche, Hémycicle du Palais des Beaux-Arts
type: Label
in scheme: travel!digital Thesaurus

Frans Hals, männliches Bildnis
type: Concept
definition: bdk: profane Kunst
in scheme: travel!digital Thesaurus
pref label: Frans Hals, männliches Bildnis
related match: Frans Hals

Frans Hals, männliches Bildnis
type: Label
in scheme: travel!digital Thesaurus

Van Dyck, heilige Martha das Aufhören der Pest erflehend
type: Concept
definition: bdk: sakrale Kunst
pref label: Van Dyck, heilige Martha das Aufhören der Pest erflehend
in scheme: travel!digital Thesaurus
related: Christentum
related match: Anthony van Dyck

Van Dyck, heilige Martha das Aufhören der Pest erflehend
type: Label
in scheme: travel!digital Thesaurus

Frans Hals, Bildnis seiner Frau
type: Concept
definition: bdk: profane Kunst
pref label: Frans Hals, Bildnis seiner Frau
in scheme: travel!digital Thesaurus
related match: Frans Hals

Frans Hals, Bildnis seiner Frau
type: Label
in scheme: travel!digital Thesaurus

Barbara von Palma Vecchio
type: Concept
definition: bdk: sakrale Kunst
related match: Palma Vecchio
pref label: Barbara von Palma Vecchio
in scheme: travel!digital Thesaurus
related: Christentum

Barbara von Palma Vecchio
type: Label
in scheme: travel!digital Thesaurus

Ludwig Knaus, heilige Familie
type: Concept
definition: bdk: sakrale Kunst
pref label: Ludwig Knaus, heilige Familie
in scheme: travel!digital Thesaurus
related: Christentum
related match: Ludwig Knaus

Ludwig Knaus, heilige Familie
type: Label
in scheme: travel!digital Thesaurus

Rembrandt, Portät aus seiner letzten Zeit
type: Concept
definition: bdk: profane Kunst
pref label: Rembrandt, Portät aus seiner letzten Zeit
in scheme: travel!digital Thesaurus
related match: Rembrandt

Rembrandt, Portät aus seiner letzten Zeit
type: Label
in scheme: travel!digital Thesaurus

Frans Hals, der Raucher
type: Concept
definition: bdk: profane Kunst
pref label: Frans Hals, der Raucher
in scheme: travel!digital Thesaurus
related match: Frans Hals

Frans Hals, der Raucher
type: Label
in scheme: travel!digital Thesaurus

Bilder von Murillo
type: Concept
definition: bdk: sakrale Kunst
narrower: Almosenspende des heiligen Thomas von Villanueva [Murillo]
narrower: Verlobung der heiligen Katharina [Murillo]
pref label: Bilder von Murillo
in scheme: travel!digital Thesaurus
related match: Bartolomé Esteban Murillo

Almosenspende des heiligen Thomas von Villanueva [Murillo]
type: Concept
definition: bdk: sakrale Kunst
related: Christentum
in scheme: travel!digital Thesaurus
pref label: Almosenspende des heiligen Thomas von Villanueva [Murillo]
related match: Bartolomé Esteban Murillo

Almosenspende des heiligen Thomas von Villanueva [Murillo]
type: Label
in scheme: travel!digital Thesaurus

Verlobung der heiligen Katharina [Murillo]
type: Concept
definition: bdk: profane, sakrale Kunst
pref label: Verlobung der heiligen Katharina [Murillo]
related match: Bartolomé Esteban Murillo
in scheme: travel!digital Thesaurus
related: Christentum

Verlobung der heiligen Katharina [Murillo]
type: Label
in scheme: travel!digital Thesaurus

Bilder von Murillo
type: Label
in scheme: travel!digital Thesaurus

Alma Tadema, eine Vorlesung des Homer
type: Concept
definition: bdk: profane Kunst
pref label: Alma Tadema, eine Vorlesung des Homer
in scheme: travel!digital Thesaurus
related match: Lawrence Alma-Tadema

Alma Tadema, eine Vorlesung des Homer
type: Label
in scheme: travel!digital Thesaurus

Alma Tadema, Sappho
type: Concept
definition: bdk: profane Kunst
pref label: Alma Tadema, Sappho
in scheme: travel!digital Thesaurus
related match: Lawrence Alma-Tadema

Alma Tadema, Sappho
type: Label
in scheme: travel!digital Thesaurus

Troyon, holländisches Vieh
type: Concept
definition: bdk: profane Kunst
pref label: Troyon, holländisches Vieh
in scheme: travel!digital Thesaurus
related match: Constant Troyon

Troyon, holländisches Vieh
type: Label
in scheme: travel!digital Thesaurus

Meissonier, Friedland
type: Concept
definition: bdk: profane Kunst
pref label: Meissonier, Friedland
in scheme: travel!digital Thesaurus
related match: Jean-Louis-Ernest Meissonier

Meissonier, Friedland
type: Label
in scheme: travel!digital Thesaurus

Gabriel Max, das letzte Zeichen
type: Concept
definition: bdk: profane, sakrale Kunst (?)
pref label: Gabriel Max, das letzte Zeichen
in scheme: travel!digital Thesaurus
related match: Gabriel von Max

Gabriel Max, das letzte Zeichen
type: Label
in scheme: travel!digital Thesaurus

Millet, Schafhürde
type: Concept
definition: bdk: profane Kunst
pref label: Millet, Schafhürde
in scheme: travel!digital Thesaurus
related match: Jean-François Millet

Millet, Schafhürde
type: Label
in scheme: travel!digital Thesaurus

Cuyp, Landschaft mit Vieh
type: Concept
definition: bdk: profane Kunst
in scheme: travel!digital Thesaurus
pref label: Cuyp, Landschaft mit Vieh
related match: Aelbert Cuyp

Cuyp, Landschaft mit Vieh
type: Label
in scheme: travel!digital Thesaurus

Théodore Rousseau, Le Givre
type: Concept
definition: bdk: profane Kunst
pref label: Théodore Rousseau, Le Givre
in scheme: travel!digital Thesaurus
related match: Théodore Rousseau

Théodore Rousseau, Le Givre
type: Label
in scheme: travel!digital Thesaurus

Giotto, Frauenkopf (Freske)
type: Concept
definition: bdk: profane Kunst
in scheme: travel!digital Thesaurus
pref label: Giotto, Frauenkopf (Freske)
related match: Giotto

Giotto, Frauenkopf (Freske)
type: Label
in scheme: travel!digital Thesaurus

Jordaens, der jugendliche Johannes der Täufer besucht das Jesuskind
type: Concept
definition: bdk: sakrale Kunst
pref label: Jordaens, der jugendliche Johannes der Täufer besucht das Jesuskind
in scheme: travel!digital Thesaurus
related: Christentum
related match: Jacob Jordaens

Jordaens, der jugendliche Johannes der Täufer besucht das Jesuskind
type: Label
in scheme: travel!digital Thesaurus

Rubens, Rückkehr der heiligen Famlie aus Ägypten
type: Concept
definition: bdk: sakrale Kunst
pref label: Rubens, Rückkehr der heiligen Famlie aus Ägypten
in scheme: travel!digital Thesaurus
related: Christentum
related match: Peter Paul Rubens

Rubens, Rückkehr der heiligen Famlie aus Ägypten
type: Label
in scheme: travel!digital Thesaurus

Leonardo da Vinci, Mädchen mit Kirschen
type: Concept
definition: bdk: profane Kunst
pref label: Leonardo da Vinci, Mädchen mit Kirschen
in scheme: travel!digital Thesaurus
related match: Leonardo da Vinci

Leonardo da Vinci, Mädchen mit Kirschen
type: Label
in scheme: travel!digital Thesaurus

Corot, Holzleser
type: Concept
definition: bdk: profane Kunst
in scheme: travel!digital Thesaurus
pref label: Corot, Holzleser
related match: Jean-Baptiste-Camille Corot

Corot, Holzleser
type: Label
in scheme: travel!digital Thesaurus

Van Dyck, Dame mit Halskrause
type: Concept
definition: bdk: profane Kunst
pref label: Van Dyck, Dame mit Halskrause
in scheme: travel!digital Thesaurus
related match: Anthony van Dyck

Van Dyck, Dame mit Halskrause
type: Label
in scheme: travel!digital Thesaurus

Flügelaltar [Jan Mabuse]
type: Concept
definition: bdk: sakrale Kunst
related match: Jan Gossaert
related: Christentum
in scheme: travel!digital Thesaurus
pref label: Flügelaltar [Jan Mabuse]

Flügelaltar [Jan Mabuse]
type: Label
in scheme: travel!digital Thesaurus

Gentile Bellini, Katharina Cornaro
type: Concept
definition: bdk: profane Kunst
in scheme: travel!digital Thesaurus
pref label: Gentile Bellini, Katharina Cornaro
related match: Gentile Bellini

Gentile Bellini, Katharina Cornaro
type: Label
in scheme: travel!digital Thesaurus

Jan de Heem, Stillleben
type: Concept
definition: bdk: profane Kunst
pref label: Jan de Heem, Stillleben
in scheme: travel!digital Thesaurus
related match: Jan Davidsz. de Heem

Jan de Heem, Stillleben
type: Label
in scheme: travel!digital Thesaurus

Sir Joshua Reynolds, Honorable Henry Fane und seine Vormünder Inigo Jones und Charels Blair
type: Concept
definition: bdk: profane Kunst
pref label: Sir Joshua Reynolds, Honorable Henry Fane und seine Vormünder Inigo Jones und Charels Blair
in scheme: travel!digital Thesaurus
related match: Joshua Reynolds

Sir Joshua Reynolds, Honorable Henry Fane und seine Vormünder Inigo Jones und Charels Blair
type: Label
in scheme: travel!digital Thesaurus

Gilbert Stuart, George Washington
type: Concept
related match: George Washington
definition: bdk: profane Kunst
pref label: Gilbert Stuart, George Washington
in scheme: travel!digital Thesaurus
related match: Gilbert Stuart

Gilbert Stuart, George Washington
type: Label
in scheme: travel!digital Thesaurus

Las Casas die Indianer beschützend [Felix Parra]
type: Concept
definition: bdk: profane Kunst
pref label: Las Casas die Indianer beschützend [Felix Parra]
in scheme: travel!digital Thesaurus
related match: Félix Parra

Las Casas die Indianer beschützend [Felix Parra]
type: Label
in scheme: travel!digital Thesaurus

Mariano Fortuny, indische Schlangenzauberer
type: Concept
definition: bdk: profane Kunst
pref label: Mariano Fortuny, indische Schlangenzauberer
in scheme: travel!digital Thesaurus
related match: Mariano Fortuny (designer)

Mariano Fortuny, indische Schlangenzauberer
type: Label
in scheme: travel!digital Thesaurus

Selbstbildnis [Velasquez]
type: Concept
definition: bdk: profane Kunst
pref label: Selbstbildnis [Velasquez]
in scheme: travel!digital Thesaurus
related match: Diego Velázquez

Selbstbildnis [Velasquez]
type: Label
in scheme: travel!digital Thesaurus

Pierre Auguste Cot, das Gewitter
type: Concept
definition: bdk: profane Kunst
pref label: Pierre Auguste Cot, das Gewitter
in scheme: travel!digital Thesaurus
related match: Pierre Auguste Cot

Pierre Auguste Cot, das Gewitter
type: Label
in scheme: travel!digital Thesaurus

Fortuny, spanische Dame
type: Concept
definition: bdk: profane Kunst
pref label: Fortuny, spanische Dame
in scheme: travel!digital Thesaurus
related match: Mariano Fortuny (designer)

Fortuny, spanische Dame
type: Label
in scheme: travel!digital Thesaurus

Millet, der Sämann
type: Concept
definition: bdk: profane Kunst
pref label: Millet, der Sämann
in scheme: travel!digital Thesaurus
related match: Jean-François Millet

Millet, der Sämann
type: Label
in scheme: travel!digital Thesaurus

Meissonier, „1814“
type: Concept
related match: Jean-Louis-Ernest Meissonier
definition: bdk: profane Kunst
pref label: Meissonier, „1814“
in scheme: travel!digital Thesaurus

Meissonier, „1814“
type: Label
in scheme: travel!digital Thesaurus

Gérôme, das Duell nach dem Maskenball
type: Concept
definition: bdk: profane Kunst
pref label: Gérôme, das Duell nach dem Maskenball
in scheme: travel!digital Thesaurus
related match: Jean-Léon Gérôme

Gérôme, das Duell nach dem Maskenball
type: Label
in scheme: travel!digital Thesaurus

Bilder von Domenico Theotokópuli
type: Concept
definition: bdk: sakrale Kunst
related match: El Greco
in scheme: travel!digital Thesaurus
pref label: Bilder von Domenico Theotokópuli

Bilder von Domenico Theotokópuli
type: Label
in scheme: travel!digital Thesaurus

Jean Baptiste Corot, heiliger Sebastian
type: Concept
definition: bdk: sakrale Kunst
pref label: Jean Baptiste Corot, heiliger Sebastian
in scheme: travel!digital Thesaurus
related: Christentum
related match: Jean-Baptiste-Camille Corot

Jean Baptiste Corot, heiliger Sebastian
type: Label
in scheme: travel!digital Thesaurus

Meissonier, Adriaan und Willem van de Velde
type: Concept
related match: Adriaen van de Velde
related match: Willem van de Velde the Younger
definition: bdk: profane Kunst
pref label: Meissonier, Adriaan und Willem van de Velde
in scheme: travel!digital Thesaurus
related match: Jean-Louis-Ernest Meissonier

Meissonier, Adriaan und Willem van de Velde
type: Label
in scheme: travel!digital Thesaurus

Mann mit breitkrämpigem Hut und großem Kragen [Rembrandt]
type: Concept
definition: bdk: profane Kunst
pref label: Mann mit breitkrämpigem Hut und großem Kragen [Rembrandt]
in scheme: travel!digital Thesaurus
related match: Rembrandt

Mann mit breitkrämpigem Hut und großem Kragen [Rembrandt]
type: Label
in scheme: travel!digital Thesaurus

Millet, Kartoffelernte
type: Concept
definition: bdk: profane Kunst
pref label: Millet, Kartoffelernte
in scheme: travel!digital Thesaurus
related match: Jean-François Millet

Millet, Kartoffelernte
type: Label
in scheme: travel!digital Thesaurus

Flügelbild [Dieric Bouts]
type: Concept
definition: bdk: sakrale Kunst
related match: Dieric Bouts
related: Christentum
in scheme: travel!digital Thesaurus
pref label: Flügelbild [Dieric Bouts]

Flügelbild [Dieric Bouts]
type: Label
in scheme: travel!digital Thesaurus

Gilbert Stuart, Portrait Washingtons unvollendet
type: Concept
related match: George Washington
definition: bdk: profane Kunst
pref label: Gilbert Stuart, Portrait Washingtons unvollendet
in scheme: travel!digital Thesaurus
related match: Gilbert Stuart

Gilbert Stuart, Portrait Washingtons unvollendet
type: Label
in scheme: travel!digital Thesaurus

Jacopo Bassano, Bildnis eines Kardinals
type: Concept
definition: bdk: profane Kunst
in scheme: travel!digital Thesaurus
pref label: Jacopo Bassano, Bildnis eines Kardinals
related match: Jacopo Bassano

Jacopo Bassano, Bildnis eines Kardinals
type: Label
in scheme: travel!digital Thesaurus

Frans Hals, Hille Bobbe, die Matrosenvenus von Harlem
type: Concept
definition: bdk: sakrale Kunst
pref label: Frans Hals, Hille Bobbe, die Matrosenvenus von Harlem
in scheme: travel!digital Thesaurus
related match: Frans Hals

Frans Hals, Hille Bobbe, die Matrosenvenus von Harlem
type: Label
in scheme: travel!digital Thesaurus

Sir Peter Lely, Portät
type: Concept
definition: bdk: profane Kunst
pref label: Sir Peter Lely, Portät
in scheme: travel!digital Thesaurus
related match: Peter Lely

Sir Peter Lely, Portät
type: Label
in scheme: travel!digital Thesaurus

Gérôme, Gebet in einer Moschee
type: Concept
definition: bdk: sakrale Kunst
related: Islam
pref label: Gérôme, Gebet in einer Moschee
in scheme: travel!digital Thesaurus
related match: Jean-Léon Gérôme

Islam
type: Concept
alt label: Islám
pref label: Islam
narrower: Drusen-Religion
alternative label: islamische Religion
in scheme: travel!digital Thesaurus
alt label: islamische Religion
alt label: Islâm
narrower: Schiʿitismus
alternative label: Islâm
alternative label: Islám
definition: Duden: auf die im Koran niedergelegte Verkündigung des arabischen Propheten Mohammed zurückgehende Religion | Meyers Großes Konversations-Lexikon 1907: Islâm (arab., »Ergebung«, nämlich in Gottes Willen), die von Mohammed (s. d.) gestiftete Religion, deren Bekenner Muslim (s. d.) heißen. War der I. zuerst nur die Abwendung Mohammeds von dem Götzendienst der Mekkaner zu dem ihm durch den Verkehr mit Juden und Christen bekannt gewordenen Monotheismus und der von einer kleinen Anzahl Mekkaner angenommene neue Glaube, so wurde er unter der Berührung mit den aus Südarabien stammenden Medinensern und den in und bei Medina zahlreichen Juden und bei der in Arabien herrschenden Tendenz zu einer religiösen und nationalen Einigung das Gesetz einer religiösen Gemeinschaft unter Leitung Mohammeds und, sofern dieser der Künder des göttlichen Willens war, Gottes. Damit war die politische Richtung gegeben: das Land dieser Gemeinschaft wurde Land des Islams (dâr al islâm), ein Staatsgebiet, das sich nach dem Gebot, alle Nichtmuslime zu bekämpfen, über die ganze Welt erstrecken sollte. Das Recht dieses Staates ist das durch den I. gelehrte Gebot Gottes, seine Beamten sind Hüter und Schützer des Islams. Angehöriger der islamischen Gemeinde ist jeder, der als Kind islamischer Eltern geboren ist oder sich durch Aussprechen der Zeugnisworte: »Ich bezeuge, daß es keinen Gott gibt außer dem (einen) Gott (Allâh), ich bezeuge, daß Mohammed der Gesandte Gottes ist« zum I. bekannt hat. Das äußere Zeichen der Zugehörigkeit ist die dem Judentum entlehnte Beschneidung. Voraussetzung des Islams ist der Glaube (îmân) an Gott, seine Engel, seine Gesandten (Propheten), seine (geoffenbarten) Bücher und den Jüngsten Tag (Koran 2,285; 4,135). Die Ausführung des einzelnen zeigt jüdischen Einfluß. Wer den Glauben nicht hat oder ihn verliert, ist ein Ungläubiger (kâfir). Doch legt der I. auf die Feststellung des Glaubens bei seinen Angehörigen wenig Wert. Die Entwickelung der Glaubenslehre wurde als eine d…
narrower: Proto-Islâm

Islám
type: Label
isVariantOf: Islam
hasVariant: Islâm
in scheme: travel!digital Thesaurus

Islam
type: Label
hasVariant: Islâm
in scheme: travel!digital Thesaurus
hasVariant: Islám

Islâm
type: Label
isVariantOf: Islam
in scheme: travel!digital Thesaurus
hasVariant: Islám

Drusen-Religion
type: Concept
definition: Meyers Großes Konversations-Lexikon 1906: Drusen [...] Eigentümlich ist die Religion der D. Ihre Lehren sind in heiligen Büchern niedergeschrieben, die, obwohl sorgfältig geheimgehalten, in Europa doch durch Abschriften bekannt geworden sind. Sie bestehen aus 111 Abhandlungen, die in sechs Bücher zerfallen; ein siebentes, in einer ägyptischen Schule entdecktes haben sie 1817 dazu erhalten. Die Religionslehre der D. ist danach mohammedanischer Gnostizismus mit allerlei dem Christentum und alten philosophischen Systemen sowie dem persischen Magismus entlehnten Ideen. Das am meisten charakteristische Dogma ist das von der Einheit des Wesens Gottes, der nur von seinen berufenen Kindern erkannt werden kann und zwar mittels menschlicher Inkarnationen. Diese sind zahlreich gewesen; die letzte, der keine andre folgt, war der Fatemide El-Hâkim Biamrillâh, 996–1021 Sultan von Ägypten. Die D. glauben an Seelenwanderung, nur daß die Seelen immer wieder in geboren werdende Menschen und nicht in niedere Tiere übergehen. Hauptpflichten des Menschen nach ihrer Lehre sind: Wahrhaftigkeit, doch nur D. gegenüber, während Andersgläubige nach Kräften belogen werden dürfen; Unterstützung der Glaubensgenossen; Lossagung von der Gottlosigkeit; Bekenntnis der Einheit Gottes und steke Ergebung in seinen Willen. Eigentliche Priester haben die D. nicht; sie teilen sich nur in 'Akkâl (Wissende, Eingeweihte) und Dschohhal (Unwissende). Die 'Akkâl, zu denen die meisten Scheichs gehören, bilden einen geheimen Orden in verschiedenen Graden, der allein im Besitz der Geheimlehren und mit den höchsten Interessen der Gemeinden betraut ist. Um unter ihrer Zahl aufgenommen zu werden, wozu jedem Drusen, Mann und Weib, das Recht zusteht, ist es erforderlich, gewisse Erklärungen abzugeben und allen Freiheiten zu entsagen, die den Dschohhal gewährt sind. Die 'Akkâl arbeiten wie die andern, stehen aber in hoher Achtung. Sie tragen einen runden, losen Turban und dürfen sich nicht in gestickten oder außergewöhn…
in scheme: travel!digital Thesaurus
pref label: Drusen-Religion
alt label: Drusenreligion
alternative label: Drusenreligion
related match: Druze

Drusen-Religion
type: Label
in scheme: travel!digital Thesaurus
hasVariant: Drusenreligion

Drusenreligion
type: Label
in scheme: travel!digital Thesaurus
isVariantOf: Drusen-Religion

islamische Religion
type: Label
in scheme: travel!digital Thesaurus

Schiʿitismus
type: Concept
pref label: Schiʿitismus
in scheme: travel!digital Thesaurus
definition: Meyers Großes Konversations-Lexikon 1909: Schiiten, mohammedan. Sekte, die im Gegensatz zu den Sunniten Ali, den Schwiegersohn des Propheten, als den rechtmäßigen Nachfolger Mohammeds anerkennt. Ursprünglich ist die schî'at'Ali, »die Gefolgschaft Alis«, nichts als die Gesamtheit der Anhänger Alis im Bürgerkriege gegen Moâwija I.; nach Alis Tod ist es die legitimistische Partei, welche die herrschende Dynastie der Omaijaden verwirft und den Nachkommen Alis das Recht auf das Kalifat zuspricht. Trotz aller Verfolgung seitens der Herrschenden wuchs die Schi'a, zu der sich insbes. zahlreiche Perser hielten, denen das ihnen widerwärtige Arabertum in der Omaijadendynastie verkörpert war. Daher wirkten die S. mit den Abbasiden zum Sturze der Omaijaden zusammen; als aber das Ziel erreicht war, sahen die Aliden sich von den Abbasiden, wie früher von den Omaijaden, auf die Seite gedrängt. Unter neuen Verfolgungen wuchsen die Gegensätze; es bildeten sich unter dem Einfluß ostpersisch-buddhistischer Strömungen immer extremere Gruppen, welche die Verehrung Alis dahin steigerten, daß sie in ihm, wie in den zu seiner Nachfolge berechtigten Abkömmlingen, nicht bloß die wahren Imâme (Religions- und Gemeindehäupter), sondern geradezu Inkarnationen der Gottheit sahen (s. Ismaëliten, Karmaten, Drusen, Nossairier). Andre blieben gemäßigter, ließen aber doch auch die Verehrung Alis und der Aliden gegenüber der des Propheten Mohammed immer mehr in den Vordergrund treten. Die hauptsächlichste dieser gemäßigten Parteien ist die der sogen. Zwölfer, die von Ali an gerechnet zwölf Imâme annahmen, deren letzter die Abbasiden stürzen sollte. Da dies um die entsprechende Zeit (etwa 870) nicht geschah, so entstand der Glaube, der zwölfte Imâm Mohammed sei auf übernatürliche Weise verschwunden, werde aber wiederkommen, das Reich auszurichten (s. Mahdi). Im ganzen weichen die Zwölfer vom sunnitischen Dogma hauptsächlich ab durch die Verwerfung der ersten Kalifen Abu Bekr, Omar und Othmân, durch die ü…
related match: Shia Islam

Schiʿitismus
type: Label
in scheme: travel!digital Thesaurus

Proto-Islâm
type: Concept
pref label: Proto-Islâm
in scheme: travel!digital Thesaurus
definition: Duden: proto: Bestimmungswort in Zusammensetzungen mit der Bedeutung erster, vorderster, wichtigster; Ur- (z. B. prototypisch, Protoplasma, Protagonist) | Meyers Großes Konversations-Lexikon 1908: Proto..., Prot... (griech.), in Zusammensetzungen soviel wie der »Erste«, Vornehmste einer Klasse. | Quelle: Meyers Großes Konversations-Lexikon, Band 16. Leipzig 1908, S. 395. | Permalink: http://www.zeno.org/nid/20007295472

Proto-Islâm
type: Label
in scheme: travel!digital Thesaurus

Gérôme, Gebet in einer Moschee
type: Label
in scheme: travel!digital Thesaurus

Tizian
type: Concept
definition: bdk: profane, sakrale Kunst
pref label: Tizian
in scheme: travel!digital Thesaurus
related match: Titian

Tizian
type: Label
in scheme: travel!digital Thesaurus

Hendrik Leys, Edikt Karls V.
type: Concept
definition: bdk: profane Kunst
pref label: Hendrik Leys, Edikt Karls V.
in scheme: travel!digital Thesaurus
related match: Jan August Hendrik Leys

Hendrik Leys, Edikt Karls V.
type: Label
in scheme: travel!digital Thesaurus

Kunstsammlungen
type: Concept
narrower: Sammlung japanesischer und chinesischer Bronzen, Emaillen, Porzellan, Elfenbeinarbeiten und Gemälde
narrower: Orientalische Kunstsammlungen
narrower: Sammlung von Bildern alter Meister und der englischen Schule
definition: bdk: Kunstsammlungen
narrower: Walters Collection
narrower: Moore Collection
narrower: Bookwalter Loan Collection
narrower: Fenollosa-Sammlung von Japanischen Gemälden
narrower: Glasblumen
narrower: Morse Collection von Japanischen Thonarbeiten
narrower: Layton Art Gallery
narrower: Sammlung der großen antiken Bronzebildwerke
narrower: Hall of Bronzes and Ceramics
narrower: Sammlung antiker Wandgemälde
notation: II.02.03
narrower: Stuart Collections
narrower: Rinehart Collection
narrower: Sammlung der Schmucksachen
narrower: Sammlung japanischer Bronzen, Emaillen, Lackwaren, Waffen, Elfenbein- und Holzschitzereien, Gold- und Silbersachen
narrower: Sammlung der kleinen Bronzen
narrower: Cesnolasche Sammlung cyprischer Schmucksachen

Sammlung japanesischer und chinesischer Bronzen, Emaillen, Porzellan, Elfenbeinarbeiten und Gemälde
type: Concept
related match: Walters Art Museum
definition: bdk: museale Sammlung
pref label: Sammlung japanesischer und chinesischer Bronzen, Emaillen, Porzellan, Elfenbeinarbeiten und Gemälde
in scheme: travel!digital Thesaurus

Sammlung japanesischer und chinesischer Bronzen, Emaillen, Porzellan, Elfenbeinarbeiten und Gemälde
type: Label
in scheme: travel!digital Thesaurus

Orientalische Kunstsammlungen
type: Concept
definition: bdk: museale Sammlung
narrower: Collection of Oriental Art
pref label: Orientalische Kunstsammlungen
in scheme: travel!digital Thesaurus

Collection of Oriental Art
type: Concept
related match: Metropolitan Museum of Art
definition: bdk: museale Sammlung
pref label: Collection of Oriental Art
in scheme: travel!digital Thesaurus

Collection of Oriental Art
type: Label
in scheme: travel!digital Thesaurus

Orientalische Kunstsammlungen
type: Label
in scheme: travel!digital Thesaurus

Sammlung von Bildern alter Meister und der englischen Schule
type: Concept
related match: Metropolitan Museum of Art
definition: bdk: museale Sammlung
pref label: Sammlung von Bildern alter Meister und der englischen Schule
in scheme: travel!digital Thesaurus

Sammlung von Bildern alter Meister und der englischen Schule
type: Label
in scheme: travel!digital Thesaurus

Walters Collection
type: Concept
related match: William Thompson Walters
definition: bdk: museale Sammlung
pref label: Walters Collection
in scheme: travel!digital Thesaurus

Walters Collection
type: Label
in scheme: travel!digital Thesaurus

Moore Collection
type: Concept
related match: Metropolitan Museum of Art
definition: bdk: museale Sammlung
pref label: Moore Collection
in scheme: travel!digital Thesaurus

Moore Collection
type: Label
in scheme: travel!digital Thesaurus

Bookwalter Loan Collection
type: Concept
related match: Cincinnati Art Museum
definition: bdk: museale Sammlung
pref label: Bookwalter Loan Collection
in scheme: travel!digital Thesaurus

Bookwalter Loan Collection
type: Label
in scheme: travel!digital Thesaurus

Fenollosa-Sammlung von Japanischen Gemälden
type: Concept
related match: Museum of Fine Arts, Boston
definition: bdk: museale Sammlung
pref label: Fenollosa-Sammlung von Japanischen Gemälden
in scheme: travel!digital Thesaurus

Fenollosa-Sammlung von Japanischen Gemälden
type: Label
in scheme: travel!digital Thesaurus

Glasblumen
type: Concept
definition: bdk: profane Kunst
in scheme: travel!digital Thesaurus
pref label: Glasblumen

Glasblumen
type: Label
in scheme: travel!digital Thesaurus

Morse Collection von Japanischen Thonarbeiten
type: Concept
related match: Museum of Fine Arts, Boston
definition: bdk: museale Sammlung
pref label: Morse Collection von Japanischen Thonarbeiten
in scheme: travel!digital Thesaurus

Morse Collection von Japanischen Thonarbeiten
type: Label
in scheme: travel!digital Thesaurus

Layton Art Gallery
type: Concept
related match: Milwaukee Art Museum
related match: Frederick Layton
definition: bdk: museale Sammlung
pref label: Layton Art Gallery
in scheme: travel!digital Thesaurus

Layton Art Gallery
type: Label
in scheme: travel!digital Thesaurus

Sammlung der großen antiken Bronzebildwerke
type: Concept
definition: bdk: museale Sammlung
pref label: Sammlung der großen antiken Bronzebildwerke
in scheme: travel!digital Thesaurus
related match: Bronze

Sammlung der großen antiken Bronzebildwerke
type: Label
in scheme: travel!digital Thesaurus

Hall of Bronzes and Ceramics
type: Concept
related match: Corcoran Gallery of Art
related match: Bronze
definition: bdk: museale Sammlung
pref label: Hall of Bronzes and Ceramics
in scheme: travel!digital Thesaurus

Hall of Bronzes and Ceramics
type: Label
in scheme: travel!digital Thesaurus

Sammlung antiker Wandgemälde
type: Concept
definition: bdk: museale Sammlung
pref label: Sammlung antiker Wandgemälde
in scheme: travel!digital Thesaurus

Sammlung antiker Wandgemälde
type: Label
in scheme: travel!digital Thesaurus

Stuart Collections
type: Concept
related match: New York City
definition: bdk: museale Sammlung
pref label: Stuart Collections
in scheme: travel!digital Thesaurus

Stuart Collections
type: Label
in scheme: travel!digital Thesaurus

Rinehart Collection
type: Concept
related match: William Henry Rinehart
related match: Baltimore
definition: bdk: museale Sammlung
pref label: Rinehart Collection
in scheme: travel!digital Thesaurus

Rinehart Collection
type: Label
in scheme: travel!digital Thesaurus

Sammlung der Schmucksachen
type: Concept
definition: bdk: museale Sammlung
pref label: Sammlung der Schmucksachen
in scheme: travel!digital Thesaurus

Sammlung der Schmucksachen
type: Label
in scheme: travel!digital Thesaurus

Sammlung japanischer Bronzen, Emaillen, Lackwaren, Waffen, Elfenbein- und Holzschitzereien, Gold- und Silbersachen
type: Concept
related match: Museum of Fine Arts, Boston
related match: Bronze
definition: bdk: museale Sammlung
pref label: Sammlung japanischer Bronzen, Emaillen, Lackwaren, Waffen, Elfenbein- und Holzschitzereien, Gold- und Silbersachen
in scheme: travel!digital Thesaurus

Sammlung japanischer Bronzen, Emaillen, Lackwaren, Waffen, Elfenbein- und Holzschitzereien, Gold- und Silbersachen
type: Label
in scheme: travel!digital Thesaurus

Sammlung der kleinen Bronzen
type: Concept
definition: bdk: museale Sammlung
pref label: Sammlung der kleinen Bronzen
in scheme: travel!digital Thesaurus
related match: Bronze

Sammlung der kleinen Bronzen
type: Label
in scheme: travel!digital Thesaurus

Cesnolasche Sammlung cyprischer Schmucksachen
type: Concept
related match: Metropolitan Museum of Art
related match: Luigi Palma di Cesnola
definition: bdk: museale Sammlung
pref label: Cesnolasche Sammlung cyprischer Schmucksachen
in scheme: travel!digital Thesaurus

Cesnolasche Sammlung cyprischer Schmucksachen
type: Label
in scheme: travel!digital Thesaurus

Folklore
type: Concept
definition: bdk: Volkstum, Brauchtum
narrower: Aufzüge
notation: II.07
narrower: Feria
top concept of: travel!digital Thesaurus

Aufzüge
type: Concept
pref label: Aufzüge
in scheme: travel!digital Thesaurus
definition: bdk: besondere Attraktion

Aufzüge
type: Label
in scheme: travel!digital Thesaurus

Feria
type: Concept
pref label: Feria
in scheme: travel!digital Thesaurus
definition: bdk: besondere Attraktion

Feria
type: Label
in scheme: travel!digital Thesaurus

Ethnisch/nationale Gemeinschaften
type: Concept
narrower: Irländer
narrower: illyrisch
narrower: ligurisch
narrower: Assyrer
narrower: iranisch
narrower: nicht-arisch
narrower: Piute-Indianer
narrower: Osmane
narrower: Toda
narrower: Mongole
narrower: Tlinkit
narrower: Issaschar
narrower: türkisch
narrower: Ascher
narrower: Telugu
narrower: Kastilier
narrower: serbisch
narrower: österreichisch
narrower: Mehadlastamm
narrower: Karer
narrower: polnisch
narrower: Korse
narrower: Tinneh
narrower: philistäisch
narrower: preußisch
narrower: Mohawk
narrower: indoparthisch
narrower: kimmerisch
narrower: slawisch
narrower: Nubier
narrower: Cherokee
narrower: Schweizer
narrower: Krähen-Indianer
narrower: dravidisch
narrower: Israelit
narrower: spanisch
narrower: javanisch
narrower: Hartâni
narrower: Tamile
narrower: Chaldäer
narrower: Däne
narrower: Ätolier
narrower: Pheresiter
narrower: Kondh
narrower: Portugiese
narrower: Malteser
narrower: aragonisch
narrower: vlämisch
narrower: Temîm
narrower: Ungarin
narrower: Normanne
narrower: Kelte
narrower: chaldäisch
narrower: äthiopisch
narrower: Irokese
narrower: Libyer
narrower: Manasse
narrower: Lyder
narrower: norwegisch
narrower: abessinisch
narrower: kurdisch
narrower: Siamese
narrower: Cayuga
narrower: karisch
narrower: Benjaminit
narrower: Ephraimit
narrower: Ruben
narrower: Gog
narrower: russisch
narrower: deutsch
narrower: Bhutaner
narrower: Chasorener
narrower: Malaye
narrower: Nicht-Israelit
narrower: normannisch
narrower: Htêm
narrower: Gote
narrower: Türkin

Irländer
type: Concept
definition: Duden: Ire: Einwohnerbezeichnung zu Irland | Duden: Irland: 1. große Insel westlich von Großbritannien | 2. Staat, dessen Gebiet den größten Teil der Insel Irland umfasst | Meyers Großes Konversations-Lexikon 1907: Irland (hierzu Karte »Irland«; engl. Ireland, bei den keltischen Urbewohnern Eirin oder Erin, d. h. Westland, woraus die bei den Alten üblichen Namen Ierne, Ivernia und Hibernia entstanden), ein mit Großbritannien vereinigtes Königreich, umfaßt die westliche der beiden großen britischen Inseln und liegt zwischen 51°26'–55°23' nördl. Br. und zwischen 5°20'–10°26' westl. L. [...] | Die Bevölkerung Irlands hat wohl zum größten Teil keltisches Blut in den Adern. Jedenfalls haben sich die Nachkommen der schottischen und englischen Kolonisten den eingebornen Kelten derart assimiliert, daß sie in Charakter und Sinnesart als Kelten, d. h. als echte Iren, gelten müssen. In I. wie im Osten Europas bildet aber nicht die Nationalität, sondern die Religion die Scheidewand unter der Bevölkerung. Nicht Kelte und Sachse stehen sich hier gegenüber, sondern Protestant und Katholik, Orangeman und Papist. Bei gewissen nationalen Fragen gehen jedoch beide Parteien oft Hand in Hand, nur daß der protestantische Ire, seinem Ursprung getreu, besonnener und in seinen Ansprüchen gemäßigter ist als der beweglichere Kelte. Von einer keltischen Nationalsprache kann kaum noch die Rede sein, und die Bemühungen der Society for the preservation of the Irish language (s. Keltische Sprachen) werden ohne nachhaltigen Erfolg bleiben, obgleich es ihr gelungen ist, Irisch als Unterrichtsgegenstand in einigen Schulen einzuführen. Indes bedienten sich 1891 immerhin noch 680,174 Menschen der irischen Sprache (gegen 1,204,684 in 1851), aber nur 38,121 Menschen waren des Englischen unkundig. Am zahlreichsten ist diese irisch sprechende Bevölkerung im W. und SW. des Landes und namentlich in Donegal, in Mayo, Galway und Clare, in Kerry und den abgelegenen Gegenden von Cork und Waterford. Die sächsisch…
related match: Republic of Ireland
in scheme: travel!digital Thesaurus
pref label: Irländer

Irländer
type: Label
in scheme: travel!digital Thesaurus

illyrisch
type: Concept
definition: Duden: Illyrien, die Illyrer betreffend; aus Illyrien stammend | [Anm.: unvollständig: Illyrien, die Illyrer betreffend; von den Illyrern stammend, zu ihnen gehörend; in Illyrien gelegen] | Duden: Illyrien: (in der Antike) Gebiet des heutigen Dalmatiens und Albaniens | Meyers Großes Konversations-Lexikon 1907: Illyrĭen (griech. Illyris), seit dem 4. vorchristl. Jahrh. ein Reich der Autariaten und Ardiäer nördlich von Epirus; dann seit 168 v. Chr., unter dem Namen Illyricum, administrative Benennung des römischen Küstenlandes am Adriatischen Meer von Istria an bis an den Drilon (Drin) und im Innern bis an den Savus (Sau) und Drinus (Drina), ein zum größten Teil von rauhen Gebirgszügen erfülltes Land, das sich im ganzen mehr zur Viehzucht als zum Ackerbau eignete, aber reiche Gold- und Silbergruben enthielt. Es entsprach ungefähr dem heutigen Bosnien und Dalmatien. Im weitern Sinne begriff Illyricum in der Kaiserzeit auch Pannonien in sich, seit Diokletian ganz Griechenland und Kreta, Mazedonien, Dardanien, Dacia südlich der Donau, Obermösien und das ursprüngliche I., mit Ausschluß von Dalmatia (d. h. Bosnien und Dalmatien). – Das Land hatte seinen Namen von dem Volk der Illyrier, die, aus zahlreichen Stämmen bestehend, mit den Thrakern wahrscheinlich einen eignen Zweig des indogermanischen Völker- und Sprachstammes bildeten. Ihre Zerrissenheit verhinderte die Entwickelung eines selbständigen Staatslebens. Im 4. Jahrh. v. Chr. unternahmen sie unter ihrem Fürsten Bardylis manchen glücklichen Zug gegen Mazedonien, wurden dann aber unter König Philipp II., Alexander d. Gr. und Philipp III. von Mazedonien abhängig. Später nahm Pyrrhos von Epirus den von den Mazedoniern verschont gebliebenen Teil Illyriens, oberhalb Montenegros, weg, und erst Agron, der auch in heftige Händel mit den Römern geriet, gewann ihn wieder. Seine Gemahlin Teuta, die nach seinem Tode die[761] Herrschaft innehatte, geriet in Streitigkeiten mit den Römern, die zu dem Illyrischen Krieg, auch Seeräube…
related match: Illyria
related match: Illyrians
in scheme: travel!digital Thesaurus
pref label: illyrisch
narrower: illyrisch-griechisch

illyrisch
type: Label
in scheme: travel!digital Thesaurus

illyrisch-griechisch
type: Concept
in scheme: travel!digital Thesaurus
pref label: illyrisch-griechisch
definition: bdk: siehe illyrisch, griechisch

illyrisch-griechisch
type: Label
in scheme: travel!digital Thesaurus

ligurisch
type: Concept
related match: Ligures
definition: Duden: Ligurien betreffend, aus Ligurien stammend | [Anm.: unvollständig: Ligurien, die Ligurer betreffend; von den Ligurern stammend, zu ihnen gehörend; in Ligurien gelegen] | Duden: Ligurien: italienische Region | Meyers Großes Konversations-Lexikon 1908: Ligurĭen, das Land der Ligurer, eines politisch nie geeinigten Volkes in Oberitalien, über dessen ethnographische Zugehörigkeit bis jetzt nichts Sicheres ermittelt worden ist; fest steht nur, daß sie zu den Indogermanen gehörten und weder Kelten noch Iberer waren, obschon sie letztern im Äußern glichen. Daß die Ligurer oder (griech.) Ligyer in den ältesten Zeiten ein mächtiges Volk waren, sehen wir daraus, daß Herodot sie in der Gegend von Massilia kennt, und daß man dem Meer südlich von Gallien den Namen[546] des Ligurischen beilegte, der später nur dem Meerbusen von Genua verblieb. Das in der ältesten Zeit von den Ligyern bewohnte Küstenland am Mittelmeer umfaßte im W. die Rhonemündungen, im O. die nördlichen Küsten Tyrrheniens; spätere Schriftsteller beschränken die Ausdehnung des Volkes beiderseits bedeutend. Augustus stellte den Umfang Liguriens so fest, daß im W. der Varus (Var) und die Alpen bis zum Vesulus (Monte Viso), im N. der Padus (Po) bis in die Gegend der Ticinusmündung und im O. der Macra (Magra) die Grenzen bildeten. Erst nach langwierigen Kämpfen, die fast das ganze zweite vorchristliche Jahrhundert hindurch dauerten, unterwarfen sich die Römer das Volk. Die Ligurer waren ebenso gute Jäger wie tüchtige Krieger und besonders gute Schleuderer. Auch als Seefahrer gewandt und geübt, trieben sie auf kleinen Fahrzeugen bis zu den Säulen des Herkules Schiffahrt und Seeräuberei. Ihre Hauptbeschäftigung aber war Viehzucht. Sie brachten Schlachtvieh, Häute, Pferde und Maultiere, Wachs, Honig, Leibröcke und Kriegsmäntel zur Ausfuhr, und zwar von Genua aus, ihrem Hauptmarkt, wo sie auch ihre Bedürfnisse, namentlich Öl und Getreide, holten. Ihre wichtigsten Ortschaften waren außer Genua: Nicäa (Nizza), Savo …
pref label: ligurisch
in scheme: travel!digital Thesaurus
related match: Liguria

ligurisch
type: Label
in scheme: travel!digital Thesaurus

Assyrer
type: Concept
definition: Duden: Einwohnerbezeichnung | [Anm.: unvollständig: Einwohnerbezeichnung zu Assyrien] | Duden: Assyrien: (im Altertum) Reich in Mesopotamien | Meyers Großes Konversations-Lexikon 1905: Assyrien, im engsten und ursprünglichsten Sinne der von dem semitischen Stamm der Assyrer bewohnte Landstrich zwischen Tigris, dem untern Zab und den kurdischen Bergen, der bei den Assyrern selbst, deren Stammland er war, Assur (s. d.) hieß. Später wurde darunter alles Land zu beiden Seiten des Tigris und am Fuß der Gebirge bis zum Diala südwärts verstanden, und noch weitere Ausdehnung erhielt der Name durch die Eroberungen der assyrischen Könige, die schon im 12. Jahrh. v. Chr. unter Tiglathpileser I. vorübergehend bis an das Mittelmeer reichten und seit Asurnazirpal (884–860) sich über Babylonien, Westmedien, Armenien, Mesopotamien, Syrien, Palästina und Ägypten ausdehnten. Die Griechen verstanden unter A. meist das syrische Küsten- und das untere Euphrat-Tigrisland mit, ja beschränkten zuweilen den Namen auf letzteres. Das eigentliche A. ist eine räumlich beschränkte, fruchtbare, durch viele Gebirgsbäche bewässerte Ebene, die von niedern Höhenzügen vielfach durchschnitten ist. Der Muschelkalk derselben und große Tonlager lieferten gutes Baumaterial, die nahen Gebirge Marmor, Alabaster, Silber, Kupfer, Blei und Eisen, wodurch Baukunst und Skulptur mächtig gefördert wurden. Die wichtigsten Städte waren Assur, Kelach, Ninua oder Ninive, sämtlich am Tigris gelegen, und Arbaïlu (Arbela, heute Erbil) zwischen den beiden Zab. [...] | Quelle: Meyers Großes Konversations-Lexikon, Band 1. Leipzig 1905, S. 893-895. | Permalink: http://www.zeno.org/nid/20006260497
related match: History of the Assyrian people
pref label: Assyrer
in scheme: travel!digital Thesaurus
related match: Assyria

Assyrer
type: Label
in scheme: travel!digital Thesaurus

iranisch
type: Concept
definition: Duden: den Iran, die Iraner betreffend; zum Iran gehörend, aus dem Iran stammend | [Anm.: unvollständig: Iran, die Iraner betreffend; von den Iranern stammend, zu ihnen gehörend; in Iran gelegen] | Duden: Iran: Staat in Asien | Meyers Großes Konversations-Lexikon 1907: Iran (Eran), das große vorderasiatische Tafelland südlich des Hindukusch und des Elburz vom Indus im O. bis zum Tigris im W., gegen S. bis an den Persischen Meerbusen u. das Indische Meer reichend und 2,700,000 qkm groß, das politisch in die Länder Afghanistan mit Kafiristan, Belutschistan und Persien zerfällt; welch letzteres die Benennung I. offiziell für sich allein beansprucht. Die Bewohner bilden den iranischen Zweig des indogermanischen Urvolkes (s. Arier). In den Pehlewi-Inschriften des Sasaniden Shapur I. (241–272) heißt das Land Airan (Aryan), d. h. Land der Arier, im Gegensatz zu Aneran (Anairan, Anaryan): Land der Nichtarier; letzteres heißt seit Firdosi Turan. Strabon faßt unter Ariana die Provinzen Gedrosien, Drangiana, Arachosien, Parapanisos, Aria, Parthien und Karmanien zusammen. Über die neuere Erforschung[7] Irans s. Asien, S. 872. Vgl. Spiegel, Eranische Altertumskunde (Leipz. 1871–78, 3 Bde.); v. Gutschmid, Geschichte Irans von Alexander d. Gr. bis zum Untergang der Arsakiden (Tübing. 1888). | Quelle: Meyers Großes Konversations-Lexikon, Band 10. Leipzig 1907, S. 7-8. | Permalink: http://www.zeno.org/nid/20006827497
related match: Iran
related match: Iranian peoples
in scheme: travel!digital Thesaurus
pref label: iranisch

iranisch
type: Label
in scheme: travel!digital Thesaurus

nicht-arisch
type: Concept
in scheme: travel!digital Thesaurus
pref label: nicht-arisch
related: arisch
definition: bdk: siehe arisch

nicht-arisch
type: Label
in scheme: travel!digital Thesaurus

arisch
type: Concept
in scheme: travel!digital Thesaurus
related: Arier
narrower: indo-arisch
definition: Duden: 1. (Völkerkunde, Sprachwissenschaft) die Arier oder ihre Sprachen betreffend, ihnen zugehörend, eigentümlich, von ihnen stammend | 2. (nationalsozialistisch) die sogenannten Arier betreffend, ihnen zugehörend, ihnen eigentümlich; von sogenannten Ariern stammend; nicht jüdisch
pref label: arisch

Arier
type: Concept
definition: Duden: 1. (Völkerkunde, Sprachwissenschaft) Angehöriger eines der frühgeschichtlichen Völker mit indogermanischer Sprache in Indien und Iran | 2. (nationalsozialistisch) (in der rassistischen Ideologie des Nationalsozialismus) Angehöriger einer (besonders in Gegensatz zu den Juden definierten) angeblich geistig, politisch und kulturell überlegenen nordischen (2) Menschengruppe | Meyers Großes Konversations-Lexikon 1905: Arĭer (v. sanskrit. ârya, »der Arier, Vornehme«), früher vielfach als Bezeichnung der Indogermanen gebraucht, jetzt aber auf den asiatischen Zweig derselben, nämlich die Inder und Iranier, eingeschränkt. Die Annahme, daß der Volksname A. schon in der U-sprache der noch ungetrennten Indogermanen vorgekommen sei und im äußersten Westen in dem Namen der Insel Irland (Erin) sich erhalten habe, hat sich als irrig erwiesen. Dagegen ist der Name A. bei den alten Indern, Persern und Skythen mit Sicherheit nachgewiesen und hat sich bis auf den heutigen Tag in dem Ländernamen Iran und in dem Volksnamen Iron der Osseten im Kaukasus erhalten. Die Urarier, d.h. die Vorfahren der Inder und Iranier, mögen etwa an den Abhängen des Hindukusch, im Quellgebiete des Oxus, gewohnt und sich von da aus teils über Iran, teils über Kabul nach Indien ausgebreitet haben. Sowohl in der Sprache als in den Sitten, namentlich aber in den religiösen Vorstellungen und Geb-äuchen haben sich bei den Indern und Iraniern eine Menge gemeinsamer Züge erhalten. Vgl. Fick, Vergleichendes Wörterbuch der indogermanischen Sprachen, Bd. 1 (4. Aufl., Götting. 1890); Bartholomae, Arisch: Forschungen (Hall.: 1883–1887, 3 Hefte); Spiegel, Die arische Periode und ihre Zustände (Leipz. 1887). | Quelle: Meyers Großes Konversations-Lexikon, Band 1. Leipzig 1905, S. 757. | Permalink: http://www.zeno.org/nid/20006250300
narrower: Indoarier
in scheme: travel!digital Thesaurus
pref label: Arier

Indoarier
type: Concept
in scheme: travel!digital Thesaurus
pref label: Indoarier
definition: Duden: Angehöriger eines der zu den Ariern gehörenden Völker Vorderindiens
related: Inder
related match: Indo-Aryan languages

Indoarier
type: Label
in scheme: travel!digital Thesaurus

Inder
type: Concept
narrower: Nordindier
definition: Duden: Einwohnerbezeichnung zu Indien | Duden: Indien: Staat in Südasien | Meyers Großes Konversations-Lexikon 1907: Indĭen (India), bei den Griechen und Römern Bezeichnung für die gesamte jenseit des Indus, südlich und südöstlich vom Imaos (Himalaja) gelegene Ländermasse Asiens: das jetzige Vorder- und Hinterindien nebst einem Teil Chinas. Während die Ägypter und Phöniker schon sehr früh mit der Westküste Vorderindiens in Handelsverkehr standen, hatten d [e Griechen in älterer Zeit von I. nur dürftige Nachrichten, die sie über Persien (z. B. durch Ktesias) erhielten. Herodot kennt von I. nur die Gegend des Indus; bei der Beschreibung von Xerxes' Heer führt er die »dunkel-gefärbten« indischen Hilfstruppen an und nennt sie »Äthiopier vom Sonnenaufgang«. Sehr erweitert wurde die Kenntnis von I. durch den Zug Alexanders d. Gr. nach dem »Fünfstromland« (Pentapotamien, Pandschab) und durch Seleukos Nikator, der (305) bis zur Jamuna (Dschamna) vordrang, namentlich aber durch Megasthenes, der als Seleukos'[793] Gesandter längere Zeit zu Pataliputra, der Residenz des Inderfürsten Sandrokottos (Tschandragupta), verweilte. Eratosthenes (gest. 193 v. Chr.) kannte bereits die südliche Zuspitzung der vorderindischen Halbinsel sowie Taprobane (Ceylon), verlegte aber den Ganges, als den östlichen Grenzfluß Indiens, in die Nähe von Thinai (China). Unter Kaiser Claudius (gest. 54 n. Chr.) kamen Gesandte des Königs Rochias von Ceylon nach Rom. Der Geograph Ptolemäos (2. Jahrh. n. Chr.), der schon Vorder- und Hinterindien unterscheidet, erwähnt den »goldenen Chersones« (die Halbinsel Malakka) sowie Java und andre indische Inseln. Natur- und Kunsterzeugnisse Indiens waren schon seit den Zeiten der Seleukiden immer häufiger nach Europa gekommen; im Mittelalter gelangten sie teils auf dem Karawanenweg durch die Wüsten Innerasiens nach den Küstenländern des Kaspischen und Schwarzen Meeres, teils durch die Araber, die bereits in den ersten Jahrhunderten nach Mohammed die indischen Meere be…
narrower: Südindier
narrower: Anglo-Inder
pref label: Inder
related match: India
in scheme: travel!digital Thesaurus

Nordindier
type: Concept
in scheme: travel!digital Thesaurus
definition: bdk: Nordinder: siehe Inder
pref label: Nordindier

Nordindier
type: Label
in scheme: travel!digital Thesaurus

Südindier
type: Concept
in scheme: travel!digital Thesaurus
definition: bdk: Südinder: siehe Inder
pref label: Südindier

Südindier
type: Label
in scheme: travel!digital Thesaurus

Anglo-Inder
type: Concept
in scheme: travel!digital Thesaurus
related: Engländer
definition: Duden EN: Anglo-Indian: B. s | 1. obs in Indien geborene(r) oder lebende(r) Engländer(in) | 2. Angloinder(in)
pref label: Anglo-Inder
related: Brite

Engländer
type: Concept
preferred label: inglês @pt
pref label: anglais
pref label: inglês
preferred label: inglés @es
related: Brite
pref label: Engländer
preferred label: anglais @fr
related match: England
definition: Duden: Angehöriger des englischen Volkes, aus England stammende Person | [Anm.: Ergänzung: Einwohnerbezeichnung zu England] | Duden: England: 1. Teil von Großbritannien | 2. (volkstümlich) Großbritannien | siehe auch: Meyers Großes Konversations-Lexikon 1906: England | Quelle: Meyers Großes Konversations-Lexikon, Band 5. Leipzig 1906, S. 793-805. | Permalink: http://www.zeno.org/nid/2000655427X
in scheme: travel!digital Thesaurus
pref label: inglés

anglais
type: Label
hasTranslation: inglés
hasTranslation: inglês
isTranslationOf: Engländer
in scheme: travel!digital Thesaurus

inglés
type: Label
hasTranslation: anglais
isTranslationOf: Engländer
hasTranslation: inglês
in scheme: travel!digital Thesaurus

Engländer
type: Label
hasTranslation: anglais
hasTranslation: inglés
hasTranslation: inglês
in scheme: travel!digital Thesaurus

inglês
type: Label
hasTranslation: anglais
hasTranslation: inglés
in scheme: travel!digital Thesaurus

Brite
type: Concept
definition: Duden: Einwohnerbezeichnung | [Anm.: unvollständig: Einwohnerbezeichnung zu Großbritannien] | Duden: Großbritannien: Kurzwort für: Vereinigtes Königreich Großbritannien und Nordirland; Kurzform: Britannien (1) | siehe auch: Meyers Großes Konversations-Lexikon 1907: Großbritannien | Quelle: Meyers Großes Konversations-Lexikon, Band 8. Leipzig 1907, S. 362-419. | Permalink: http://www.zeno.org/nid/20006713033
related match: United Kingdom
in scheme: travel!digital Thesaurus
pref label: Brite

Brite
type: Label
in scheme: travel!digital Thesaurus

Anglo-Inder
type: Label
in scheme: travel!digital Thesaurus

Inder
type: Label
in scheme: travel!digital Thesaurus

Arier
type: Label
in scheme: travel!digital Thesaurus

indo-arisch
type: Concept
definition: Duden: indoarisch: die von den Ariern (1) hergeleiteten Völker Vorderasiens betreffend | [Anm.: unvollständig: die Arier betreffend; von den Ariern stammend, zu ihnen gehörend] | Duden: Indoarier: Angehöriger eines der zu den Ariern gehörenden Völker Vorderindiens
related: Indoarier
related: indisch
pref label: indo-arisch
in scheme: travel!digital Thesaurus

indisch
type: Concept
narrower: chinesisch-hinterindisch
alt label: altindisch
narrower: englisch-indisch
narrower: anglo-indisch
pref label: indian
narrower: nordindisch
alternative label: altindisch
preferred label: indian @en
narrower: indisch-archäologisch
narrower: national-indisch
narrower: indisch-buddhistisch
in scheme: travel!digital Thesaurus
narrower: zentralindisch
narrower: einheimisch-indisch
narrower: britisch-indisch
narrower: persisch-indisch
definition: Duden: zu Indien | [Anm.: unvollständig: Indien, die Inder betreffend; von den Indern stammend, zu ihnen gehörend; in Indien gelegen]
narrower: vorderindisch
narrower: südindisch
narrower: arabisch-indisch
narrower: ostindisch
narrower: indisch-sarazenisch
narrower: französisch-indisch
pref label: indisch
related: Inder
narrower: indisch-britisch
narrower: niederländisch-indisch

chinesisch-hinterindisch
type: Concept
definition: bdk: siehe chinesisch, indisch | Duden: Hinterindien: südöstliche Halbinsel Asiens | Duden EN: Indo-Chinese, Indochinese adj indochinesisch, hinterindisch
pref label: chinesisch-hinterindisch
in scheme: travel!digital Thesaurus
related: indochinesisch

chinesisch-hinterindisch
type: Label
in scheme: travel!digital Thesaurus

indochinesisch
type: Concept
definition: bdk: siehe chinesisch, indisch, chinesisch-hinterindisch | Duden EN: Indo-Chinese, Indochinese adj indochinesisch, hinterindisch
alternative label: indo-chinesisch
alt label: indo-chinesisch
in scheme: travel!digital Thesaurus
pref label: indochinesisch
related: indisch

indo-chinesisch
type: Label
isVariantOf: indochinesisch
in scheme: travel!digital Thesaurus

indochinesisch
type: Label
hasVariant: indo-chinesisch
in scheme: travel!digital Thesaurus

altindisch
type: Label
in scheme: travel!digital Thesaurus

englisch-indisch
type: Concept
in scheme: travel!digital Thesaurus
definition: bdk: siehe englisch, indisch
pref label: englisch-indisch
related: britisch-indisch
narrower: englisch-ostindisch

englisch-indisch
type: Label
in scheme: travel!digital Thesaurus

britisch-indisch
type: Concept
in scheme: travel!digital Thesaurus
narrower: britisch-ostindisch
pref label: britisch-indisch
definition: bdk: siehe britisch, indisch

britisch-ostindisch
type: Concept
definition: bdk: siehe britisch, ostindisch
pref label: britisch-ostindisch
in scheme: travel!digital Thesaurus

britisch-ostindisch
type: Label
in scheme: travel!digital Thesaurus

britisch-indisch
type: Label
in scheme: travel!digital Thesaurus

englisch-ostindisch
type: Concept
definition: bdk: siehe englisch, ostindisch
pref label: englisch-ostindisch
in scheme: travel!digital Thesaurus
related: britisch-ostindisch

englisch-ostindisch
type: Label
in scheme: travel!digital Thesaurus

anglo-indisch
type: Concept
definition: Duden EN: Anglo-Indian: A. adj angloindisch | [Anm.: unvollständig: die Anglo-Inder betreffend; von den Anglo-Indern stammend, zu ihnen gehörend]
pref label: anglo-indisch
related: englisch-indisch
related: Anglo-Inder
in scheme: travel!digital Thesaurus
alt label: alt-angloindisch
alternative label: alt-angloindisch
related: britisch-indisch

anglo-indisch
type: Label
in scheme: travel!digital Thesaurus

alt-angloindisch
type: Label
in scheme: travel!digital Thesaurus

indian
type: Label
isTranslationOf: indisch
in scheme: travel!digital Thesaurus

indisch
type: Label
hasTranslation: indian
in scheme: travel!digital Thesaurus

nordindisch
type: Concept
in scheme: travel!digital Thesaurus
definition: bdk: siehe indisch
related: Nordindier
pref label: nordindisch

nordindisch
type: Label
in scheme: travel!digital Thesaurus

indisch-archäologisch
type: Concept
in scheme: travel!digital Thesaurus
definition: bdk: siehe indisch | Duden: archäologisch: auf der Archäologie beruhend, sie anwendend, betreffend, dazu gehörend | Duden: Archäologie: Wissenschaft von den sichtbaren Überresten alter Kulturen; Altertumsforschung, -kunde, -wissenschaft
pref label: indisch-archäologisch

indisch-archäologisch
type: Label
in scheme: travel!digital Thesaurus

national-indisch
type: Concept
in scheme: travel!digital Thesaurus
pref label: national-indisch
definition: bdk: siehe indisch | Duden: national: 1. eine Nation betreffend; zur Nation gehörend | 2. überwiegend die Interessen der eigenen Nation vertretend; patriotisch gesinnt

national-indisch
type: Label
in scheme: travel!digital Thesaurus

indisch-buddhistisch
type: Concept
in scheme: travel!digital Thesaurus
definition: bdk: siehe indisch, buddhistisch
pref label: indisch-buddhistisch

indisch-buddhistisch
type: Label
in scheme: travel!digital Thesaurus

zentralindisch
type: Concept
definition: bdk: siehe indisch
in scheme: travel!digital Thesaurus
pref label: zentralindisch

zentralindisch
type: Label
in scheme: travel!digital Thesaurus

einheimisch-indisch
type: Concept
in scheme: travel!digital Thesaurus
definition: bdk: siehe einheimisch, indisch
pref label: einheimisch-indisch

einheimisch-indisch
type: Label
in scheme: travel!digital Thesaurus

persisch-indisch
type: Concept
in scheme: travel!digital Thesaurus
pref label: persisch-indisch
definition: bdk: siehe persisch, indisch

persisch-indisch
type: Label
in scheme: travel!digital Thesaurus

vorderindisch
type: Concept
in scheme: travel!digital Thesaurus
pref label: vorderindisch
definition: Duden: Vorderindien: der indische Subkontinent

vorderindisch
type: Label
in scheme: travel!digital Thesaurus

südindisch
type: Concept
in scheme: travel!digital Thesaurus
definition: bdk: siehe indisch
pref label: südindisch
related: Südindier

südindisch
type: Label
in scheme: travel!digital Thesaurus

arabisch-indisch
type: Concept
in scheme: travel!digital Thesaurus
definition: bdk: siehe arabisch, indisch
pref label: arabisch-indisch

arabisch-indisch
type: Label
in scheme: travel!digital Thesaurus

ostindisch
type: Concept
related match: East Indies
narrower: britisch-ostindisch
pref label: ostindisch
pref label: east indian
narrower: holländisch-ostindisch
in scheme: travel!digital Thesaurus
preferred label: east indian @en
narrower: englisch-ostindisch
narrower: französisch-ostindisch
definition: bdk: siehe indisch
related match: East India

ostindisch
type: Label
hasTranslation: east indian
in scheme: travel!digital Thesaurus

east indian
type: Label
isTranslationOf: ostindisch
in scheme: travel!digital Thesaurus

holländisch-ostindisch
type: Concept
definition: bdk: siehe holländisch, ostindisch
pref label: holländisch-ostindisch
in scheme: travel!digital Thesaurus
related: niederländisch-indisch

holländisch-ostindisch
type: Label
in scheme: travel!digital Thesaurus

niederländisch-indisch
type: Concept
alt label: nederlandsch-indisch
pref label: niederländisch-indisch
in scheme: travel!digital Thesaurus
alternative label: nederlandsch-indisch @nl
definition: bdk: siehe niederländisch, indisch
pref label: nederlandsch indisch
preferred label: nederlandsch indisch @nl

nederlandsch-indisch
type: Label
isVariantOf: nederlandsch indisch
in scheme: travel!digital Thesaurus

nederlandsch indisch
type: Label
isTranslationOf: niederländisch-indisch
in scheme: travel!digital Thesaurus
hasVariant: nederlandsch-indisch

niederländisch-indisch
type: Label
hasTranslation: nederlandsch indisch
in scheme: travel!digital Thesaurus

französisch-ostindisch
type: Concept
definition: bdk: siehe französisch, ostindisch
in scheme: travel!digital Thesaurus
pref label: französisch-ostindisch

französisch-ostindisch
type: Label
in scheme: travel!digital Thesaurus

indisch-sarazenisch
type: Concept
in scheme: travel!digital Thesaurus
definition: bdk: siehe indisch, sarazenisch
pref label: indisch-sarazenisch

indisch-sarazenisch
type: Label
in scheme: travel!digital Thesaurus

französisch-indisch
type: Concept
in scheme: travel!digital Thesaurus
pref label: französisch-indisch
definition: bdk: siehe französisch, indisch
narrower: französisch-ostindisch

französisch-indisch
type: Label
in scheme: travel!digital Thesaurus

indisch-britisch
type: Concept
in scheme: travel!digital Thesaurus
pref label: indisch-britisch
definition: bdk: siehe indisch, britisch
related: britisch-indisch

indisch-britisch
type: Label
in scheme: travel!digital Thesaurus

indo-arisch
type: Label
in scheme: travel!digital Thesaurus

arisch
type: Label
in scheme: travel!digital Thesaurus

Piute-Indianer
type: Concept
definition: Meyers Großes Konversations-Lexikon 1908: Pah Utah (Pah Ute, Piute), nordamerikan. Indianerstamm in Nevada, der zum Schoschonenzweig des utoaztekischen Sprachstammes gehört und 1890: 1169 Seelen zählte. S. Tafel »Amerikanische Völker I«, Fig. 9 u. 10. | Quelle: Meyers Großes Konversations-Lexikon, Band 15. Leipzig 1908, S. 308. | Permalink: http://www.zeno.org/nid/2000720356X
in scheme: travel!digital Thesaurus
related: Indianer
pref label: Piute-Indianer

Indianer
type: Concept
narrower: Vollblut-Indianer
narrower: Halbblut-Indianer
definition: Duden: Angehöriger der in zahlreiche Stämme verzweigten Ureinwohner Amerikas | Meyers Großes Konversations-Lexikon 1907: Indianer (hierzu die Tafeln »Indianische Kultur I-III«, mit Textblatt), die Ureinwohner Amerikas, so von den spanischen Entdeckern genannt, welche die Neue Welt für einen Teil In diens ansahen. Der neuerdings für sie vorgeschlagene Name »Amerind«, Abkürzung für »amerikanische I.«, dürfte schwerlich allgemeinern Eingang finden. Trotz großer Verschiedenheit in der körperlichen und geistigen Entwickelung werden sie, mit Einschluß der Eskimo, einer Rasse, der amerikanischen, zugerechnet, welche die nächste Verwandtschaft mit der mongolischen zeigt. Ihre Hautfarbe ist ein helles Braun mit einem rötlichen Unterton (daher Rothäute), das Haar ist schwarz, dick und straff, der Bartwuchs spärlich. Die Backenknochen sind vorstehend, die Augen klein und etwas schief gestellt; die Stirn ist niedrig, die Nase häufig gekrümmt, der Schädel größtenteils mesokephal. Sie sind im allgemeinen von mittlerer Größe und gedrungenem Körperbau. Ihre geistige Begabung ist nicht unbedeutend, doch sind sie wenig geschickt in der Aneignung einer fremden Zivilisation. Ihre Sinne sind stark entwickelt, die Gemütsstimmung meist ernst. Ihr Charakter zeigt ein Gemisch von Tugenden und Lastern: Mut, Standhaftigkeit, Ehrgefühl auf der einen Seite, Trägheit, Grausamkeit, Falschheit auf der andern. – Weiteres über die Herkunft und Einteilung der I. s. Artikel »Amerikanische Sprachen« und »Amerikanische Völker« mit Tafel I und II. | Das durch die Phantasie von Romanschriftstellern (Benjamin Cooper) geschaffene Bild des Indianers bezieht sich auf die nordamerikanischen Jägervölker, die eigentlichen Rothäute, entspricht jedoch nur wenig der Wirklichkeit. Im allgemeinen ist Verschlossenheit ein Grundzug ihres Charakters. Der I. trägt eine äußerliche Gleichgültigkeit zur Schau, während er sich leidenschaftlichen Erregungen (Spiel. Liebe) mit Lebhaftigkeit hingibt. Den Schmerz erträgt er mit …
in scheme: travel!digital Thesaurus
pref label: Indianer

Vollblut-Indianer
type: Concept
definition: bdk: siehe Indianer
in scheme: travel!digital Thesaurus
pref label: Vollblut-Indianer

Vollblut-Indianer
type: Label
in scheme: travel!digital Thesaurus

Halbblut-Indianer
type: Concept
definition: bdk: siehe Indianer
pref label: Halbblut-Indianer
in scheme: travel!digital Thesaurus

Halbblut-Indianer
type: Label
in scheme: travel!digital Thesaurus

Indianer
type: Label
in scheme: travel!digital Thesaurus

Piute-Indianer
type: Label
in scheme: travel!digital Thesaurus

Osmane
type: Concept
pref label: Osmane
definition: Duden: Bewohner des Osmanischen Reichs (der heutigen Türkei) | Duden: Türkei: Staat in Vorderasien und Südosteuropa | Meyers Großes Konversations-Lexikon 1908: Osmānen (Osmanli), offizieller Name der Türken, nach Osman I., dem Gründer ihres Reiches. | Quelle: Meyers Großes Konversations-Lexikon, Band 15. Leipzig 1908, S. 161. | Permalink: http://www.zeno.org/nid/20007194595 | Meyers Großes Konversations-Lexikon 1909: Türkisches Reich. Das türkische oder osmanische Reich (türk. Memâlik-i Osmanije, »die osmanischen Länder«, oder Devlet-i Alije, »das hohe Reich«) umfaßt die gesamte Ländermasse, die in Europa, Asien und Afrika unter der Herrschaft des Sultans (Padischah) in Konstantinopel steht, d. h. Teile der Balkanhalbinsel, den westlichsten Teil Vorderasiens (Asiatische Türkei, s. unten, S. 823) sowie den Nordosten von Afrika (Tributärstaat Ägypten und als unmittelbaren Besitz Tripolitanien, Barka und Fezzan; vgl. diese Artikel). Es sind teils unmittelbare Besitzungen, teils tributäre oder unter fremder Verwaltung stehende Staaten; letztere gehören nur äußerlich zur Türkei, sind tatsächlich selbständig (Bulgarien mit Ostrumelien, Samos, Kreta) oder von Österreich-Ungarn (Bosnien und Herzegowina) und England (Cypern, Ägypten) besetzt. Große Strecken Landes in Albanien, Kleinasien und Kurdistan sind faktisch der Türkenherrschaft gänzlich entzogen; die Grenzen des Reiches stehen besonders gegen das unabhängige Arabien und Afrika hin nicht fest. Deswegen und wegen des Fehlens jeder brauchbaren offiziellen Statistik sind die Angaben über Grenzen, Areal und Bevölkerung nur annähernd richtig und unterliegen großen Schwankungen. Das ganze Türkische Reich wird in 30 Provinzen oder Wilajets, davon 7 in Europa, und 6 Mutesarrifliks, davon 1 in Europa, geteilt.[815] [...] | Die Osmanen (Osmanli), das herrschende Volk. obwohl sie keineswegs die Mehrzahl bilden, sind ein Turkvolk (s. Türken), ein schöner Menschenschlag mit edlen Gesichtszügen. Ihre hervorstechenden Nationalzüge s…
related: Türke
related match: Ottoman dynasty
in scheme: travel!digital Thesaurus
related: Osman
related match: Ottoman Empire

Osmane
type: Label
in scheme: travel!digital Thesaurus

Türke
type: Concept
in scheme: travel!digital Thesaurus
alternative label: Alttürke
alt label: Alttürke
related match: Turkey
pref label: Türke
definition: Duden: 1. Einwohnerbezeichnung | [Anm.: unvollständig: Einwohnerbezeichnung zu Türkei] | Meyers Großes Konversations-Lexikon 1909: Türkisches Reich. Das türkische oder osmanische Reich (türk. Memâlik-i Osmanije, »die osmanischen Länder«, oder Devlet-i Alije, »das hohe Reich«) umfaßt die gesamte Ländermasse, die in Europa, Asien und Afrika unter der Herrschaft des Sultans (Padischah) in Konstantinopel steht, d. h. Teile der Balkanhalbinsel, den westlichsten Teil Vorderasiens (Asiatische Türkei, s. unten, S. 823) sowie den Nordosten von Afrika (Tributärstaat Ägypten und als unmittelbaren Besitz Tripolitanien, Barka und Fezzan; vgl. diese Artikel). Es sind teils unmittelbare Besitzungen, teils tributäre oder unter fremder Verwaltung stehende Staaten; letztere gehören nur äußerlich zur Türkei, sind tatsächlich selbständig (Bulgarien mit Ostrumelien, Samos, Kreta) oder von Österreich-Ungarn (Bosnien und Herzegowina) und England (Cypern, Ägypten) besetzt. Große Strecken Landes in Albanien, Kleinasien und Kurdistan sind faktisch der Türkenherrschaft gänzlich entzogen; die Grenzen des Reiches stehen besonders gegen das unabhängige Arabien und Afrika hin nicht fest. Deswegen und wegen des Fehlens jeder brauchbaren offiziellen Statistik sind die Angaben über Grenzen, Areal und Bevölkerung nur annähernd richtig und unterliegen großen Schwankungen. Das ganze Türkische Reich wird in 30 Provinzen oder Wilajets, davon 7 in Europa, und 6 Mutesarrifliks, davon 1 in Europa, geteilt.[815] [...] | Durch die Vielgestaltigkeit der Oberfläche ist die politische und ethnographische Zersplitterung der Balkanhalbinsel bedingt, deren Bewohner das bunteste Völkergemisch Europas bilden. Heftigster Nationalitätenstreit und rücksichtsloseste Propaganda herrschen zwischen den einzelnen unter sich und gegen die türkische Herrschaft feindlich gesinnten Nationen (orientalische Frage. mazedonische Frage). so daß die Türkei nur mühsam und durch die europäischen Mächte gedrängt ihre Herrschaft zu behaup…

Alttürke
type: Label
in scheme: travel!digital Thesaurus

Türke
type: Label
in scheme: travel!digital Thesaurus

Osman
type: Concept
alternative label: Osmán
in scheme: travel!digital Thesaurus
alt label: Osmán
pref label: Osman
definition: bdk: Herrschergeschlecht im osmanischen Reich | Brockhaus' Kleines Konversations-Lexikon 1911: Osman, mehrere türk. Sultane. – O. I., Gründer des nach ihm benannten Osman. Reichs, geb. 1259 zu Sukut in Bithynien, Sultan 1288-1326. – O. II., Sohn Achmeds I., geb. 1605, Sultan 1618-22. – O. III., Sohn Mustaphas II., Sultan 1754-57. | Quelle: Brockhaus' Kleines Konversations-Lexikon, fünfte Auflage, Band 2. Leipzig 1911., S. 322. | Permalink: http://www.zeno.org/nid/20001413139

Osmán
type: Label
isVariantOf: Osman
in scheme: travel!digital Thesaurus

Osman
type: Label
hasVariant: Osmán
in scheme: travel!digital Thesaurus

Toda
type: Concept
in scheme: travel!digital Thesaurus
pref label: Toda
definition: Meyers Großes Konversations-Lexikon 1909: Toda (Tuda, Tudavar), Drawidastamm in den Nilgiri um Utakamand herum, 1901 nur noch 807 Seelen, sind ausschließlich Hirten und zerfallen in fünf Kasten, die nicht untereinander heiraten. Die Frau wird gekauft und gehört den Brüdern einer Familie gemeinschaftlich. Man unterscheidet ein »grünes« und ein »dürres« Begräbnis. Bei dem erstern wird der Tote verbrannt und die Asche gesammelt, bei dem zweiten, zwölf Monate später, wurden früher so viele Büffel geschlachtet, daß die englische Regierung die Verschwendung beschränkte. Dem Priester (Palal, »Milchmann«) des Dorfes liegt die Pflege und das Melken der Kühe ob und die Sorge für eine heilige Herde. Man glaubt an böse Geister und verehrt eine heilige Büffelschale, unter der man sich den höchsten Gott Hiriadeva vorstellt. Vgl. Metz, Die Volksstämme der Nilagiris (Basel 1857); Marshall, A phrenologist amongst the Todas (Lond. 1873); Rivers, The Todas (das. 1906). | Quelle: Meyers Großes Konversations-Lexikon, Band 19. Leipzig 1909, S. 586. | Permalink: http://www.zeno.org/nid/20007589921

Toda
type: Label
in scheme: travel!digital Thesaurus

Mongole
type: Concept
definition: Duden: Einwohner der Mongolei | [Anm.: unvollständig: Einwohnerbezeichnung zu Mongolei / Mongolisches Reich ] | Duden: Mongolei: Hochland und Staat in Zentralasien | Meyers Großes Konversations-Lexikon 1908: Mongolen, im weitesten Sinne die große Völkergruppe, die alle mongolenähnlichen Völker, also die polynesischen und asiatischen Malaien, die Völker Südost- und Ostasiens, die Bewohner Tibets, etliche Bergvölker des Himalaja, alle Nordasiaten samt ihren Verwandten in Nordeuropa, endlich die amerikanische Urbevölkerung, einschließt. Als allen gemeinsame Körpermerkmale sind zu bezeichnen das lange, straffe Haar, Armut oder gänzlicher Mangel an Bartwuchs wie an Leibhaaren, ledergelbe bis tiefbraune, bisweilen ins Rötliche spielende Hautfarbe, vorstehende Jochbogen, begleitet meist von einer schiefen Stellung der Augen. Zur eigentlichen mongolischen Rasse werden jene Völker gerechnet, die das östliche, mittlere und nördliche Asien, mit Ausnahme der im letztern Teil von Hyperboreern eingenommenen Striche und noch einen ansehnlichen Teil des nördlichen Europa bewohnen. Stammland ist Mittelasien. Nach der Sprache kann man diese Völker in solche mit mehrsilbigen und mit einsilbigen Sprachen teilen. Zur erstern Gruppe gehören die Uralier, Altaier, Japaner und Koreaner, zur zweiten die Tibeter und Himalajavölker, die Birmanen und Lohitavölker, die Tai- oder Schanvölker, die Anamiten, Chinesen und die isolierten Völker Hinterindiens. Mehrere dieser Völker spalten sich wieder in verschiedene Zweige, der uralische Volksstamm in den samojedischen und finnischen Zweig, von denen der letztere wieder in die ugrische, die bulgarische oder Wolga-, die permische und die finnische Familie zerfällt. Der altaische Volksstamm hat drei Zweige: den tungusischen (Tungusen und Mandschu), den eigentlichen mongolischen und den türkischen. Die noch zu dieser Gruppe gehörigen Japaner und Koreaner bilden einheitliche, in sich geschlossene Völkerfamilien. Der eigentliche mongolische Zweig zerfällt…
related match: Mongol Empire
pref label: Mongole
in scheme: travel!digital Thesaurus

Mongole
type: Label
in scheme: travel!digital Thesaurus

Tlinkit
type: Concept
in scheme: travel!digital Thesaurus
related: Indianer
pref label: Tlinkit
definition: Meyers Großes Konversations-Lexikon 1909: Tlinkit (Thlinkit, auch Koloschen oder Koljuschen genannt), nordamerikan. Indianervolk mit eigner Sprache, bewohnt das südöstliche Alaska vom 55.–60.° nördl. Br. und zerfällt in mehrere Stämme, unter denen die Sitka oder Schitka und die Tschilkat die bekanntesten sind. Die T. sind kräftig und wohlgebaut (s. Tafel »Amerikanische Völker I«, Fig. 2), von heller Gesichtsfarbe, gelehrig, leben von Jagd und Fischfang und treiben lebhaften Handel. Die Häuptlingswürde ist an den Besitz von Vermögen geknüpft; ehemals galten Sklaven als wertvollster Besitz. Sehr entwickelt ist das Geschlechtersystem mit weiblicher Erbfolge. Ihre Dörfer liegen meist hart am Meeresstrand und bestehen aus festen Holzhäusern, die bisweilen mit kunstvollen Schnitzereien und Wappenpfählen versehen sind. Die T. sind geschickt im Bau großer Kanus, in der Anfertigung geschnitzter Geräte aus Holz, Horn oder Stein, in der Bearbeitung von Silber und Kupfer (vgl. die Tafeln »Indianische Kultur III«, Fig. 19; »Geräte der Naturvölker I«, Fig. 14; II, Fig. 26,39 u. 43; »Wohnungen der Naturvölker II«, Fig. 17). Sie haben eine reiche Mythologie; Jelch, der Rabe, bringt den Menschen das Feuer und befreit Sonne, Mond und Sterne aus ihrem Gefängnis. Großen Einfluß besitzen die Schamanen, welche die religiösen Übungen leiten, Krankheiten beschwören und gutes Wetter machen. – Mit den Russen führten die T. blutige Kämpfe; in den letzten Jahren hat die Zivilisation unter ihnen große Fortschritte gemacht, und die alten Gebräuche, wie die Verbrennung der Toten und der Lippenpflock der Weiber, sind im Verschwinden. Nach dem Zensus von 1890 lebten in Alaska 5432 T. Vgl. Krause, Die Tlinkitindianer (Jena 1885); Niblack, The Coast Indians of Southern Alaska (Washingt. 1890). | Quelle: Meyers Großes Konversations-Lexikon, Band 19. Leipzig 1909, S. 581. | Permalink: http://www.zeno.org/nid/20007589352
alternative label: Tlinkiten-Stamm
alt label: Tlinkiten-Stamm

Tlinkit
type: Label
in scheme: travel!digital Thesaurus

Tlinkiten-Stamm
type: Label
in scheme: travel!digital Thesaurus

Issaschar
type: Concept
pref label: Issaschar
in scheme: travel!digital Thesaurus
definition: Meyers Großes Konversations-Lexikon 1907: Isăschar (Issachar), fünfter Sohn Jakobs mit der Lea, Ahnherr des nach ihm benannten Stammes, dessen Gebiet vom See Tiberias und dem Berg Tabor bis zum Tal Jesreel, das noch dazu gehörte, reichte und gegen O. an den Jordan grenzte. Wenn auch der Stamm I. seine günstige Lage geschäftlich ausnutzte (1. Mos. 49,14 f.), Landbau und Viehzucht erfolgreich betrieb, so fehlte es ihm doch nicht an patriotischem und religiösem Gemeinsinn, den er wiederholt bewährte, so in dem Freiheitskampf unter Deborah (s. d.), bei der Erhebung Davids zum König über Gesamtisrael und bei der Passahfeier unter Hiskia. | Quelle: Meyers Großes Konversations-Lexikon, Band 10. Leipzig 1907, S. 41. | Permalink: http://www.zeno.org/nid/20006829260

Issaschar
type: Label
in scheme: travel!digital Thesaurus

türkisch
type: Concept
alt label: spättürkisch
pref label: türkisch
related: Türkin
narrower: türkisch-arabisch
preferred label: turco @it
in scheme: travel!digital Thesaurus
narrower: arabisch-türkisch
narrower: tatarisch-türkisch
preferred label: túrki @ar
alternative label: spättürkisch
narrower: maurisch-türkisch
narrower: türkisch-finnisch
alternative label: alttürkisch
narrower: türkisch-griechisch
narrower: türkisch-russisch
narrower: türkisch-persisch
pref label: turco
alt label: alttürkisch
related: Türke
narrower: russisch-türkisch
narrower: venezianisch-türkisch
definition: Duden: 1. die Türkei, die Türken betreffend; von den Türken stammend, zu ihnen gehörend | [Anm.: unvollständig: die Türkei, die Türken betreffend; von den Türken stammend, zu ihnen gehörend; in der Türkei gelegen] | Duden: Türkei: Staat in Vorderasien und Südosteuropa
pref label: túrki

spättürkisch
type: Label
in scheme: travel!digital Thesaurus

türkisch
type: Label
hasTranslation: turco
in scheme: travel!digital Thesaurus
hasTranslation: túrki

turco
type: Label
isTranslationOf: türkisch
in scheme: travel!digital Thesaurus
hasTranslation: túrki

túrki
type: Label
in scheme: travel!digital Thesaurus
isTranslationOf: türkisch
hasTranslation: turco

Türkin
type: Concept
related: Türke
pref label: Türkin
definition: Duden: weibliche Form zu Türke (1)
in scheme: travel!digital Thesaurus

Türkin
type: Label
in scheme: travel!digital Thesaurus

türkisch-arabisch
type: Concept
definition: bdk: siehe türkisch, arabisch
in scheme: travel!digital Thesaurus
pref label: türkisch-arabisch

türkisch-arabisch
type: Label
in scheme: travel!digital Thesaurus

arabisch-türkisch
type: Concept
definition: bdk: siehe arabisch, türkisch
in scheme: travel!digital Thesaurus
pref label: arabisch-türkisch

arabisch-türkisch
type: Label
in scheme: travel!digital Thesaurus

tatarisch-türkisch
type: Concept
related: Tatar
in scheme: travel!digital Thesaurus
pref label: tatarisch-türkisch
definition: bdk: siehe Tatar, türkisch

Tatar
type: Concept
definition: Duden: Angehöriger eines Volks in Südrussland, der Ukraine und Westsibirien | Meyers Großes Konversations-Lexikon 1909: Tatāren, ursprünglich Name eines mongol. Volksstammes, der aber nach Ausrichtung des asiatischen Großreichs durch Dschengis-Chan auf alle Mongolen und die unterworfenen verwandten Völker übertragen wurde. Heute nennt man T. einen Zweig des uralaltaischen Volksstammes vom Mittelländischen und Schwarzen Meere bis an die Lena in Sibirien, der die Jakuten, Buruten oder schwarzen (Kara-) Kirgisen im chinesischen Turkistan, die Kirgisen oder Kasak, die Uzbeken, Kiptschak, Turkmenen, Karakalpaken, Nogaier oder Karatataren, Tarantschen und Dunganen und die T. im engern Sinn umfaßt. Die letztern, sämtlich Mohammedaner, werden als ansässige und nomadisierende T. unterschieden. Im europäischen Rußland wohnen etwa 1,200,000. Die Kasanschen T. (etwa 450,000) haben durch Vermischung mit Finnen und Russen ihren mongolischen Typus mehrfach eingebüßt; sie sind nüchtern, gastfrei, arbeitsam und sehr begabt, können alle lesen und schreiben und ernähren sich vorzugsweise durch den Handel. Die Krimschen T. (250,000) werden in Steppen- und Bergtataren[338] geteilt. Die erstern, von recht reinem mongolischen Typus, beschäftigen sich vorzugsweise mit Viehzucht (namentlich Schafe), die letztern mit Obst- und Gartenbau. Die tatarischen Stämme in Kaukasien, zusammen (1905) 1,879,908 Seelen, zerfallen in Aserbeidschan-Tataren, Kumüken, Türken, Nogaier, Karatschaier, Turkmenen, Bergkabardiner, Karapapachen. Zu den Sibirischen T. (1905: 476,139) gehören die Tureliner, bei denen man die eigentlichen T. und die nach den von ihnen bewohnten Gegenden benannten Taraischen, Tobolskischen, Tjumenschen und Tomskischen T. unterscheidet. Teils leben sie in Städten, teils treiben sie Ackerbau, Viehzucht und Jagd. Auch gehören zu ihnen die Barabiner in der Steppe Baraba zwischen Ob und Irtisch (fast ausschließlich Viehzüchter und Fischer), die schon sehr russifizierten Tschulymschen T., am…
in scheme: travel!digital Thesaurus
pref label: Tatar

Tatar
type: Label
in scheme: travel!digital Thesaurus

tatarisch-türkisch
type: Label
in scheme: travel!digital Thesaurus

maurisch-türkisch
type: Concept
definition: bdk: siehe maurisch, türkisch
in scheme: travel!digital Thesaurus
pref label: maurisch-türkisch

maurisch-türkisch
type: Label
in scheme: travel!digital Thesaurus

türkisch-finnisch
type: Concept
definition: bdk: siehe türkisch-finnisch
pref label: türkisch-finnisch
in scheme: travel!digital Thesaurus

türkisch-finnisch
type: Label
in scheme: travel!digital Thesaurus

türkisch-griechisch
type: Concept
in scheme: travel!digital Thesaurus
definition: bdk: siehe türkisch, griechisch
pref label: türkisch-griechisch

türkisch-griechisch
type: Label
in scheme: travel!digital Thesaurus

türkisch-russisch
type: Concept
definition: bdk: siehe türkisch, russisch
in scheme: travel!digital Thesaurus
pref label: türkisch-russisch

türkisch-russisch
type: Label
in scheme: travel!digital Thesaurus

türkisch-persisch
type: Concept
in scheme: travel!digital Thesaurus
definition: bdk: siehe türkisch, persisch
pref label: türkisch-persisch

türkisch-persisch
type: Label
in scheme: travel!digital Thesaurus

alttürkisch
type: Label
in scheme: travel!digital Thesaurus

russisch-türkisch
type: Concept
related: türkisch-russisch
pref label: russisch-türkisch
in scheme: travel!digital Thesaurus
definition: bdk: siehe russisch, türkisch

russisch-türkisch
type: Label
in scheme: travel!digital Thesaurus

venezianisch-türkisch
type: Concept
in scheme: travel!digital Thesaurus
definition: bdk: siehe venezianisch, türkisch
pref label: venezianisch-türkisch

venezianisch-türkisch
type: Label
in scheme: travel!digital Thesaurus

Ascher
type: Concept
pref label: Ascher
in scheme: travel!digital Thesaurus
definition: Meyers Großes Konversations-Lexikon 1905: Ascher (Asser, hebr., »der Glückliche«), Sohn Jakobs von Silpa, Stammvater eines der zwölf israelitischen Stämme. Dieser erhielt bei der Verteilung Kanaans einen schmalen Landstrich längs der Nordküste vom Karmel bis Sidon. | Quelle: Meyers Großes Konversations-Lexikon, Band 1. Leipzig 1905, S. 847. | Permalink: http://www.zeno.org/nid/2000625733X

Ascher
type: Label
in scheme: travel!digital Thesaurus

Telugu
type: Concept
definition: Meyers Großes Konversations-Lexikon 1909: Telinga, ein zu den Drawida (s. d.) gehöriger Volksstamm in Ostindien, in dem Küstenland zwischen Orissa (Bengalen) und Madras, den Tamulen ähnlich. Seine Sprache, das Telugu (s. d.), von ältern Reisenden auch Gentoo (»Heidensprache«), auch Andhra genannt, wird von (1901) 20,696,872 Menschen, vornehmlich in der Präsidentschaft Madras, dann in Haidarabad, Maissur u. a. gesprochen. | Quelle: Meyers Großes Konversations-Lexikon, Band 19. Leipzig 1909, S. 396. | Permalink: http://www.zeno.org/nid/20007570570
related match: Telangana
related match: Telugu language
related: dravidisch
pref label: Telugu
in scheme: travel!digital Thesaurus

dravidisch
type: Concept
pref label: dravidisch
narrower: mongolisch-dravidisch
alternative label: frühdravidisch
in scheme: travel!digital Thesaurus
definition: Duden: drawidisch: zu der Völkergruppe der Drawida in Mittel- und Südindien gehörend | [Anm.: unvollständig: die Drawida betreffend; von den Drawida stammend, zu ihnen gehörend]
alt label: frühdravidisch
related: Drávida

dravidisch
type: Label
in scheme: travel!digital Thesaurus

mongolisch-dravidisch
type: Concept
in scheme: travel!digital Thesaurus
definition: bdk: siehe mongolisch, dravidisch
pref label: mongolisch-dravidisch

mongolisch-dravidisch
type: Label
in scheme: travel!digital Thesaurus

frühdravidisch
type: Label
in scheme: travel!digital Thesaurus

Drávida
type: Concept
in scheme: travel!digital Thesaurus
definition: Duden: Drawida: Angehöriger einer Völkergruppe in Vorderindien | Meyers Großes Konversations-Lexikon 1906: Drawida (Dravida), nach einem Sanskritausdruck in die Wissenschaft übergegangene Bezeichnung für eine in Belutschistan (Brahui), Nord- und Südindien und Ceylon wohnende Völkerrasse, die ethnologisch in drei grundverschiedene Stämme zerfällt: den Munda- oder Windhyastamm, den Drawidastamm im engern Sinn und die Singhalesen. Zu erstern gehören unkultivierte Gebirgsstämme des Hochlandes von Tschota Nagpur, südwestlich von Kalkutta, die Kolh, Santal, Bhilla und zahlreiche kleinere, die meist noch ihre eigne Sprache sprechen. Der eigentliche Drawidastamm zerfällt in zehn sprachlich geschiedene Abteilungen. Die Urbevölkerung von Ceylon, deren ziemlich unvermischte Überreste die Vedda sind, gehört entschieden zu den D. Am reinsten erscheint der Typus bei dem Hirtenstamm der Toda in den Nilgiri, großen, muskulösen Gestalten mit Römernasen, schönen Augen und üppigem, schwarzem, gelocktem Haar. Andre Stämme sind weit weniger gut gebildet, die Wedda klein, die Gond und Kolh haben dicke Lippen, alle sind von dunkler, oft beinahe schwarzer Hautfarbe. Ein allen gemeinsamer Zug ist die freie Stellung des Weibes; die alten Sitten sind nur bei den kulturlosen Stämmen (Munda und in den Nilgiri) erhalten. Die Sprachen der drei großen Abteilungen zeigen keine genealogische Verwandtschaft miteinander. Die der D. im engern Sinne haben zwar im Wortschatz vieles aus dem Sanskrit entlehnt, aber ihr grammatischer Bau ist durchaus eigenartig. Fünf von ihnen sind Schriftsprachen mit besondern, aber durchweg aus der Sanskritschrift abgeleiteten Alpha beten und einer mehr oder weniger alten Literatur, die freilich meist aus Übertragungen aus dem Sanskrit besteht, nämlich: Telugu oder Telinga (1881: 17,000,358 Menschen) in den Zirkars und an der Koromandelküste bis etwa Madras und im Innern in Haidarabad und einem Teil von Maissur; westlich davon, in Kanara und dem größten Teil von Maissur b…
pref label: Drávida

Drávida
type: Label
in scheme: travel!digital Thesaurus

Telugu
type: Label
in scheme: travel!digital Thesaurus

Kastilier
type: Concept
alternative label: Altkastilier
alt label: Altkastilier
pref label: Kastilier
definition: bdk: Einwohnerbezeichnung zu Kastilien | Duden: Kastilien: historisches Reich in Spanien | Meyers Großes Konversations-Lexikon 1907: Kastilĭen (span. Castilla), ein Teil Zentralspaniens, der durch eine Gebirgskette (s. Kastilisches Scheidegebirge) in die ehemaligen Provinzen oder Königreiche Altkastilien (nördlicher Teil) und Neukastilien (südlicher Teil) geschieden wird. Altkastilien (Castilla la vieja) umfaßt die größere Hälfte des nördlichen Tafellandes, die nördliche Hälfte des Iberischen und die westliche Hälfte des Kantabrischen Gebirges samt dem entsprechenden Teil der Nordküste, grenzt gegen N. an das Atlantische (Kantabrische) Meer, gegen O. und NO. an Vizcaya, Alava, Navarra und Aragonien, gegen S. an Neukastilien und Estremadura, gegen W. an Leon und Asturien und zerfällt in die acht Provinzen: Palencia, Valladolid, Avila, Segovia, Soria, Burgos, Logroño und Santander (s. diese Artikel). Der Flächeninhalt beträgt 65,727 qkm (1193,7 QM.). Die Bevölkerung zählt (1900) 1,785,403 Einw. Es ist ein kräftiger Menschenschlag, die Männer hager, aber muskulös, von mittlerer Größe, die Frauen meist voll und schlank, von großer Lebhaftigkeit und mit viel natürlicher Grazie begabt. Die hervorspringenden Züge des kastilischen Charakters sind Stolz, Ehrenhaftigkeit, Aufrichtigkeit, Genügsamkeit und starres Festhalten am Alten. Mit diesen Zügen verbindet sich ein ernstes, gemessenes, förmliches und schweigsames Wesen. Die Landbevölkerung lebt teilweise sehr zerstreut in Caserios und Weilern, besonders in den nördlichen und östlichen Provinzen. | Neukastilien (Castilla la nueva) grenzt gegen N. an Altkastilien, im O. an Aragonien und Valencia, gegen S. an Murcia und Andalusien, gegen W. an Estremadura und umfaßt den bei weitem größten Teil des südlichen Tafellandes. Es zerfällt in die fünf Provinzen: Madrid, Toledo, Guadalajara, Ciudad Real und Cuenca und hat Madrid zur Hauptstadt. Das Areal beträgt 72,160 qkm (1310,6 QM.). Die Bevölkerung zählt (1900) 1,923,3 10 Einw. Di…
related match: Castile (historical region)
in scheme: travel!digital Thesaurus

Altkastilier
type: Label
in scheme: travel!digital Thesaurus

Kastilier
type: Label
in scheme: travel!digital Thesaurus

serbisch
type: Concept
narrower: serbisch-orientalisch
narrower: serbisch-bulgarisch
related: Serbe
definition: Duden: Serbien, die Serben betreffend; von den Serben stammend, zu ihnen gehörend | [Anm.: unvollständig: Serbien, die Serben betreffend; von den Serben stammend, zu ihnen gehörend; in Serbien gelegen]
in scheme: travel!digital Thesaurus
pref label: serbisch

serbisch-orientalisch
type: Concept
pref label: serbisch-orientalisch
definition: bdk: siehe serbisch, orientalisch
in scheme: travel!digital Thesaurus

serbisch-orientalisch
type: Label
in scheme: travel!digital Thesaurus

serbisch-bulgarisch
type: Concept
pref label: serbisch-bulgarisch
in scheme: travel!digital Thesaurus
definition: bdk: siehe serbisch, bulgarisch

serbisch-bulgarisch
type: Label
in scheme: travel!digital Thesaurus

Serbe
type: Concept
definition: Duden: Angehöriger eines südslawischen Volkes | Duden: Serbien: Staat in Südosteuropa | Meyers Großes Konversations-Lexikon 1908: Serbĭen (türk. Sirp, slaw. Srbija), Königreich, zwischen 42°22'–44°58' nördl. Br. und 19°10' bis 22°49' östl. L., grenzt im N. an Österreich-Ungarn (durch die untere Donau und die Save davon getrennt), im O. an Rumänien und Bulgarien, im Süden an Bulgarien und die Türkei, im W. an das Wilajet Kosovo und an Bosnien. (S. Karte »Rumänien, Bulgarien, Serbien etc.«, für den westlichen Teil auch die Karte »Bosnien«.) [...] | [Areal und Bevölkerung.]Das Areal beträgt nach neuester Berechnung 48,303 qkm (877,2 QM.), und die Bevölkerung belief sich 1905 auf 2,688,747 Seelen (56 auf 1 qkm), die sich auf die einzelnen Kreise wie folgt verteilen: | Die Bevölkerung bestand 1903 größtenteils aus Serben (2,298,551), daneben aus 89,873 Rumänen, 46,148 Zigeunern, 7494 Deutschen, 5729 Juden. Nach dem Geschlecht waren 1906: männlich 1,408,757, weiblich 1,327,112. Die Bevölkerung zählte 1900: 2,493,770, 1891: 2,161,961. Die Lebensweise der Dorfbevölkerung ist eine althergebracht patriarchalische, doch bahnt sich auch hier die von W. eindringende Kultur immer breitere Wege, und das nicht immer zum Wohl der Nation (Weiteres s. Serben). Entsprechend dem bäuerlichen Charakter der Bevölkerung leben die Serben meist in Dörfern, und es gibt nur wenige größere Städte, die vornehmlich durch den Verkehr bedingt sind und meist im Donau- und Morawatal liegen. Auch die meisten der 24 Städte und 58 Städtchen machen einen ländlichen Eindruck. Über 10,000 Einwohner zählen: Belgrad, Niš, Kragujevac, Leskovac, Šabac, Pošarewac, Vranja und Pirot. Der Religion nach sind die Serben griechisch-orthodox[356] und bilden eine eigne Nationalkirche (s. Serbische Kirche). Die Zahl der zu andern Konfessionen sich Bekennenden, denen freie Ausübung ihrer Religion gestattet ist, ist verschwindend klein. Die Beziehungen zum Patriarchen von Konstantinopel sind durch das Konkordat vom Januar …
related match: Serbia
pref label: Serbe
in scheme: travel!digital Thesaurus

Serbe
type: Label
in scheme: travel!digital Thesaurus

serbisch
type: Label
in scheme: travel!digital Thesaurus

österreichisch
type: Concept
pref label: austriaco
related: Österreicher
definition: Duden: Österreich, die Österreicher betreffend; von den Österreichern stammend, zu ihnen gehörend | [Anm.: unvollständig: Österreich, die Österreicher betreffend; von den Österreichern stammend, zu ihnen gehörend; in Österreich gelegen]
pref label: autrichien
preferred label: autrichien @fr
narrower: österreichisch-ungarisch
preferred label: austriaco @it
preferred label: nemsâwi @ar
in scheme: travel!digital Thesaurus
preferred label: austrian @en
pref label: österreichisch
pref label: austrian
pref label: nemsâwi

austriaco
type: Label
isTranslationOf: österreichisch
hasTranslation: austrian
in scheme: travel!digital Thesaurus
hasTranslation: autrichien
hasTranslation: nemsâwi

österreichisch
type: Label
hasTranslation: austrian
hasTranslation: austriaco
in scheme: travel!digital Thesaurus
hasTranslation: autrichien
hasTranslation: nemsâwi

austrian
type: Label
isTranslationOf: österreichisch
hasTranslation: austriaco
in scheme: travel!digital Thesaurus
hasTranslation: autrichien
hasTranslation: nemsâwi

autrichien
type: Label
isTranslationOf: österreichisch
hasTranslation: austriaco
in scheme: travel!digital Thesaurus
hasTranslation: austrian
hasTranslation: nemsâwi

nemsâwi
type: Label
in scheme: travel!digital Thesaurus
isTranslationOf: österreichisch
hasTranslation: austrian
hasTranslation: autrichien
hasTranslation: austriaco

Österreicher
type: Concept
narrower: Deutsch-Österreicher
definition: Duden: Einwohnerbezeichnung | [Anm.: unvollständig: Einwohnerbezeichnung zu Österreich] | Duden: Österreich: Staat im südlichen Mitteleuropa | siehe auch: Meyers Großes Konversations-Lexikon 1908: Österreich | Quelle: Meyers Großes Konversations-Lexikon, Band 15. Leipzig 1908, S. 174-209. | Permalink: http://www.zeno.org/nid/20007196210
related match: Austria
in scheme: travel!digital Thesaurus
pref label: Österreicher

Deutsch-Österreicher
type: Concept
pref label: Deutsch-Österreicher
in scheme: travel!digital Thesaurus
definition: bdk: Österreicher mit deutscher Muttersprache

Deutsch-Österreicher
type: Label
in scheme: travel!digital Thesaurus

Österreicher
type: Label
in scheme: travel!digital Thesaurus

österreichisch-ungarisch
type: Concept
definition: Duden: Österreich-Ungarn betreffend | Duden: Österreich-Ungarn: ehemalige Doppelmonarchie | siehe auch: Meyers Großes Konversations-Lexikon 1908: Österreichisch-Ungarische Monarchie | Quelle: Meyers Großes Konversations-Lexikon, Band 15. Leipzig 1908, S. 210-214. | Permalink: http://www.zeno.org/nid/20007196369
related match: Austria-Hungary
related: ungarisch
in scheme: travel!digital Thesaurus
pref label: österreichisch-ungarisch

ungarisch
type: Concept
pref label: ungarisch
preferred label: ungureasca @ro
narrower: ungarisch-kroatisch
in scheme: travel!digital Thesaurus
pref label: magyar
related: Ungar
narrower: niederungarisch
pref label: ungureasca
definition: Duden: 1. Ungarn, die Ungarn betreffend; von den Ungarn stammend, zu ihnen gehörend | [Anm.: unvollständig: Ungarn, die Ungarn betreffend; von den Ungarn stammend, zu ihnen gehörend; in Ungarn gelegen]
preferred label: magyar @hu

ungarisch
type: Label
hasTranslation: magyar
hasTranslation: ungureasca
in scheme: travel!digital Thesaurus

magyar
type: Label
isTranslationOf: ungarisch
hasTranslation: ungureasca
in scheme: travel!digital Thesaurus

ungureasca
type: Label
isTranslationOf: ungarisch
hasTranslation: magyar
in scheme: travel!digital Thesaurus

ungarisch-kroatisch
type: Concept
in scheme: travel!digital Thesaurus
definition: bdk: siehe ungarisch, kroatisch
pref label: ungarisch-kroatisch

ungarisch-kroatisch
type: Label
in scheme: travel!digital Thesaurus

Ungar
type: Concept
related match: Hungary
pref label: Ungar
in scheme: travel!digital Thesaurus
definition: Duden: Einwohnerbezeichnung zu Ungarn | Duden: Ungarn: Staat im südöstlichen Mitteleuropa | siehe auch: Meyers Großes Konversations-Lexikon 1909: Ungarn | Quelle: Meyers Großes Konversations-Lexikon, Band 19. Leipzig 1909, S. 900-915. | Permalink: http://www.zeno.org/nid/20007625332

Ungar
type: Label
in scheme: travel!digital Thesaurus

niederungarisch
type: Concept
pref label: niederungarisch
in scheme: travel!digital Thesaurus
definition: bdk: siehe ungarisch

niederungarisch
type: Label
in scheme: travel!digital Thesaurus

österreichisch-ungarisch
type: Label
in scheme: travel!digital Thesaurus

Mehadlastamm
type: Concept
definition: bdk: Stammesgemeinschaft in Tunesien
pref label: Mehadlastamm
in scheme: travel!digital Thesaurus
related: Stamm

Mehadlastamm
type: Label
in scheme: travel!digital Thesaurus

Stamm
type: Concept
narrower: Wanderstamm
narrower: Grenzstamm
preferred label: kebila @ar
narrower: Nomadenstamm
pref label: kebila
alt label: Stammesgemeinschaft
narrower: Beduinenstamm
narrower: Hirtenstamm
alt label: Volksstamm
narrower: Hauptstamm
definition: Duden: 2. (besonders bei Naturvölkern) größere Gruppe von Menschen, die sich besonders im Hinblick auf Sprache, Kultur, wirtschaftliche o. ä. Gemeinsamkeiten, gemeinsames Siedlungsgebiet o. Ä. von anderen Gruppen unterscheidet | Pierer's Universal-Lexikon 1863: Stamm, 1) der holzige Oberstocktheil zwischen den Ästen u. den Wurzeln; bei Bäumen, welche sich nicht in mehre, gleich starke Äste theilen, wird auch noch der mittlere, starke Theil zum S-e gerechnet, um welchen die Äste herumsitzen, so bes. beim Schwarzholze; 2) ein Baum, insofern der eigentliche S. zu Bauholz benutzt wird; 3) in den Baumschulen die Bäumchen; 4) das, woraus ein od. mehre Dinge einer Art entspringen; 5) von Gefäßen, auch Nerven, jedes od. jeder größte derselben Art, in Bezug auf welche die kleineren, die daraus hervorgehen, od. durch deren Zusammentritt jene gebildet werden, als Äste erscheinen; 6) der Theil des Wortes, welcher nach Abschneidung aller Bildungs- u. Biegungssylben übrig bleibt; 7) alle zusammen, welche einen gemeinschaftlichen Stammvater haben, u. man nennt Stammeltern das Elternpaar, von welchem einzelne Menschen od. ganze Geschlechter ihre Abkunft in ununterbrochener Reihe herleiten können. Über die Stammeltern des Menschengeschlechts (Adam u. Eva), s.u. Menschenracen. Die Eintheilung nach Familien u. Stämmen war in den ältesten Zeiten im Morgenlande u. ist jetzt noch dort vorherrschend. Als solche Stämme nennt die Bibel die Ismaeliten, Edomiten u.a., u. bei den Hebräern war diese Eintheilung des Volks ebenfalls. Anfangs in Familien getheilt u. nach dem Namen des Familienstifters (Söhne Jakobs) genannt, wurden daraus, wenn sie zahlreicher wurden, Stämme, an deren Spitze ein Stammfürst stand, neben ihm die Ältesten. Diese Verfassung hatten die Israeliten schon in Ägypten, Moses ließ sie fortbestehen; in der Richterperiode, wo jeder S. sein Stück Land hatte, war ihre Verbindung sehr locker u. sie führten oft Fehden unter einander. Die Stammverfassung dauerte auch nach Einführun…
narrower: Saharastamm
alternative label: Völkerstamm
alternative label: Stammesgemeinschaft
alternative label: Nachbarstamm
alternative label: Volksstamm
alt label: Völkerstamm
alt label: Nachbarstamm
narrower: Jägerstamm
preferred label: tribe @en
pref label: tribe
narrower: Priesterstamm
in scheme: travel!digital Thesaurus
pref label: Stamm
narrower: Urstamm
narrower: Indianerstamm

Wanderstamm
type: Concept
related: Nomade
pref label: Wanderstamm
in scheme: travel!digital Thesaurus
definition: bdk: siehe Stamm, Nomade

Nomade
type: Concept
in scheme: travel!digital Thesaurus
definition: Duden: Angehöriger eines [Hirten]volkes, das innerhalb eines begrenzten Gebietes umherzieht | Meyers Großes Konversations-Lexikon 1908: Nomāden (griech., Hirtenvölker), Völkerschaften, die hauptsächlich Viehzucht treiben und der Ernährung ihrer Herden wegen von einem Ort zum andern ziehen. Kulturlich stehen die N. bedeutend höher als die ältern Jäger- und Fischervölker; ob aber die Viehzucht älter ist als der Ackerbau, läßt sich nicht bestimmt sagen. Auch gibt es ackerbauende N. In die angrenzenden Kulturländer sind N. wiederholt hereingebrochen und haben sie unterworfen, so die Mongolen, jetzt die Mandschu in China, türkische Stämme in Persien. Die Hyksos herrschten jahrhundertelang über Ägypten, die viehzüchtenden Fulbe gebieten noch heute über die gewerbfleißigen Haussa. Die meisten N. gibt es noch in Zentralasien; in Nordsibirien, Südafrika, Süd- und Nordamerika finden sich die Gewohnheiten der N. vereinigt mit denen der Jägervölker. Vgl. Waitz, Anthropologie der Naturvölker, Bd. 1 (2. Aufl., Leipz. 1877); Grigorjew, Die N. als Nachbarn und Eroberer zivilisierter Staaten (Peters b. 1875). | Quelle: Meyers Großes Konversations-Lexikon, Band 14. Leipzig 1908, S. 731. | Permalink: http://www.zeno.org/nid/20007160070
alt label: Nomadentum
alternative label: Nomadentum
related: Hirte
pref label: Nomade
narrower: Halbnomade
narrower: Saharanomaden

Nomadentum
type: Label
in scheme: travel!digital Thesaurus

Hirte
type: Concept
definition: Duden: jemand, der eine Herde hütet
alt label: Scenit
alt label: Hirt
narrower: Hirtenjunge
in scheme: travel!digital Thesaurus
pref label: Hirte
alternative label: Hirt
alternative label: Scenit

Scenit
type: Label
in scheme: travel!digital Thesaurus

Hirt
type: Label
in scheme: travel!digital Thesaurus
isVariantOf: Hirte

Hirte
type: Label
in scheme: travel!digital Thesaurus
hasVariant: Hirt

Hirtenjunge
type: Concept
pref label: Hirtenjunge
in scheme: travel!digital Thesaurus
definition: bdk: siehe Hirte

Hirtenjunge
type: Label
in scheme: travel!digital Thesaurus

Nomade
type: Label
in scheme: travel!digital Thesaurus

Halbnomade
type: Concept
pref label: Halbnomade
in scheme: travel!digital Thesaurus
definition: bdk: siehe Nomade

Halbnomade
type: Label
in scheme: travel!digital Thesaurus

Saharanomaden
type: Concept
definition: bdk: siehe Nomade | Duden: Sahara: Wüste in Nordafrika | Meyers Großes Konversations-Lexikon 1909: Sáhara (arab. Sáh râ), große nordafrikanische Wüste, erstreckt sich als westlichster Teil des großen, über Arabien und Iran mit Unterbrechungen bis nach Innerasien sich hinziehenden Wüstengürtels vom Atlantischen Ozean im W. bis zum Roten Meer im O. und umfaßt große Gebiete von Marokko, Algerien und Tunis, ferner Fezzan, den größten Teil von Tripolis, Barka, Ägypten und Nubien. Ihr Areal ist berechnet auf 9,159,495 qkm, d.h. fast so groß wie Europa (9,7 Mill.). S. die Karte »Fluß- und Gebirgssysteme von Afrika« (im 1. Bd.). | [Bodenbeschaffenheit.] Die S. ist nicht einförmig, wie früher angenommen wurde, sondern ein landschaftlich sehr mannigfaltiges Hochland (bis 600 m hoch): Hochgebirge mit Gipfeln bis 2500 m wechseln mit steinigen Hochebenen, Dünenregionen, Becken mit Lehmboden und salzigen Seen und Sümpfen sowie mit fruchtbaren Oasengebieten. Über den geologischen Bau des nordafrikanischen Wüstenplateaus vgl. Afrika (Geognostische Beschaffenheit). Zur allgemeinen Orientierung sei folgendes bemerkt. Das aus steil ausgerichteten und gefalteten kristallinischen Schiefern bestehende Grundgebirge, das in den Gebirgen von Aïr (Asben), Ahaggar und Tibesti zutage tritt, wird überlagert von mächtigen horizontalen paläozoischen Schichtenreihen und beides von ebenfalls horizontaler mittlerer Kreide. Seit den ältesten Zeiten hat keine Faltung in der S. stattgefunden, sondern Graben- und Kesselbrüche haben die Höhenunterschiede hervorgebracht. Dagegen fehlen Sedimente aus der Perm-, Trias- und Jurazeit. Die Zone der paläozoischen Ablagerungen wird von W. nach O. schmaler, die der Kreidesedimente nimmt im umgekehrten Sinne zu. In der Tertiärzeit fand vulkanische Tätigkeit statt, während dem Quartär die ausgedehnten Dünenbildungen wie die Alluvionen im Nildelta angehören. Was Einzelheiten betrifft, so erreichen die kristallinischen Schiefer (Gneis, Glimmerschiefer, Quarzit) in Ve…
pref label: Saharanomaden
in scheme: travel!digital Thesaurus
related match: Sahara

Saharanomaden
type: Label
in scheme: travel!digital Thesaurus

Wanderstamm
type: Label
in scheme: travel!digital Thesaurus

Grenzstamm
type: Concept
definition: bdk: im Grenzgebiet lebende Stammesgemeinschaft
in scheme: travel!digital Thesaurus
pref label: Grenzstamm

Grenzstamm
type: Label
in scheme: travel!digital Thesaurus

Nomadenstamm
type: Concept
related: Nomade
pref label: Nomadenstamm
in scheme: travel!digital Thesaurus
definition: bdk: siehe Nomade, Stamm

Nomadenstamm
type: Label
in scheme: travel!digital Thesaurus

kebila
type: Label
isTranslationOf: Stamm
hasTranslation: tribe
in scheme: travel!digital Thesaurus

Stamm
type: Label
hasTranslation: tribe
hasTranslation: kebila
in scheme: travel!digital Thesaurus

tribe
type: Label
isTranslationOf: Stamm
isTranslationOf: kebila
in scheme: travel!digital Thesaurus

Stammesgemeinschaft
type: Label
in scheme: travel!digital Thesaurus

Beduinenstamm
type: Concept
preferred label: kabîle @ar
pref label: kabîle
related: Beduine
pref label: Beduinenstamm
in scheme: travel!digital Thesaurus
definition: bdk: siehe Beduine, Stamm

kabîle
type: Label
isTranslationOf: Beduinenstamm
in scheme: travel!digital Thesaurus

Beduinenstamm
type: Label
hasTranslation: kabîle
in scheme: travel!digital Thesaurus

Beduine
type: Concept
narrower: Halbbeduine
pref label: bédawi
narrower: Beduinenfrau
alt label: bedawi
definition: Duden: nomadisierender arabischer Wüstenbewohner | Meyers Großes Konversations-Lexikon 1905: Beduĭnen (arab. Bedawi, »Wüstenbewohner«), die nomadisierenden Wüstenbewohner Arabiens, Syriens und Nordafrikas. Ihr Heimatland und noch heute ihr Hauptsitz, von dem aus sie sich nach allen Richtungen hin verbreitet haben, ist Nedschd in Arabien. An den syrischen Grenzen beherrschen sie die Karawanenstraße von Aleppo und Damaskus bis nach Bagdad und Basra. Die B. in Palästina, besonders zwischen Rama und Jerusalem und am Berg Sinai, nehmen die Stelle der alten Edomiter, Midianiter und andrer Nachbarvölker der alten Israeliten ein. In Nordafrika bilden sie die fast ausschließliche Bevölkerung von Bengasi und Tripolis und einen sehr starken Prozentsatz der Bevölkerung von Tunis, Algerien und Marokko; endlich bewohnen sie, rein oder mit Berbern vermischt, als Mauren den westlichsten Teil der Sahara zwischen Marokko und dem Senegal. Weiteres s. Arabien, S. 653. | Quelle: Meyers Großes Konversations-Lexikon, Band 2. Leipzig 1905, S. 547. | Permalink: http://www.zeno.org/nid/20006305717
alternative label: bedawi @ar
pref label: Beduine
preferred label: bédawi @ar
in scheme: travel!digital Thesaurus

Halbbeduine
type: Concept
alternative label: Halb-Beduine
in scheme: travel!digital Thesaurus
pref label: Halbbeduine
alt label: Halb-Beduine
definition: bdk: siehe Beduine

Halbbeduine
type: Label
in scheme: travel!digital Thesaurus
hasVariant: Halb-Beduine

Halb-Beduine
type: Label
in scheme: travel!digital Thesaurus
isVariantOf: Halbbeduine

bédawi
type: Label
isTranslationOf: Beduine
in scheme: travel!digital Thesaurus
hasVariant: bedawi

Beduine
type: Label
in scheme: travel!digital Thesaurus
hasTranslation: bédawi

bedawi
type: Label
in scheme: travel!digital Thesaurus
isVariantOf: bédawi

Beduinenfrau
type: Concept
definition: bdk: siehe Beduine
alternative label: Beduinenweib
pref label: Beduinenfrau
alt label: Beduinenweib
in scheme: travel!digital Thesaurus

Beduinenfrau
type: Label
in scheme: travel!digital Thesaurus

Beduinenweib
type: Label
in scheme: travel!digital Thesaurus

Hirtenstamm
type: Concept
definition: bdk: siehe Hirte, Stamm | Duden: Nomadenstamm, der hauptsächlich von der Viehzucht lebt
related: Hirte
pref label: Hirtenstamm
in scheme: travel!digital Thesaurus

Hirtenstamm
type: Label
in scheme: travel!digital Thesaurus

Volksstamm
type: Label
hasVariant: Völkerstamm
in scheme: travel!digital Thesaurus

Völkerstamm
type: Label
isVariantOf: Volksstamm
in scheme: travel!digital Thesaurus

Hauptstamm
type: Concept
pref label: Hauptstamm
in scheme: travel!digital Thesaurus
definition: bdk: siehe Stamm

Hauptstamm
type: Label
in scheme: travel!digital Thesaurus

Saharastamm
type: Concept
definition: bdk: siehe Stamm | Duden: Sahara: Wüste in Nordafrika | Meyers Großes Konversations-Lexikon 1909: Sáhara (arab. Sáh râ), große nordafrikanische Wüste, erstreckt sich als westlichster Teil des großen, über Arabien und Iran mit Unterbrechungen bis nach Innerasien sich hinziehenden Wüstengürtels vom Atlantischen Ozean im W. bis zum Roten Meer im O. und umfaßt große Gebiete von Marokko, Algerien und Tunis, ferner Fezzan, den größten Teil von Tripolis, Barka, Ägypten und Nubien. Ihr Areal ist berechnet auf 9,159,495 qkm, d.h. fast so groß wie Europa (9,7 Mill.). S. die Karte »Fluß- und Gebirgssysteme von Afrika« (im 1. Bd.). | [Bodenbeschaffenheit.] Die S. ist nicht einförmig, wie früher angenommen wurde, sondern ein landschaftlich sehr mannigfaltiges Hochland (bis 600 m hoch): Hochgebirge mit Gipfeln bis 2500 m wechseln mit steinigen Hochebenen, Dünenregionen, Becken mit Lehmboden und salzigen Seen und Sümpfen sowie mit fruchtbaren Oasengebieten. Über den geologischen Bau des nordafrikanischen Wüstenplateaus vgl. Afrika (Geognostische Beschaffenheit). Zur allgemeinen Orientierung sei folgendes bemerkt. Das aus steil ausgerichteten und gefalteten kristallinischen Schiefern bestehende Grundgebirge, das in den Gebirgen von Aïr (Asben), Ahaggar und Tibesti zutage tritt, wird überlagert von mächtigen horizontalen paläozoischen Schichtenreihen und beides von ebenfalls horizontaler mittlerer Kreide. Seit den ältesten Zeiten hat keine Faltung in der S. stattgefunden, sondern Graben- und Kesselbrüche haben die Höhenunterschiede hervorgebracht. Dagegen fehlen Sedimente aus der Perm-, Trias- und Jurazeit. Die Zone der paläozoischen Ablagerungen wird von W. nach O. schmaler, die der Kreidesedimente nimmt im umgekehrten Sinne zu. In der Tertiärzeit fand vulkanische Tätigkeit statt, während dem Quartär die ausgedehnten Dünenbildungen wie die Alluvionen im Nildelta angehören. Was Einzelheiten betrifft, so erreichen die kristallinischen Schiefer (Gneis, Glimmerschiefer, Quarzit) in Ver…
in scheme: travel!digital Thesaurus
pref label: Saharastamm
related match: Sahara

Saharastamm
type: Label
in scheme: travel!digital Thesaurus

Nachbarstamm
type: Label
in scheme: travel!digital Thesaurus

Jägerstamm
type: Concept
related: Jäger
definition: bdk: siehe Jäger, Stamm
in scheme: travel!digital Thesaurus
pref label: Jägerstamm

Jäger
type: Concept
definition: Duden: 1. jemand, der auf die Jagd geht | Duden: Jagd: 1. a. das Aufspüren, Verfolgen, Erlegen oder Fangen von Wild | b. [gesellige] Veranstaltung, bei der eine Gruppe von Jägern auf bestimmtes Wild jagt | Meyers Großes Konversations-Lexikon 1907: Jagd, das Aufsuchen, Verfolgen und Aneignen des Wildes, bildet auf einer gewissen niedern Stufe der Entwickelung die Hauptbeschäftigung ganzer Völker (Jägervölker). Die Raubtiere werden gejagt, um sich vor ihren Angriffen zu schützen und die Haut zu erbeuten; das Fleisch des erlegten eßbaren Wildes dient zur Hauptnahrung, die Haut zur Kleidung. Mit zunehmender Kultur bildeten Viehzucht und Ackerbau die Hauptbeschäftigung der Völker, die J. wurde mehr Gegenstand des Vergnügens, besonders des Adels und der Fürsten, die Bannforsten anlegten, in denen sie sich das Jagdrecht vorbehielten. Auch die J. auf die größern Jagdtiere nahmen sie ausschließlich für sich in Anspruch. Mit dem 16. Jahrh. wurde das Jagdrecht Regal (s. Jagdhoheit). Zur Beaufsichtigung und Verwaltung der J., die bei gutem Wildstand nicht unbeträchtliche Einnahmen lieferte, wurden Beamte mit berufsmäßiger Ausbildung angestellt. Dadurch wurde die Jägerei zu einer Kunst, die von[133] den Berufsjägern zunftmäßig erlernt werden mußte. Die Ausübung der J. wurde nach gewissen Regeln betrieben, Jagdgeräte (s. Jagdzeug) und Fangapparate wurden verbessert, und es bildete sich die Weidmannssprache als eine besondere Jagdkunstsprache aus. Die Jagdausübung (das Weidwerk) teilte sich in verschiedene Zweige, und zwar sowohl infolge des erworbenen Rechts einzelner, gewisse Wildarten in bestimmten Gemarkungen mit Ausschluß andrer zu fangen oder zu erlegen, als auch infolge des kunstmäßigen Betriebs der einzelnen Jagdarten. Man unterscheidet hiernach allgemein hohe und niedere I. Erstere (Großweidwerk) umfaßt von den Spalthufern in der Regel das Edel- (Rotwild), Elch- (Elen-), Dam-, Reh- und Schwarzwild, den Steinbock und die Gemse; vom Geflügel das Auer- und Birkwild, die Fasa…
pref label: Jäger
narrower: Jagdführer
in scheme: travel!digital Thesaurus
related match: Hunting

Jäger
type: Label
in scheme: travel!digital Thesaurus

Jagdführer
type: Concept
preferred label: shikari @si
in scheme: travel!digital Thesaurus
pref label: shikari
definition: bdk: siehe Führer
pref label: Jagdführer

shikari
type: Label
isTranslationOf: Jagdführer
in scheme: travel!digital Thesaurus

Jagdführer
type: Label
hasTranslation: shikari
in scheme: travel!digital Thesaurus

Jägerstamm
type: Label
in scheme: travel!digital Thesaurus

Priesterstamm
type: Concept
related: Priester
pref label: Priesterstamm
in scheme: travel!digital Thesaurus
definition: bdk: siehe Priester, Stamm

Priester
type: Concept
narrower: Zauberpriester
narrower: Amonspriester
narrower: Hohepriester
in scheme: travel!digital Thesaurus
pref label: Priester
preferred label: lama @bo
alt label: Priesterschaft
alternative label: Priesterschaft
narrower: Oberpriester
narrower: Hathorpriesterin
pref label: lama
preferred label: panda @hi
pref label: panda
narrower: Baalspriester
definition: Duden: 1. (in vielen Religionen) als Mittler zwischen Gott und Mensch auftretender, mit besonderen göttlichen Vollmachten ausgestatteter Träger eines religiösen Amtes, der eine rituelle Weihe empfangen hat und zu besonderen kultischen Handlungen berechtigt ist | 2. katholischer Geistlicher, der die Priesterweihe empfangen hat | Meyers Großes Konversations-Lexikon 1908: Priester (v. griech. presbyteros), die Verwalter des religiösen Kultus, die berufsmäßigen Vollzieher gottesdienstlicher Handlungen, vornehmlich der mit den alten Religionen verbundenen Opfer. Ursprünglich war in diesem Sinn jedes Familienhaupt P. des Hauses, wie der Fürst in der Gemeinde. Bei Griechen und Römern steht das Priestertum in enger Verbindung mit der Königswürde. Bei den Griechen sind die Priesterämter in einzelnen Geschlechtern erblich. Bei den Römern finden wir die Eigentümlichkeit, daß an der Spitze des Staatskults eine Anzahl von Priesterkollegien stehen, so namentlich die Pontifices und Augurn (s. d.). Bei beiden Völkern werden die ersten chronologischen und historischen Aufzeichnungen durch Priester gemacht. Im Orient bildete sich früh schon ein Priesterstand, der in Indien und Ägypten geradezu als Kaste auftritt. – Auch bei den Israeliten übte ursprünglich jeder Familienvater und späterhin der Erstgeborne die priesterliche Tätigkeit aus, bis bei der Aufstellung des Stiftszeltes Aaron, dem Bruder Moses', und mit ihm dem Stamm Levi das erbliche Priesteramt übertragen wurde, dessen Trägern hauptsächlich die Überwachung und Ausübung des Kultus im weitesten Sinne, Belehrung des Volkes, Wahrung der Heiligtümer und zeitweise Leitung der Gerichtsbarkeit übertragen war (s. Leviten). Alle heiligen Amtshandlungen mußten die P. nüchtern im Zustand levitischer Reinheit verrichten. Deshalb durften sie keine Leiche, mit Ausnahme derer der nächsten Verwandten (vgl. 3. Mos. 21,1 ff.), berühren. Die Kleidung bestand aus einem Leibrock, Gürtel, Hüftkleid und Kopfbund aus seinem Leinen, zu den für den H…
narrower: Dionyspriester

Zauberpriester
type: Concept
definition: Duden: Zauberpriester: Priester, der über magische Fähigkeiten verfügt | Duden: Schamane: (bei bestimmten Naturvölkern) mit magischen Fähigkeiten, besonders der Fähigkeit, mit Geistern in Verbindung zu treten, ausgestattete Person, die als Priester, Medizinmann o. Ä. fungiert | Meyers Großes Konversations-Lexikon 1909: Schamanismus, das Religionssystem der meisten niedern Naturvölker, deren geistige Führer sich als Zauberer und Herren über die Natur gebärden. Den Namen Schamane, den die Zauberpriester der si birischen Stämme führen, leitet man (nach F. Max Müller fälschlich) von Sramana, der indischen Bezeichnung für buddhistische Büßer, ab. Sie empfangen Offenbarungen über Geheimes, Heilmittel und Zukünftiges, indem sie mit Trommeln und Klappern ihre Gesänge begleiten und sich in einen Zustand nervöser Aufregung versetzen, der sich bis zu krampfhaften Zuckungen steigert, wobei sie angeblich mit den Göttern und den Geistern der Verstorbenen verkehren. Ähnlich wie die Schamanen Sibiriens verfahren die Angekoks der Eskimo, die Medizinmänner Nordamerikas, die Piajes oder Zauberpriester der Südamerikaner, die Fetischmänner oder N'gangas in Afrika und die australischen und papuanischen Kilos. Der Grundgedanke des S. beruht auf der Vorstellung, daß der Mensch mit unsichtbaren Mächten in Verkehr treten und sie zur Folgsamkeit zwingen könne. Beides geschieht durch Anwendung von sinnbildlichen Gebräuchen und geheimnisvollen Kraftsprüchen, auch durch narkotische Tränke und Hypnotisierung. Dieser Selbstbetrug hängt sich an alles Rituelle und Symbolische, wenn man ihm eine zwingende Gewalt beimißt und das Gebet zur Zauberformel erhöht. Der buddhistische Glaube, der den Priestern Macht über die Götter gibt und mit Gebetmaschinen arbeitet, ist reiner S. Auch der Opferdienst, aus dem reinen Gefühl des Dankes entsprungen, vermag schamanistisch zu entarten. Die Gottheit erscheint dann als der beschenkte Teil, und der Geber erwartet für seine Wohltaten eine wohlerworbene Gegenleistun…
alternative label: Schamane
related match: Shamanism
alternative label: Shamane
pref label: Zauberpriester
alternative label: Medizinmann
alt label: Shamane
alt label: Medizinmann
alt label: Schamane
in scheme: travel!digital Thesaurus

Zauberpriester
type: Label
in scheme: travel!digital Thesaurus

Shamane
type: Label
isVariantOf: Schamane
in scheme: travel!digital Thesaurus

Schamane
type: Label
hasVariant: Shamane
in scheme: travel!digital Thesaurus

Medizinmann
type: Label
in scheme: travel!digital Thesaurus

Amonspriester
type: Concept
related match: Amun
definition: bdk: siehe Priester | Duden: Ammon: altägyptischer Gott | Meyers Großes Konversations-Lexikon 1905: Ammon (bei den Griechen und Römern Zeus oder Jupiter-A. genannt), ein Erntegott der alten Ägypter, ward ursprünglich als Stadtgott von Theben (No-A.) verehrt. Bereits im mittlern Reiche (etwa seit 2000 v. Chr.) wurde er zum Sonnengott gemacht und A.-Rê, d.h. »A.-Sonne« genannt. Als Theben im neuen Reiche zur Hauptstadt des Pharaonenreiches geworden war, wurde A. zum ägyptischen Hauptgott, zum »König der Götter«; sein Kultus wurde in den eroberten Ländern, in Nubien, Syrien, den Oasen der Libyschen Wüste eingeführt. Von den großen Heiligtümern, die dem A. in dieser Zeit errichtet wurden, verdienen die Tempel von Luksor und Karnak besondere Erwähnung. Die Verfolgung der alten Götter durch Amenhotep IV. (s. d.), die sich hauptsächlich gegen A. richtete, war nur von kurzer Dauer, und nach der Wiederherstellung der alten Religion blühte der Kultus des A. nur um so kräftiger. Erst seit der 26. Dynastie (seit 663 v. Chr.) trat A. im ägyptischen Pantheon mehr und mehr zurück. Dafür wurde er zum Hauptgotte des äthiopischen Reiches, und auch in den libyschen Oasen genoß er, besonders als Orakelgott, weiterhin hohe Verehrung. Sein berühmtestes Heiligtum war in späterer Zeit die 16 Tagereisen westlich von Memphis gelegene Ammonsoase (s. Simah), dessen Priester sich der Verkündigung der Orakel des Gottes widmeten, und zu dem die Völker von nah und fern ihre Boten und Geschenke sandten. Die vornehmsten Frager waren Krösus, Kambyses, Alexander d. Gr., Cato. Früh kam der Kultus des A. nach Griechenland. Pausanias kennt Ammonstempel in Theben und Sparta; die Eleer verehrten außer Zeus-A. auch eine Hera-Ammonia. | Das heilige Tier des A. war der Widder, in dessen Gestalt der Gott auch dargestellt wurde; häufiger erscheint er als Mensch mit einer eigenartigen Kappe und zwei hohen Federn auf dem Haupte, bärtig, in der einen Hand das Götterzepter, in der andern die Hieroglyphe für Leben h…
pref label: Amonspriester
in scheme: travel!digital Thesaurus

Amonspriester
type: Label
in scheme: travel!digital Thesaurus

Hohepriester
type: Concept
alternative label: Hoherpriester
in scheme: travel!digital Thesaurus
definition: Duden: oberster Priester [besonders im Judentum]
alternative label: Hohepriesterthum
pref label: Hohepriester
alt label: Hohepriesterthum
alternative label: Hohenpriester
alt label: Hohenpriester
alt label: Hoherpriester

Hohepriester
type: Label
hasVariant: Hoherpriester
hasVariant: Hohenpriester
in scheme: travel!digital Thesaurus

Hoherpriester
type: Label
hasVariant: Hohenpriester
isVariantOf: Hohepriester
in scheme: travel!digital Thesaurus

Hohenpriester
type: Label
hasVariant: Hoherpriester
isVariantOf: Hohepriester
in scheme: travel!digital Thesaurus

Hohepriesterthum
type: Label
in scheme: travel!digital Thesaurus

Priester
type: Label
hasTranslation: panda
hasTranslation: lama
in scheme: travel!digital Thesaurus

panda
type: Label
isTranslationOf: Priester
in scheme: travel!digital Thesaurus
hasTranslation: lama

lama
type: Label
isTranslationOf: Priester
in scheme: travel!digital Thesaurus
hasTranslation: panda

Priesterschaft
type: Label
in scheme: travel!digital Thesaurus

Oberpriester
type: Concept
in scheme: travel!digital Thesaurus
definition: bdk: siehe Priester
pref label: Oberpriester

Oberpriester
type: Label
in scheme: travel!digital Thesaurus

Hathorpriesterin
type: Concept
related match: Hathor
definition: bdk: siehe Priesterin | Meyers Großes Konversations-Lexikon 1907: Hathor, ägypt. Göttin der Freude, die in verschiedenen Städten, unter andern Dendra, als Schutzheilige verehrt wurde. Sie wurde auch als Himmelsgöttin aufgefaßt und in Gestalt einer Kuh, oder auch als Frau mit einem Kuhkopf oder gänzlich als Weib, das auf dem Kopfe nur Kuhhörner und die Sonne trägt, dargestellt. In Theben war sie die Herrin der Totenstadt. Sie tritt auch als Schicksalsgöttin auf (die sieben Hathoren sind die Feen der Ägypter), und in griechischer Zeit wird sie der Aphrodite gleichgestellt. Der dritte ägyptische Monat (Athyr) hat von ihr den Namen. Vgl. die nebenstehende Abbildung und Tafel »Architektur I«, Fig. 7 u. 17. | Quelle: Meyers Großes Konversations-Lexikon, Band 8. Leipzig 1907, S. 869. | Permalink: http://www.zeno.org/nid/20006747574
in scheme: travel!digital Thesaurus
pref label: Hathorpriesterin

Hathorpriesterin
type: Label
in scheme: travel!digital Thesaurus

Baalspriester
type: Concept
related match: Baal (demon)
alternative label: Baalspfaffe
in scheme: travel!digital Thesaurus
pref label: Baalspriester
alt label: Baalspfaffe
definition: bdk: siehe Priester | Duden: Baal: semitischer Wetter- und Himmelsgott | Meyers Großes Konversations-Lexikon 1905: Baal (»Herr«) hieß bei den Kanaanäern ursprünglich jeder Gott, den man an einem bestimmten Orte wohnend und wirkend dachte und demgemäß ebendort verehrte. Jeder Ort, jeder Berg hatte seinen B., daher die vielen phönikisch-kanaanäischen geographischen Namen, wie B.-Lebanon, B.-Chermon, B.-Peor u. a.: der Gott ist der »Herr« des betreffenden Ortes. Auch jeder Stamm hatte seinen besondern B. Daneben gab es aber auch einen Gott, welcher »der Herr« in hervorragendem Sinne des Wortes hieß, der Allherr, das im Sonnenball verkörperte männliche, zeugende Prinzip, dessen Ergänzung Astarte (s. d.) ist. Im Alten Testament heißt »der B.« (habbaal) der Stadtgott von Tyrus, worin die allgemeine Bedeutung des Wortes B., »Herr« (vgl. Melkart, »Stadtkönig«), und die spezielle, »Sonnengott«, zur Einheit verschmolzen sind (s. Melkart); soz. B. 1. Kön. 16,31 f., wo erzählt ist, daß der König Ahab den Kultus seiner phönikischen Gemahlin Izebel in das Reich Israel verpflanzt und »dem B.« einen Tempel in Samarien gebaut habe mit einem Baalsaltar, bedient von Hunderten von Priestern. Der Ausdruck Baalspfaffe (für einen heuchlerischen Priester) wurzelt in der Erzählung 1. Kön. 18,19 ff. vom Propheten Elias und den Propheten des B. Grundverschieden von dem kanaanäischen B. ist der babylonische Bel; s. Merodach. | Quelle: Meyers Großes Konversations-Lexikon, Band 2. Leipzig 1905, S. 217. | Permalink: http://www.zeno.org/nid/2000627871X

Baalspriester
type: Label
in scheme: travel!digital Thesaurus

Baalspfaffe
type: Label
in scheme: travel!digital Thesaurus

Dionyspriester
type: Concept
related match: Dionysus
definition: bdk: siehe Priester | Duden: Dionysos: Gott des Weines, des Rausches und der Fruchtbarkeit | Meyers Großes Konversations-Lexikon 1906: Diónysos, bei den Griechen der Gott der schwellenden Triebkraft der Natur, wie sie sich in den Bäumen und besonders im Weinstock zeigt, daher als erster Pflanzer desselben und Weinbereiter (Lenäos, »Kelterer«) angesehen. Sein Kult scheint thrakischen Ursprungs und von Thrakern in Mittelgriechenland am Parnaß, wo D. als Mitbesitzer von Delphi erscheint, und am Kithäron eingeführt zu sein. In der gewöhnlichen Sage gilt er als Sohn des Zeus und der thebanischen Königstochter Semele (s. d.); als diese, von Zeus' Blitz getroffen, das erst sechsmonatliche Kind gebar, barg es Zeus in seiner Hüfte bis zur Reise und gab es dann den Nymphen von Nysa (s. d.) oder Dodona zur Pflege. Herangewachsen, pflanzt D. den Weinstock und zieht mit seinem vom Wein begeisterten Gefolge (Thiasos), seinen Ammen und andern Nymphen, Satyrn, Silenen und sonstigen Dämonen umher,| [27] um seinen Kult und den Weinbau zu verbreiten, trotz seiner Jugend ein wunderstarker Gott, der seine Widersacher furchtbar straft; eine Reihe von Sagen läßt erkennen, daß der neue Kult an manchen Orten auf heftigen Widerstand stieß (s. Lykurgos und Pentheus). Nachdem er sich überall Anerkennung verschafft und neben Herakles in Löwengestalt den Göttern zum Gigantensiege verholfen, wurde er in den Olymp aufgenommen, in dem er bei Homer noch nicht erscheint. [...] | Quelle: Meyers Großes Konversations-Lexikon, Band 5. Leipzig 1906, S. 27-29. | Permalink: http://www.zeno.org/nid/20006494102
in scheme: travel!digital Thesaurus
pref label: Dionyspriester

Dionyspriester
type: Label
in scheme: travel!digital Thesaurus

Priesterstamm
type: Label
in scheme: travel!digital Thesaurus

Urstamm
type: Concept
in scheme: travel!digital Thesaurus
pref label: Urstamm
definition: bdk: Stamm, aus dem andere Stämme hervorgegangen sind

Urstamm
type: Label
in scheme: travel!digital Thesaurus

Indianerstamm
type: Concept
related: Indianer
pref label: Indianerstamm
in scheme: travel!digital Thesaurus
definition: bdk: siehe Indianer, Stamm

Indianerstamm
type: Label
in scheme: travel!digital Thesaurus

Karer
type: Concept
related match: List of ancient tribes in Thrace and Dacia
related match: Caria
pref label: Karer
in scheme: travel!digital Thesaurus
definition: Duden: Bewohner Kariens | Duden: Karien: historische Landschaft in Kleinasien | Meyers Großes Konversations-Lexikon 1907: Karĭen, im Altertum die südwestlichste städtereiche Landschaft Kleinasiens (s. Karte »Alt-Griechenland«), im N. durch das Gebirge Messogis (Dschuma Dagh) von Lydien, im O. durch den Salbakos (Baba Dagh) und den heutigen Boz Dagh von Phrygien getrennt, im S. und W. an das Meer stoßend. Abgesehen vom Mäandertal und kleinen Küstenebenen ist K. Gebirgsland, reich an Wäldern (Eichen, Fichten). Unter den zahlreichen Meerbusen sind der iassische (Golf von Mendelia) und der keramische (Golf von Kos) die bedeutendsten. K. wird vom Mäander (Menderez Tschai) und dessen Zuflüssen Marsyas und Harpasos bewässert, war in den Ebenen fruchtbar an Getreide, Wein, Öl und hatte vorzügliche Gebirgsweiden, daher auch starke Schafzucht. Bedeutende Städte waren der alte Fürstensitz Mylasa, Tralles, Nysa und die griechischen Kolonien Halikarnassos, Knidos, Magnesia, Miletos u. a. - Die alten Einwohner, die Karer, welche die Leleger unterjocht hatten, waren vielleicht Semiten. Sie dehnten ihre Herrschaft über die Westküste Kleinasiens bis Lesbos hinauf und über fast alle Inseln des Ägäischen Meeres aus, wurden aber von den Ioniern ins Binnenland getrieben und verloren an diese auch die südlichen und südwestlichen Küstenstriche. Sie waren ein kriegerisches Volk und von den Griechen gehaßt als die furchtbarsten Seeräuber. Vor der Perserherrschaft stand K. unter eignen Königen, die sich den Persern freiwillig unterwarfen und als Lehnsfürsten (Satrapen) Gebiet und Gewalt behielten. Einer von ihnen, Lygdamis I., Fürst von Halikarnassos, war der Vater Artemisias I., die 480 v. Chr. mit Xerxes in die Schlacht bei Salamis zog. 412 wurde Amorges, Sohn des durch Tissaphernes 427 beteiligten lydischen Satrapen Pissuthnes, von Peloponnesiern gefangen und an Tissaphernes ausgeliefert, nachdem er sich mit Hilfe Athens eine Zeitlang zu Iasos in K. selbständig gehalten hatte. Um 344 half…

Karer
type: Label
in scheme: travel!digital Thesaurus

polnisch
type: Concept
related: Pole
pref label: polnisch
definition: Duden: Polen, die Polen betreffend, von den Polen stammend, zu ihnen gehörend | [Anm.: unvollständig: Polen, die Polen betreffend; von den Polen stammend, zu ihnen gehörend; in Polen gelegen]
in scheme: travel!digital Thesaurus

Pole
type: Concept
definition: Duden: Einwohnerbezeichnung zu Polen | Duden: Polen: Staat im östlichen Mitteleuropa | Meyers Großes Konversations-Lexikon 1908: Polen | Quelle: Meyers Großes Konversations-Lexikon, Band 16. Leipzig 1908, S. 87-94. | Permalink: http://www.zeno.org/nid/20007268912
related match: Poland
in scheme: travel!digital Thesaurus
pref label: Pole

Pole
type: Label
in scheme: travel!digital Thesaurus

polnisch
type: Label
in scheme: travel!digital Thesaurus

Korse
type: Concept
definition: Duden: Einwohnerbezeichnung zu Korsika | Duden: Korsika: Insel im Mittelmeer | Meyers Großes Konversations-Lexikon 1907: Korsika (franz. la Corse), Insel im Mittelmeer, ein französisches Departement bildend, von der nördlich liegenden Insel Sardinien durch die 11 km breite Straße von Bonifacio getrennt, ist von Livorno, dem nächsten italienischen Hafen, 84 km, und von dem nächsten französischen Hafen, Antibes, 172 km entfernt (s. das Kärtchen S. 515). Sie hat von N. nach S. eine Länge von 183 km, eine größte Breite von 84 km und einen Flächenraum von 8722 qkm (158,4 QM.). Die Insel ist deutlich als ein abgelöstes Stück von Sardinien zu erkennen. Mit Italien verknüpft es ein unterseeischer, wenig unter 180 m sinkender Rücken, auf dem sich ihm die toskanischen Inseln entgegenstrecken, während es von der Provence durch Tiefen von 2000 m getrennt ist. Bei Bastia setzt sich an den Rumpf der Insel die gebirgige, 38 km lange Halbinsel von Kap Corso, so nach der Nordspitze benannt, an, die an ihrer westlichen Basis den Hafen von St.-Florent hat. Sehr viel reicher gegliedert, reicher an Buchten und malerischen, steilen Vorgebirgen ist die Westseite der Insel; es folgen auseinander die Buchten von Calvi, Porto, Sagone, Ajaccio und Valinco, denen freilich meist eine anschließende Ebene fehlt. Nur bei Ajaccio ist eine kleine Küstenebene vorhanden, mit Recht Campo d'Oro, das Goldfeld, genannt. Das Innere der Insel ist von rauhen Bergen erfüllt, die deutlich eine Hauptkette mit Meridianrichtung, eine Fortsetzung derjenigen von Sardinien, erkennen lassen, aber in der Weise, daß die schwer zu übersteigende Wasserscheide im nördlichen Teil der Insel sich nahe der Nordwestküste, im südlichen näher der Ostküste hält. Die Ostseite besteht aus Kreidegesteinen, meist Kalk, an der Küste auch aus tertiären und quartären Bildungen, während der bei weitem größte Teil der Insel westlich von einer Linie, die von Ile Rousse nach Solenzara verläuft, aus altkristallinischem Gestein, vorzugsweise …
pref label: Korse
in scheme: travel!digital Thesaurus
related match: Corsica

Korse
type: Label
in scheme: travel!digital Thesaurus

Tinneh
type: Concept
alternative label: Athabascan-Indianer
related: Indianer
alt label: Athabascan-Indianer
in scheme: travel!digital Thesaurus
pref label: Tinneh
definition: Meyers Großes Konversations-Lexikon 1905: Athabasken (Athapasken), Name für eine große Gruppe von Indianerstämmen Nordamerikas, die sich selbst Tinneh (»Menschen«) nennen und vom Nördlichen Eismeer bis nach Mexiko, von der Hudsonbai bis zum Stillen Ozean verbreitet sind. Zu ihnen gehören unter anderm die Loucheux am untern Mackenzie, die Chepewyan am Athabascasee, die Kenai auf der gleichnamigen Halbinsel, die Apatschen in Arizona, die Navajos im nördlichen Mexiko. Die Sprachen sämtlicher A. bilden einen eignen Sprachstamm, der von Ed. Buschmann in den Abhandlungen: »Der athabaskische Sprachstamm« (Berl. 1856), »Das Apache als eine athabaskische Sprache erwiesen« (das. 1861) und »Die Verwandtschaftsverhältnisse der athabaskischen Sprachen« (das. 1863) eingehend untersucht worden ist. | Quelle: Meyers Großes Konversations-Lexikon, Band 2. Leipzig 1905, S. 21. | Permalink: http://www.zeno.org/nid/20006262694

Athabascan-Indianer
type: Label
in scheme: travel!digital Thesaurus

Tinneh
type: Label
in scheme: travel!digital Thesaurus

philistäisch
type: Concept
narrower: philistäisch-hellenisch
in scheme: travel!digital Thesaurus
pref label: philistäisch
related: Philister
definition: bdk: die Philister betreffend; von den Philistern stammend, zu ihnen gehörend

philistäisch-hellenisch
type: Concept
definition: bdk: siehe philistäisch, hellenisch
in scheme: travel!digital Thesaurus
pref label: philistäisch-hellenisch

philistäisch-hellenisch
type: Label
in scheme: travel!digital Thesaurus

philistäisch
type: Label
in scheme: travel!digital Thesaurus

Philister
type: Concept
definition: Meyers Großes Konversations-Lexikon 1908: Philister (Philistäer), ein mit griechischen, bestimmter karischen Elementen stark durchsetzter semitischer Volksstamm, der in frühester Zeit an der Ostküste des Mittelmeers den Strich bewohnte, der etwas südlich vom heutigen Jaffa beginnt und sich über Gaza hinaus erstreckt (s. Karte »Palästina«). Ihr Gebiet zerfiel nach den Hauptstädten Ekron, Gath, Asdod, Askalon und Gaza in fünf Kreise, deren jeder von einem Fürsten (Séren) regiert wurde. Ihre Städte waren volkreich, mit großen Tempeln, in denen sie den Baal und die Astarte verehrten, geschmückt und von Mauern umgeben. Anfänglich schwach, steigt ihre Macht in der zweiten Hälfte der Richterzeit, und sie bekämpfen die Israeliten bis in die Zeit Davids meist mit Glück. Auch Saul mit seinen Söhnen fällt im Kampf gegen sie bei Gilboa. Erst David, der einst bei ihnen Zuflucht gefunden hatte und in ihre Dienste getreten war, gelingt es nach seiner Erhebung zum Alleinherrscher, ihre Macht zu brechen, so daß sie nach 70jährigem Kampfe von der Eroberung Israels abstehen. Unter Joram zogen sie, mit den Arabern vereint, gegen Jerusalem. Später wurden sie vom syrischen Reich verschlungen, doch hat sich die alte Bezeichnung des Landes »Peléschet« (in den assyrischen Keilinschriften: Palastav oder Pilista) in dem Namen Palästina bis jetzt erhalten. – Auf deutschen Universitäten werden als P. alle Nichtstudenten bezeichnet. Der Name wird von Wiedeburg (»Beschreibung der Stadt Jena«, Jena 1785) auf blutige Händel zwischen Jenaer Studenten und Bewohnern der Johannisvorstadt (um 1690) zurückgeführt. Einem dabei erschlagenen Studenten hielt angeblich der Oberpfarrer Götze die Leichenpredigt über den Text: »Philister über dir, Simson!« (Richter 16,9. 12. 14. 20). In der Literatur findet P. als Studentenausdruck sich zuerst 1777 bei Adelung, der ihn von Ballistarii (Armbrustschützen) als dem Namen der Stadtmiliz ableitet, wie denn wirklich die als Armbrustschützen bekannten Jazygen in Ungarn …
in scheme: travel!digital Thesaurus
pref label: Philister

Philister
type: Label
in scheme: travel!digital Thesaurus

preußisch
type: Concept
in scheme: travel!digital Thesaurus
alt label: preussisch
narrower: preussisch-anglicanisch
pref label: preußisch
related match: Prussia
alternative label: preussisch
preferred label: prussiâni @ar
pref label: prussiâni
definition: Duden: das Königreich Preußen, die Preußen betreffend, von ihnen stammend, der Wesensart der Preußen entsprechend | Duden: Preußen: Königreich und Land des Deutschen Reiches | Meyers Großes Konversations-Lexikon 1908: Preußen (Preußischer Staat, hierzu Karte »Preußen«), der wichtigste Staat im Deutschen Reich, besteht seit 1866 im wesentlichen aus einem zusammenhängenden Gebiet, das freilich eine Anzahl von kleinern Staaten (beide Mecklenburg, die Freien Städte, Oldenburg, Braunschweig, Anhalt, Lippe, Schaumburg-Lippe, Waldeck, Oberhessen, Teile der thüringischen Staaten) umschließt, und grenzt gegen N. an die Nordsee, Dänemark und die Ostsee, gegen O. an Rußland und Galizien, gegen S. an die österreichischen Kronländer Schlesien, Mähren und Böhmen, ferner an das Königreich Sachsen, die thüringischen Staaten, Bayern, das Großherzogtum Hessen, die bayrische Pfalz und Elsaß-Lothringen und gegen W. an Luxemburg, Belgien und die Niederlande. Getrennt vom preußischen Staatsgebiet sind außer mehreren Enklaven innerhalb der von P. umschlossenen Staaten die Kreise Schleusingen, Schmalkalden und Ziegenrück sowie die Exklaven Wandersleben in Thüringen und Hohenzollern in Süddeutschland. Die äußersten Punkte des Staates, abgesehen von Hohenzollern, sind folgende: der nördlichste bei Nimmersatt, nördlich von Memel, unter 55°54' nördl. Br., der östlichste bei Schilleningken unweit Schirwindt an der Scheschuppe unter 22°53' östl. L., der südlichste bei Hanweiler am Einfluß der Blies in die Saar unter 49°7' nördl. Br. und der westlichste bei Isenbruch im Regbez. Aachen (4 km von der Maas) unter 5°52' östl. L. In Rücksicht auf den Flächeninhalt nimmt P. die sechste Stelle unter den europäischen Staaten ein, indem es Rußland, Österreich-Ungarn, Frankreich, Spanien und Schweden nachsteht. [...] | Quelle: Meyers Großes Konversations-Lexikon, Band 16. Leipzig 1908, S. 294-335. | Permalink: http://www.zeno.org/nid/2000728733X

preussisch
type: Label
in scheme: travel!digital Thesaurus
isVariantOf: preußisch

preußisch
type: Label
in scheme: travel!digital Thesaurus
hasVariant: preussisch
hasTranslation: prussiâni

prussiâni
type: Label
in scheme: travel!digital Thesaurus
isTranslationOf: preußisch

preussisch-anglicanisch
type: Concept
definition: bdk: siehe preußisch, anglikanisch
in scheme: travel!digital Thesaurus
pref label: preussisch-anglicanisch

preussisch-anglicanisch
type: Label
in scheme: travel!digital Thesaurus

Mohawk
type: Concept
definition: Pierer's Universal-Lexikon 1860: Mohawks, Indianerstamm in Nordamerika, zum Hauptstamm der Irokesen (s.d. a) gehörig. Die Sprache derselben (Mohawksprache), zu dem Irokesischen Stamme gehörig, entbehrt die Lippenbuchstaben b, p, f, m, v, sowie l, dagegen ist sie reich an Gutturalen. Die Substantiva sind flexionslos, nur zuweilen wird der Pluralis durch ein angehängtes ogon, hogon bezeichnet. Der Artikel ne, nene dient zugleich als Relativum. Eigentliche Adjectiva sind selten; sie werden meist durch Verbalformen ersetzt. Die Zahlwörter sind: 1 enskat, 2 tekeni; 3 aghsen, 4 kayèri, 5 wisk, 6 yayak, 7 tsyadak, 8 sadègon, 9 syoughtow, 10 oyèri. Ordinalia werdendaraus durch die Endung hadont gebildet, z.B. tekenihadont der zweite. Die Pronomina personalia sind iih ich, wir, ise du, ihr, raonha er, rononha sie (Plur.). Die Possessiva werden durch verschiedene Präfixe am Substantivum gebildet, z.B. ranihha (sein) Vater, rakenihha mein Vater, songwanihha unser Vater. Die Conjugation des Verbum ist sehr verwickelt, denn obwohl das Tempus eigentlich nicht formell bezeichnet wird, gibt es doch eine große Menge Formen, um die persönlichen Beziehungen sowohl des Handelnden, als dessen, auf den sich die Handlung bezieht, zu bezeichnen, z.B. wakatkaghto ich sehe, satkaghto, du siehst, rotkaghto, er sieht, wakwatkaghto wir sehen, sewatkaghto ihr sehet, wahhontkaghto sie sehen; sekwataghto ich sehe euch, waskwatkagh to ihr sehet mich, wahhakwatkaghto er sieht mich etc. Das Futurum wird durch ein vorgesetztes en, der Conjunctiv durch aon, der Infinitiv u. das Supinum durch tsi bezeichnet, im Participium die Endung attye, hattye angehängt. Das Reciprocum u. Reflexivum wird durch ein eingeschobenes dadd gebildet. Anstatt der Präpositionen gibt es Postpositionen, wie haga, nonga von, gon in, ne, ge in, von, mit etc. Der Anfang des Vaterunsers heißt: songwanihha ne karonghyage teghsideron, wasaghsenadogeghtine, unser-Vater dem Himmel-in du-wohnst, dein-Name-werde-geheiligt. Hülfsmittel z…
related: Indianer
in scheme: travel!digital Thesaurus
pref label: Mohawk

Mohawk
type: Label
in scheme: travel!digital Thesaurus

indoparthisch
type: Concept
definition: bdk: siehe indisch | Duden: parthisch: Parthien, die Parther betreffend | [Anm.: unvollständig: Parthien, die Parther betreffend; von den Parthern stammend, zu ihnen gehörend; in Partien gelegen]
in scheme: travel!digital Thesaurus
related: indisch
pref label: indoparthisch
related: Parther

indoparthisch
type: Label
in scheme: travel!digital Thesaurus

Parther
type: Concept
definition: Duden: Angehöriger eines nordiranischen Volksstammes | Duden: Parthien: Land der Parther | Meyers Großes Konversations-Lexikon 1908: Parthĭen (Parthia, Parthyaea), bei den Alten das von den Parthern ursprünglich bewohnte Land, das, im W. von Medien, im N. von Hyrkanien, im O. von Aria und Margiana, im S. von der Karamanischen Wüste begrenzt, Teile der heutigen Landschaften Chorasan und Kohistan umschloß. Das Land ist gebirgig, steinig, wasserarm und nur zu Weiden geeignet; die Flüsse versiegen meist im Sand: alles Eigenschaften, die nach S. hin zunehmen. Es ist ein Übergangsland, und zwar das einzige für größere Massen gangbare zwischen dem Osten und Westen Irans. Das wichtigste Erzeugnis des Landes waren Pferde, wie denn auch die Bewohner als tüchtige Reiter in Ruf standen. Hauptstadt war Hekatompylos im N. (jetzt Schahrud). S. Karte »Reich Alexanders d. Gr.« (in Bd. 1). | Die Parther (altpers. Parthava, »die Leute vom Rand«, d.h. vom Bergsaum) waren ein tapferes Nomadenvolk iranischer Herkunft und zoroastrischer Religion. Parthava wird bereits unter Dareios I. als Provinz Persiens genannt. Als dieses Reich durch Alexander d. Gr. vernichtet war und die Kämpfe der Diadochen die Bildung neuer Reiche zur Folge hatten, kamen die Parther unter die Herrschaft der Seleukiden, fielen aber, als unter Antiochos Theos die Auflösung des syrischen Reiches begann, von diesen ab und gründeten unter Arsakes I., der zu dem den Parthern verwandten Stamme der Aparnen gehört haben soll, 250 v. Chr. ein selbständiges Reich mit der Hauptstadt Hekatompylos. Arsakes soll sein Reich durch Eroberungen bis zum Indus im O. und bis an das Kaspische Meer im W. erweitert haben. Er fiel in einer Schlacht, vielleicht gegen die Baktrer, und wurde später als göttlicher Ahnherr verehrt. Sein Nachfolger war 248–214 sein Bruder Arsakes II. Tiridates, der 237 Hyrkanien erwarb, sich mit Erfolg der Angriffe seitens der syrischen Könige erwehrte, den Titel »Großkönig« annahm, die parthische Ära einführte (…
related match: Parthian Empire
related: Nomade
pref label: Parther
in scheme: travel!digital Thesaurus

Parther
type: Label
in scheme: travel!digital Thesaurus

kimmerisch
type: Concept
pref label: kimmerisch
related: Kimmerier
in scheme: travel!digital Thesaurus
definition: bdk: die Kimmerier betreffend; von den Kimmeriern stammend, zu ihnen gehörend

kimmerisch
type: Label
in scheme: travel!digital Thesaurus

Kimmerier
type: Concept
definition: Meyers Großes Konversations-Lexikon 1907: Kimmērĭer (Cimmērii), Fabelvolk bei Homer, im äußersten Westen am Okeanos beim Eingang in die Unterwelt in ewiger Finsternis wohnend; daher kimmerische Finsternis. Die historischen K., ein nomadisches Reitervolk an der Nordküste des Schwarzen Meeres, fielen, von Skythen aus ihren Sitzen vertrieben, im 9. und 8. Jahrh. v. Chr. in Kleinasien ein, plünderten um 650 Sardes, belagerten Ephesos und zerstörten Magnesia, bis sie durch Alyattes IV von Lydien um 600 aufgerieben wurden. Tomaschek hält sie für identisch mit dem thrakischen Stamme der Treren, Kiepert für die Gimirri oder Kappadokier. | Quelle: Meyers Großes Konversations-Lexikon, Band 10. Leipzig 1907, S. 905. | Permalink: http://www.zeno.org/nid/2000689254X
related: Nomade
pref label: Kimmerier
in scheme: travel!digital Thesaurus

Kimmerier
type: Label
in scheme: travel!digital Thesaurus

slawisch
type: Concept
related: Slawe
narrower: südslawisch
in scheme: travel!digital Thesaurus
pref label: slawisch
definition: Duden: die Slawen betreffend, zu ihnen gehörend | [Anm.: unvollständig: die Slawen betreffend; von den Slawen stammend, zu ihnen gehörend

Slawe
type: Concept
related match: List of medieval Slavic tribes
pref label: Slawe
alt label: Slave
in scheme: travel!digital Thesaurus
definition: Duden: Angehöriger einer in Ost-, Südost- und Mitteleuropa verbreiteten Völkergruppe | Meyers Großes Konversations-Lexikon 1909: Slawen, zusammenfassende Bezeichnung für eine Anzahl von Völkern indogermanischen Stammes, die sich durch die Ähnlichkeit ihrer Sprachen als verwandt oder zu einer Familie gehörig erweisen, nämlich Russen und Kleinrussen, Bulgaren, Serben und Kroaten, Slowenen, Tschechen und Slowaken, Sorben, Polen (dazu die Kassuben) und das ausgestorbene Volk der Polaben (vgl. die einzelnen Artikel). Die Bezeichnung »Slawen« geht zurück auf das Wort slovêne (spätere Form slavêne, slavjane; Sing. slovênin etc.), den ursprünglichen Gesamtnamen bei den S. selber. Außerdem wird zur Bezeichnung der S. von den deutschen Stämmen seit ältester Zeit der Ausdruck Wenden oder Winden gebraucht, während man heutigestags den Namen »Wenden« auf die Lausitzer S. (Sorben) und »Winden« auf die Slowenen zu beschränken pflegt; die S. selber aber haben sich nie mit diesem Ausdruck bezeichnet. Die Russen und Kleinrussen (oder Russen im weitesten Sinne) pflegt man auch Ostslawen zu nennen und Bulgaren, Serben, Kroaten und Slowenen als Südslawen und Tschechen, Slowaken, Sorben, Polen und Polaben als Westslawen zusammenzufassen (vgl. Slawische Sprachen). Hinsichtlich der heutigen geographischen Ausbreitung der S. s. die Völker- und Sprachenkarte beim Artikel »Europa«. | Die älteste Geschichte der S. ist dunkel. Ohne Zweifel haben die angegebenen slawischen Völkerschaften ursprünglich einmal ein Gesamtvolk gebildet. In der Geschichte werden die S. nachweislich erst im 1. Jahrh. n. Chr. erwähnt. Plinius der Ältere und Tacitus nennen nämlich als ein zu ihrer Zeit zwischen den Fenni (Finnen, an der Ostsee) und den Bastarnae und Peucini (zwei germanischen Stämmen am Ostrande der Karpathen) seßhaftes Volk die Venedae, ein Name, in dem man unschwer die erwähnte, bei den Germanen für die S. übliche Bezeichnung (althochd. Winid, Wined, Plural Winidâ) erkennt. Für das 2. Jahrh. führt Ptol…
alternative label: Slave

Slawe
type: Label
hasVariant: Slave
in scheme: travel!digital Thesaurus

Slave
type: Label
isVariantOf: Slawe
in scheme: travel!digital Thesaurus

südslawisch
type: Concept
pref label: südslawisch
definition: bdk: siehe slawisch
in scheme: travel!digital Thesaurus

südslawisch
type: Label
in scheme: travel!digital Thesaurus

slawisch
type: Label
in scheme: travel!digital Thesaurus

Nubier
type: Concept
definition: Duden: Einwohnerbezeichnung | [Anm.: unvollständig: Einwohnerbezeichnung zu Nubien] | Duden: Nubien: Landschaft in Nordafrika | Meyers Großes Konversations-Lexikon 1908: Nubĭen, Landschaft in Nordostafrika (s. Karte »Ägypten«), zu Beginn des 19. Jahrh. von Ägypten erobert, 1882–99 den Mahdisten (s. Mahdi) anheimgefallen, seit 1900 nur bis zum 22.° nördl. Br. mit Ägypten als Provinz N. (Hauptort Assuân, s. d.) vereinigt, während der größere südliche Teil, etwa bis Chartum unter englisch-ägyptischem Kondominium (beide Fahnen wehen nebeneinander) steht, im O. vom Roten Meer, im W. von dem Oasenzuge am Ostrande der Libyschen Wüste begrenzt. Dies N. bildet den nördlichen Teil des Sudâns und umfaßt von dessen Provinzen (Mudirieh): Dongola, Berber und Chartum, von seinen Gouvernements (Mohassa) Wadi Halfa und Suakin. Das Gebiet ist 743,000 qkm groß, seine Bevölkerung (früher etwa 1 Mill.) ist infolge des Aufstandes des Mahdi stark zurückgegangen, beginnt sich aber bereits (z. B. durch Einwanderung) zu heben, so besonders für Dongola von 56,426 (1897) auf 105,026 (1902). Das Land, fast durchweg Wüste, wird auch ringsum von solchen umgeben: im O. und Norden der Nilkrümmung die Nubische Wüste, im W. und S. derselben die Wüste El Dschesireh (el-Gezira), die in die Bajudasteppe übergeht. Nur von kleinen Regenbetten durchzogen, findet sich kulturfähiges Land, abgesehen von den Oasen, bloß im Niltal, das, sonst schmal, sich bei Neudongola und Berber beträchtlich erweitert. Eine weite Verbreitung besitzt in N. der der Kreide zugerechnete tiefgelbe und braune nubische Sandstein (s. Afrika, S. 137), zumal auf dem linken Ufer, von Assuân bis Chartum. Unter dem Sandstein tritt zwischen Assuân und Korosko, zwischen Wadi Halfa und Dongola und bei Abu Hammed am Nil kristallinisches Grundgebirge (Gneis und Granit) hervor, in dem die von den Pharaonen bearbeiteten, längst erschöpften Goldminen sich fanden. Sie verschafften dem Lande den Namen Nub (d.h. Goldland). Bei Okma entströmen den Sc…
in scheme: travel!digital Thesaurus
pref label: Nubier
related match: Nubia

Nubier
type: Label
in scheme: travel!digital Thesaurus

Cherokee
type: Concept
related: Indianer
in scheme: travel!digital Thesaurus
pref label: Cherokee
definition: Duden: Tscherokesen: Angehöriger eines nordamerikanischen Indianerstamms | Meyers Großes Konversations-Lexikon 1909: Tscherokēsen (Cherokee), nordamerikan. Indianerstamm der Irokesen, wohnten früher in Südcarolina, Georgia und Tennessee, unterwarfen sich 1785 nach blutigen Kämpfen den Vereinigten Staaten und wurden 1838 in das Indianerterritorium übergeführt, wo sie im Nordosten desselben, mit andern Stämmen gemischt, ein Gebiet von 40,000 qkm bewohnen. Die T. sind in der Kultur weit vorgeschritten, haben große Dörfer mit wohnlich eingerichteten Häusern, über 30 öffentliche Schulen mit zum Teil eingebornen Lehrern und 5000 Schülern, betreiben Ackerbau sowie ausgedehnte Rindvieh-, Schaf- und Pferdezucht. Was sie an Kleidung, Ackergerätschaften etc. bedürfen, fertigen sie selbst an (vgl. Tafel »Indianische Kultur I«, Fig. 17), auch betreiben sie Sägemühlen und gewinnen Salz aus den zahlreichen Salzquellen ihres Gebietes. Sie haben ihre besondern Gesetze und eine nach dem Muster der Vereinigten Staaten eingerichtete republikanische Regierung mit geschriebener Verfassung. Ihre im Aussterben begriffene Sprache gehört mit dem Tschokta etc. zu der Gruppe der appalachischen Sprachen Nordamerikas. Ein Elementarbuch derselben erschien in Park Hill, Arkansas (2. Aufl. 1846); eine kurze Grammatik lieferte H. C. v. d. Gabelentz im 3. Bande von Höfers »Zeitschrift für die Wissenschaft der Sprache« (1851), eine sprachvergleichende Darstellung Fr. Müller im 2. Bande seines »Grundrisses der Sprachwissenschaft« (Wien 1882). Von der Union erhalten die T. Jahrgelder für ihre im Osten des Mississippi abgetretenen Ländereien. Ihre Zahl betrug 1890: 25,357 Köpfe. Nach Thomas Cyrus waren die Vorfahren der T. die Urheber der Ohio Mounds. Vgl. Royce, The Cherokee Nation (Washingt. 1887); Th. Cyrus, The Cherokees in Pre-Columbian times (New York 1890); Mooney, Sacred formulas of the Cherokees (Washingt. 1891). | Quelle: Meyers Großes Konversations-Lexikon, Band 19. Leipzig 1909, S. 775. | Per…

Cherokee
type: Label
in scheme: travel!digital Thesaurus

Schweizer
type: Concept
related match: Switzerland
in scheme: travel!digital Thesaurus
pref label: Schweizer
narrower: Deutsch-Schweizer
definition: Duden: 1. zu Schweiz | [Anm.: unvollständig: Einwohnerbezeichnung zu Schweiz] | Duden: Schweiz: Staat in Mitteleuropa | siehe auch: Meyers Großes Konversations-Lexikon 1909: Schweiz | Quelle: Meyers Großes Konversations-Lexikon, Band 18. Leipzig 1909, S. 182-200. | Permalink: http://www.zeno.org/nid/20007448945

Schweizer
type: Label
in scheme: travel!digital Thesaurus

Deutsch-Schweizer
type: Concept
pref label: Deutsch-Schweizer
in scheme: travel!digital Thesaurus
definition: bdk: Schweizer mit deutscher Muttersprache

Deutsch-Schweizer
type: Label
in scheme: travel!digital Thesaurus

Krähen-Indianer
type: Concept
definition: Meyers Großes Konversations-Lexikon 1907: Krähenindianer (Crows, Upsaroka), Indianerstamm im nordamerikan. Staat Montana, aus der Sprachfamilie der Dakota (s. d.). Sie zählten 1890: 2287 Köpfe und haben angefangen, sich an Ackerbau und ein seßhaftes Leben zu gewöhnen. Früher lebten sie vorzugsweise von der Jagd und waren beständig mit den Sioux (Dakota) in Krieg. S. Tafel »Amerikanische Völker I«, Fig. 6. | Quelle: Meyers Großes Konversations-Lexikon, Band 11. Leipzig 1907, S. 558. | Permalink: http://www.zeno.org/nid/20006936830
related: Indianer
in scheme: travel!digital Thesaurus
pref label: Krähen-Indianer

Krähen-Indianer
type: Label
in scheme: travel!digital Thesaurus

Israelit
type: Concept
alt label: Kinder Israel
alt label: Israel
in scheme: travel!digital Thesaurus
related: Jude
alt label: Volk Israel
alternative label: Israel
pref label: Israelit
definition: Duden: (im Alten Testament) Angehöriger des Volkes Israel | Meyers Großes Konversations-Lexikon 1907: Israel (hebr., »Gotteskämpfer«), der theokratische Beiname Jakobs (s. d.); ursprünglich Gesamtbezeichnung seiner Nachkommen (Kin der I., Israeliten), später des namentlich durch den Stamm Ephraim vertretenen Nordreichs, im Gegensatz zum Reich Juda; s. Juden. | Quelle: Meyers Großes Konversations-Lexikon, Band 10. Leipzig 1907, S. 65. | Permalink: http://www.zeno.org/nid/2000683163X
alternative label: Kinder Israel
alternative label: Volk Israel

Kinder Israel
type: Label
in scheme: travel!digital Thesaurus

Israel
type: Label
in scheme: travel!digital Thesaurus

Jude
type: Concept
definition: Duden: Angehöriger eines semitischen Volkes, einer religiös beziehungsweise ethnisch zusammengehörenden, in fast allen Ländern der Erde vertretenen Gemeinschaft | Meyers Großes Konversations-Lexikon 1907: Juden (Israeliten), die Bekenner der mosaischen Religion. Ihr ursprünglicher, meist nach außen geltender Name war Hebräer oder Ebräer (hebr. Ibrim), »die Jenseitigen«, weil ihr Stammvater Abraham von jenseit des Euphrat in Palästina eingewandert war. Die mehr einheimische, auf die Bestimmung des Volkes hinweisende Benennung nach dem dritten Stammvater, Jakob (Israel, d. h. »Gottesstreiter«), Israeliten, entstand schon zu Anfang ihres Geschichtslebens, und mit J. (hebr. J'udim) bezeichnet man nach dem babylonischen Exil die gesamte israelitische Nation, weil die meisten Zurückkehrenden Bürger des ehemaligen Königreichs Juda waren. Die Ereignisse vor der Gefangenschaft in Babylon bilden demnach streng genommen die Geschichte des hebräischen oder israelitischen Volkes, während nach derselben die jüdische Geschichte beginnt. [...] | Quelle: Meyers Großes Konversations-Lexikon, Band 10. Leipzig 1907, S. 328-341. | Permalink: http://www.zeno.org/nid/20006846688
alt label: Judenvolk
pref label: Jude
narrower: Pharisäer
related match: Judaism
pref label: jew
alternative label: Judenschaft
alt label: Judengemeinde
preferred label: jew @en
alternative label: Judenvolk
narrower: Sephardim
in scheme: travel!digital Thesaurus
related: Judentum
narrower: Spaniole
narrower: Aschkenazim
narrower: Judenmädchen
alt label: Judenschaft
narrower: Chasidim
alternative label: Judengemeinde

Judenvolk
type: Label
in scheme: travel!digital Thesaurus

Jude
type: Label
in scheme: travel!digital Thesaurus
hasTranslation: jew

jew
type: Label
in scheme: travel!digital Thesaurus
isTranslationOf: Jude

Pharisäer
type: Concept
in scheme: travel!digital Thesaurus
preferred label: peruschim @he
pref label: Pharisäer
pref label: peruschim
definition: Duden: 1. Angehöriger einer altjüdischen, die religiösen Gesetze streng einhaltenden Bewegung | Meyers Großes Konversations-Lexikon 1908: Pharisäer (kirchenlat. Pharisaei, hebr. Peruschim, »Abgesonderte«, von parasch, »spalten, trennen«, gleichsam »Sonderfromme«), eine der besonders im 1. vor- und 1. nachchristlichen Jahrhundert in Palästina existierenden drei Parteiungen (P., Sadduzäer und Essäer), die eigentliche nationale Partei unter den Juden, in der Zeit der Makkabäerherrschaft aus dem Bestreben entstanden, alles echt Israelitische von dem Abgefallenen und Heidnischen zu trennen und um einen festen Kern zu sammeln. In politischer Hinsicht waren die P. unbedingte Theokraten, zugleich die Patrioten, die ihres Volkes Unabhängigkeit erstrebten, deshalb heftige Gegner der Herodianer; in religiöser hielten sie streng an dem altväterlichen Glauben und an den Überlieferungen der Vorzeit fest. Sie waren die schriftgelehrten Führer der großen Mehrheit des Volkes und zählten zu Herodes' Zeiten 6000 Mitglieder. Im Zeitalter Jesu teilten sie sich in mehrere Schulen, unter denen die des Hillel und Schammai, jene den gemäßigten, diese den strengen Pharisäismus repräsentierend, die berühmtesten waren. Die zwischen diesen Schulen streitigen Fragen betrafen die Auslegung des mosaischen Gesetzes für die Praxis des Lebens und berührten ebensowohl das bürgerliche Recht wie das religiöse Zeremoniell. Der Pharisäismus nahm die überkommene fromme Übung ganz, wie sie einmal war, in den Begriff der »Gerechtigkeit« auf und schuf daraus eine das ganze Leben des Volkes auf Schritt und Tritt, vom Morgen bis zum Abend, von der Geburt bis zum Grab regulierende Norm, die immer nur neue Zusätze erfuhr, aber keinerlei Abbruch vertragen konnte. Dogmatisch wie politisch unterschieden sich die P. von den Sadduzäern: in letzterer Beziehung als die Vertreter der Volkspartei gegenüber dem herrschenden Priesteradel, in ersterer als die Träger und Fortbildner der Tradition gegenüber dem vornehm auf das…

Pharisäer
type: Label
in scheme: travel!digital Thesaurus
hasTranslation: peruschim

peruschim
type: Label
in scheme: travel!digital Thesaurus
isTranslationOf: Pharisäer

Judengemeinde
type: Label
in scheme: travel!digital Thesaurus

Sephardim
type: Concept
pref label: Sephardim
in scheme: travel!digital Thesaurus
alt label: Sephardim-Jude
alt label: Sefardim
definition: Duden: Sephardi: von der Iberischen Halbinsel oder aus dem Orient stammender Jude
alternative label: Sefardim
alternative label: Sephardim-Jude

Sephardim
type: Label
in scheme: travel!digital Thesaurus
hasVariant: Sefardim

Sefardim
type: Label
in scheme: travel!digital Thesaurus
isVariantOf: Sephardim

Sephardim-Jude
type: Label
in scheme: travel!digital Thesaurus

Judentum
type: Concept
pref label: Judentum
in scheme: travel!digital Thesaurus
definition: Duden: 1. Gesamtheit der Juden in ihrer religions- und volksmäßigen Zusammengehörigkeit; jüdisches Volk | 2. Judaismus | 3. a. Gesamtheit der durch Religion, Kultur, Geschichte geprägten jüdischen Eigenschaften, Eigenheiten; jüdisches Wesen | b. Zugehörigkeit, Gefühl der Zugehörigkeit zum jüdischen Volk, zur jüdischen Religion; das Judesein | Meyers Großes Konversations-Lexikon 1907: Judentum (jüdische, israelitische, auch mosaische Religion) bezeichnet den religiösen und sittlichen Lehrinhalt des Alten Testaments, der in dem spätern, daran sich anschließenden Schrifttum, wie überhaupt in dem Geistesleben der Judenheit seine Ausgestaltung erlangt hat. Die letzten Wurzeln des Judentums führen schon auf die Stammväter, die Vorbilder des Glaubens, Duldens und Kämpfens, die Träger des monotheistischen Gedankens, der, wie ihr Familienleben, ein charakteristisches Moment der jüdischen Religion ist. Sie erhält nach der Erlösung Israels aus Ägypten und der ihm zuteil gewordenen sinaitischen Offenbarung in dem nach allen Seiten hin ausgebildeten Gesetz seinen umspannenden Rahmen. Die Grundidee dieses Glaubens ist der Monotheismus. Er lehrt einen einzigen, universalistischen Gott, den Schöpfer, Leiter und Richter der Welt, und diese Lehre wird von der geschichtlichen Erfahrung befestigt. Dieser Gott will, daß der in seinem Ebenbild, d. h. mit einer freien, zurechnungsfähigen Seele geschaffene Mensch heilig werde, sich durch den Wandel in Ehrfurcht, Liebe und Gerechtigkeit zur sittlichen Vollkommenheit hinanarbeite. Nach diesen Grundgedanken, welche die Bibel und das jüdische Schrifttum durchziehen, regelt sich das Leben Israels, auf ihnen erheben sich die religiösen Institutionen, sie offenbaren sich in der theokratischen Verfassung, den Staats-, Priester- und Tempelgesetzen, im Kultus, den ritualen, sanitären und volkswirtschaftlichen Vorschriften, in der Lehre vom Messias und der Unsterblichkeit der Seele, wie in allen ethischen Forderungen. Mit der Einwanderung der Israeli…

Judentum
type: Label
in scheme: travel!digital Thesaurus

Spaniole
type: Concept
pref label: Spaniole
in scheme: travel!digital Thesaurus
definition: Duden: Nachkomme der 1492 aus Spanien vertriebenen Juden | Meyers Großes Konversations-Lexikon 1909: Spaniōlen (v. ital. Spagnuolo, span. Español, franz. Espagnol), soviel wie Spanier; insbes. Bezeichnung für die Nachkommen jener spanischen Juden, die, etwa 160,000 Köpfe stark, 1492 aus Spanien vertrieben, in der Türkei ein Asyl fanden (vgl. Juden, S. 329). Mit der osmanischen Invasion gelangten die Nachkommen dieser Emigranten, mit Vorliebe die Verpflegung des Heeres oder den Dienst der Ärzte besorgend, bis nach Ungarns Hauptstadt, von wo sie mit der Zurückdrängung der Türken im 17. und 18. Jahrh. wieder zurückkamen. Als »sephardische Juden« sondern sie sich scharf von den eingewanderten österreichisch-ungarischen Glaubensgenossen durch Tracht, Sitten und namentlich ihre Sprache. Sie sprechen heute noch Spanisch, das freilich im gewöhnlichen Verkehr mit Slawisch und Türkisch stark vermischt ist; angeblich verstehen sie besser einen heutigen Portugiesen als einen Spanier. Die S. widmen sich nicht bloß dem Handel, sondern auch dem Handwerk und sind zu steigendem Wohlstand namentlich in Sarajevo gelangt, wo sie eine Zeitlang auch eine eigne Zeitung: »La Alborada« (»Der Tagesanbruch«), herausgaben. | Quelle: Meyers Großes Konversations-Lexikon, Band 18. Leipzig 1909, S. 674. | Permalink: http://www.zeno.org/nid/20007497741

Spaniole
type: Label
in scheme: travel!digital Thesaurus

Aschkenazim
type: Concept
in scheme: travel!digital Thesaurus
pref label: Aschkenazim
definition: Duden: Aschkenasim: die ost- und mitteleuropäischen Juden |

Aschkenazim
type: Label
in scheme: travel!digital Thesaurus

Judenmädchen
type: Concept
definition: bdk: siehe Jude
in scheme: travel!digital Thesaurus
pref label: Judenmädchen

Judenmädchen
type: Label
in scheme: travel!digital Thesaurus

Judenschaft
type: Label
in scheme: travel!digital Thesaurus

Chasidim
type: Concept
pref label: Chasidim
in scheme: travel!digital Thesaurus
related match: Hasidic Judaism
definition: Duden: Chassidismus: im 18. Jahrhundert entstandene religiöse Bewegung des osteuropäischen Judentums, die eine lebendige Frömmigkeit anstrebt | Brockhaus' Kleines Konversations-Lexikon 1911: Chasidīm (d.i. Fromme), Chasidäer, die Anhänger des Judas Makkabi im Kampfe gegen die Syrer, dann überhaupt gesetzeseifrige Juden; jüd. Sekte, gestiftet um 1750 von Israel aus Miedziboz in Podolien, gewöhnlich Baal-Schem (Wundertäter), abgekürzt Bescht genannt. Die danach benannten Beschtianer bestehen noch unter drei Häuptern (Zaddikim oder Rebbes) in Galizien, Rußland und Rumänien. | Quelle: Brockhaus' Kleines Konversations-Lexikon, fünfte Auflage, Band 1. Leipzig 1911., S. 327. | Permalink: http://www.zeno.org/nid/20001007785

Chasidim
type: Label
in scheme: travel!digital Thesaurus

Volk Israel
type: Label
in scheme: travel!digital Thesaurus

Israelit
type: Label
in scheme: travel!digital Thesaurus

spanisch
type: Concept
pref label: español
narrower: venezianisch-spanisch
narrower: spanisch-katholisch
narrower: spanisch-maurisch
narrower: nordspanisch
narrower: spanisch-amerikanisch
pref label: spanisch
narrower: südspanisch
in scheme: travel!digital Thesaurus
definition: Duden: Spanien, die Spanier betreffend; von den Spaniern stammend, zu ihnen gehörend | [Anm.: unvollständig: Spanien, die Spanier betreffend; von den Spaniern stammend, zu ihnen gehörend; in Spanien gelegen]
related: Spanier
narrower: spanisch-kreolisch
pref label: spanish
narrower: spanisch-portugiesisch
alt label: altspanisch
narrower: spanisch-holländisch
narrower: spanisch-jüdisch
preferred label: spanish @en
preferred label: español @es
alternative label: altspanisch

español
type: Label
isTranslationOf: spanisch
in scheme: travel!digital Thesaurus
hasTranslation: spanish

spanisch
type: Label
hasTranslation: español
in scheme: travel!digital Thesaurus
hasTranslation: spanish

spanish
type: Label
isTranslationOf: spanisch
in scheme: travel!digital Thesaurus
hasTranslation: español

venezianisch-spanisch
type: Concept
in scheme: travel!digital Thesaurus
definition: bdk: siehe venezianisch, spanisch
pref label: venezianisch-spanisch

venezianisch-spanisch
type: Label
in scheme: travel!digital Thesaurus

spanisch-katholisch
type: Concept
definition: bdk: siehe spanisch, katholisch
in scheme: travel!digital Thesaurus
pref label: spanisch-katholisch

spanisch-katholisch
type: Label
in scheme: travel!digital Thesaurus

spanisch-maurisch
type: Concept
pref label: spanisch-maurisch
in scheme: travel!digital Thesaurus
definition: bdk: siehe spanisch, maurisch

spanisch-maurisch
type: Label
in scheme: travel!digital Thesaurus

nordspanisch
type: Concept
in scheme: travel!digital Thesaurus
pref label: nordspanisch
definition: bdk: siehe spanisch

nordspanisch
type: Label
in scheme: travel!digital Thesaurus

spanisch-amerikanisch
type: Concept
in scheme: travel!digital Thesaurus
definition: bdk: siehe spanisch, amerikanisch
pref label: spanisch-amerikanisch

spanisch-amerikanisch
type: Label
in scheme: travel!digital Thesaurus

südspanisch
type: Concept
in scheme: travel!digital Thesaurus
pref label: südspanisch
definition: bdk: siehe spanisch

südspanisch
type: Label
in scheme: travel!digital Thesaurus

Spanier
type: Concept
definition: Duden: Einwohnerbezeichnung | [Anm.: unvollständig: Einwohnerbezeichnung zu Spanien] | Duden: Spanien: Staat im Südwesten Europas | siehe auch: Meyers Großes Konversations-Lexikon 1909: Spanĭen | Quelle: Meyers Großes Konversations-Lexikon, Band 18. Leipzig 1909, S. 648-674. | Permalink: http://www.zeno.org/nid/20007497709
related match: Spain
pref label: Spanier
in scheme: travel!digital Thesaurus

Spanier
type: Label
in scheme: travel!digital Thesaurus

spanisch-kreolisch
type: Concept
definition: bdk: siehe spanisch, creolisch
in scheme: travel!digital Thesaurus
pref label: spanisch-kreolisch

spanisch-kreolisch
type: Label
in scheme: travel!digital Thesaurus

spanisch-portugiesisch
type: Concept
in scheme: travel!digital Thesaurus
definition: bdk: siehe spanisch, portugiesisch
pref label: spanisch-portugiesisch

spanisch-portugiesisch
type: Label
in scheme: travel!digital Thesaurus

altspanisch
type: Label
in scheme: travel!digital Thesaurus

spanisch-holländisch
type: Concept
in scheme: travel!digital Thesaurus
definition: bdk: siehe spanisch, holländisch
pref label: spanisch-holländisch

spanisch-holländisch
type: Label
in scheme: travel!digital Thesaurus

spanisch-jüdisch
type: Concept
definition: bdk: siehe spanisch, jüdisch
pref label: spanisch-jüdisch
in scheme: travel!digital Thesaurus

spanisch-jüdisch
type: Label
in scheme: travel!digital Thesaurus

javanisch
type: Concept
related: Javaner
pref label: javanisch
alt label: altjavanisch
narrower: mitteljavanisch
preferred label: javaasch @nl
in scheme: travel!digital Thesaurus
pref label: javaasch
alternative label: altjavanisch
definition: Duden: Java, die Javaner betreffend, von den Javanern stammend, zu ihnen gehörend | [Anm.: unvollständig: Java, die Javaner betreffend; von den Javanern stammend, zu ihnen gehörend; auf Java gelegen]

Javaner
type: Concept
related match: Java
in scheme: travel!digital Thesaurus
pref label: Javaner
definition: Duden: Einwohnerbezeichnung | [Anm.: unvollständig: Einwohnerbezeichnung zu Java] | Duden: Java: kleinste der Großen Sundainseln | Meyers Großes Konversations-Lexikon 1907: Java (Dschawa), kleinste der Großen Sundainseln, aber als reichste und am stärksten bevölkerte Hauptsitz der niederländischen Herrschaft im Indischen Archipel (s. Karte »Hinterindien«), zwischen 5°52' 30'' bis 8°46' 51'' südl. Br. und 105°13'–114°35' östl. L., im O. durch die schmale Balistraße von Bali, im W. durch die Sundastraße von Sumatra getrennt, an der Nordküste von der Javanischen See, im S. vom Indischen Ozean bespült, von W. nach O. 1060 km lang, zwischen 22 und 81 km breit und 125,622, mit Einschluß des nahen Madura und einiger kleinen Nebeninseln 131,508 qkm groß. [...] | [Bevölkerung.] Die Bevölkerung betrug 1897 mit Madura 26,125,053 Seelen; ihre Verteilung auf die 23 Residentschaften s. unten, S. 212. | Außer den Eingebornen gab es nur 52,000 Europäer, 261,000 Chinesen, 17,000 Araber, 3000 Hindu etc. Die Volksdichte betrug 195 Einw. auf 1 qkm. Die bedeutendsten Städte sind Batavia mit 114,596, Surabaja 124,529, Surakarta 104,589, Samarang 82,962, Pekalungan 36,816, Dschokdschokarta 28,299 Einw. Die Europäer sind meist Beamte und Soldaten, nächstdem Kaufleute, Pflanzer oder Zuckerfabrikanten und ebensowenig ständige Bewohner der Insel wie die Chinesen, die, in allen größern Orten zerstreut, besonders Handwerk und Kleinhandel treiben. Die Araber sind Kaufleute oder mohammedanische Priester. Die einheimische Bevölkerung gehört zur westlichen Abteilung der malaiischen Rasse und zerfällt in zwei Stämme, die trotz naher Verwandtschaft ganz verschiedene Sprachen reden: die Sundanesen im W., ein Mittelglied zwischen Malaien, Javanern und Batta, und die Javaner im O., das höchstgebildete Volk der ganzen malaiischen Rasse; zu ihnen gehören die Maduresen, die außer Madura nebst den umliegenden kleinern Inseln den Osten von J. bewohnen, wohin sie die Javaner zurückgedrängt haben (s. Tafel »As…

Javaner
type: Label
in scheme: travel!digital Thesaurus

javanisch
type: Label
hasTranslation: javaasch
in scheme: travel!digital Thesaurus

javaasch
type: Label
isTranslationOf: javanisch
in scheme: travel!digital Thesaurus

altjavanisch
type: Label
in scheme: travel!digital Thesaurus

mitteljavanisch
type: Concept
in scheme: travel!digital Thesaurus
pref label: mitteljavanisch
definition: bdk: siehe javanisch

mitteljavanisch
type: Label
in scheme: travel!digital Thesaurus

Hartâni
type: Concept
definition: bdk: ethnische Gruppe in Nordafrika
in scheme: travel!digital Thesaurus
pref label: Hartâni

Hartâni
type: Label
in scheme: travel!digital Thesaurus

Tamile
type: Concept
alternative label: Tamule
definition: Duden: Angehöriger eines vorderindischen Volkes | Meyers Großes Konversations-Lexikon 1909: Tamulen, höchststehender Zweig der Drawida, der in der vorderindischen Landschaft Karnatik (s. d. 1)[303] zwischen Madras und Kap Comorin, auch im nördlichen Ceylon wohnt, in kleinern Gruppen als Kling (s. d.) oder Kalinga in den Seestädten Hinterindiens und Indonesiens verbreitet ist. Die Zahl der T. beträgt in Britisch-Indien (1901) 16,525,500, davon in Madras allein 15,224,447; dazu kommen in Ceylon 750,000, in Ponditscherri und Karikal 200,000, in den Straits Settlements 53,500. Die T. sind meist unter Mittelgröße und von dunkler Hautfarbe; sie haben angenehme, aber etwas grobe Züge, weiches, lockiges Haar und große dunkle Augen (s. Tafel »Ostindische Kultur I«, Fig. 3). Die Sprache der T. (Tamil oder Tamulisch) wird von 14,8 Mill. Menschen gesprochen; sie besitzt eine eigne, aus dem Sanskritalphabet abgeleitete Schrift, dazu eine reichhaltige, alte Literatur und ist die reichste, am höchsten entwickelte und am frühesten kultivierte der Drawidasprachen. Ihre Literatur reicht mit ihren ältesten Denkmälern bis ins 10. Jahrh. n. Chr. zurück und enthält neben zahlreichen Übersetzungen aus den Sprachen des nördlichen Indien auch ausgezeichnete eigne Werke. Ihr berühmtestes ist der »Kural« (»Kurzzeiter«) von Tiruvalluvar, ein gnomisches Gedicht von 1330 kurzen Strophen, mit Sprüchen über die sittlichen Ziele des Menschen, voll zarter und wahrer Gedanken, aber ganz mit den Ideen des Buddhismus durchtränkt. Ausgaben des Gedichtes von Graul mit lateinischer Übersetzung in der »Bibliotheca tamulica« (Leipz. 1854–65, 4 Bde.) und von Pope (Lond. 1886); Proben tamulischer Dichtung gab in metrischer Übersetzung R. C. Caldwell (im »Indian Antiquary«, 1872). Eine Grammatik lieferte J. Lazarus (Lond. 1879), ein Elementarbuch Pope (7. Aufl., das. 1906); tamil-englische Lexika: Rottler (Madras 1834 bis 1841) und Winslow (das. 1862). Über die tamulische Schrift vgl. Burnell (in »Elements of …
pref label: Tamile
in scheme: travel!digital Thesaurus
alt label: Tamule

Tamile
type: Label
hasVariant: Tamule
in scheme: travel!digital Thesaurus

Tamule
type: Label
isVariantOf: Tamile
in scheme: travel!digital Thesaurus

Chaldäer
type: Concept
definition: Duden: Angehöriger eines aramäischen Volksstammes | Duden: Chaldäa: Babylonien | Meyers Großes Konversations-Lexikon 1905: Chaldäa, Chaldäer (griech. Chaldaioi, lat. Chaldaci, assyr. Kaldu, hebr. Kasdîm). Das Alte Testament nennt seit Jeremias die Bewohner von Babylon und Babylonien Kasdîm, »Chaldäer«, und »Land der Chaldäer« Babylonien. Gemäß den Keilinschriften hieß Kaldu (Chaldäer) ein Volk, das, mit der ältesten semitischen Bevölkerung Babyloniens nächst verwandt, etwa um den Anfang des 1. vorchristlichen Jahrtausends von Südbabylonien aus ganz Babylonien überschwemmte, zwischen die daselbst seßhaften Bewohner sich eindrängte, große und kleine Niederlassungen gründete und mit nimmer rastender Energie bestrebt war, sich zum alleinigen Herrn des Landes zu machen. Das Volk war in viele Stämme geteilt, deren mächtigster und einflußreichster »das Haus Jakins« war, wohnend im sogen. Meerland, im südlichsten Babylonien am Persischen Meerbusen. Der bedeutendste Chaldäerfürst assyrischer Zeit, Merodachbaladan (II.), gehörte diesem Hause Jakins an. Des Landes und Volkes Kaldu geschieht zuerst 879 zu Asurnazirpals Zeit kurze Erwähnung, und weiter unter Salmanassar II. (851), während dessen Regierung die Chaldäer bereits durch ganz Babylonien hin, sogar bis über Babylon hinaus, sich verbreitet hatten. Unter Tiglathpileser III. (745–727) gelang es dem »König« von Bit-Amukkan, namens Ukin-zer (der Chinzir des Ptolemäischen Kanons), sich zum König von Babylon zu machen (731–729). Besonders hartnäckige Kämpfe hatten Sargon und Sanherib mit Merodachbaladan II. zu bestehen, der als »König des Meeres« 731 Tiglathpileser III. seine Huldigung dargebracht, dann aber von 721–710 den Thron Babylons an sich gerissen hatte. Von den Elamiten unterstützt, bereiteten die Chaldäer den assyrischen Königen unausgesetzt die ernstesten Schwierigkeiten. Verhältnismäßige Ruhe herrschte unter Asarhaddon (681–669), aber schon unter Asurbanipal finden wir sämtliche Chaldäerstämme als Bundesgenossen v…
pref label: Chaldäer
related match: Chaldea
in scheme: travel!digital Thesaurus

Chaldäer
type: Label
in scheme: travel!digital Thesaurus

Däne
type: Concept
definition: Duden: Einwohnerbezeichnung zu Dänemark | Duden: Dänemark: Staat in Nordeuropa | siehe auch: Meyers Großes Konversations-Lexikon 1906: Dänemark | Quelle: Meyers Großes Konversations-Lexikon, Band 4. Leipzig 1906, S. 476-489. | Permalink: http://www.zeno.org/nid/20006464572
in scheme: travel!digital Thesaurus
pref label: Däne
related match: Denmark

Däne
type: Label
in scheme: travel!digital Thesaurus

Ätolier
type: Concept
definition: Duden: Angehöriger eines altgriechischen Stammes | Duden: Ätolien: altgriechische Landschaft | Meyers Großes Konversations-Lexikon 1905: Ätolien (s. Karte »Alt-Griechenland«), griech. Landschaft im W. von Mittelgriechenland, zwischen Akarnanien, dem Lande der Doloper, Änianen, Örtäer, dem ozolischen Lokris und dem Meer gelegen, an der Küste und dem Acheloos eben und fruchtbar, sonst wildes, waldbedecktes Gebirgsland. Als Hauptflüsse sind der Acheloos (Aspropotamos) an der Westgrenze und der Euenos (Phidaris), unter den Seen der Hyria und der Trichonis (See von Agrinion) zu nennen. Die ausgedehnten Weiden im zentralen Seebecken nährten treffliche Pferde. Der Name Ä. stammt von Ätolos her, der, aus Elis flüchtend, mit einer Schar Epeer im S. Ätoliens sich niederließ und die ungriechischen Leleger, Kureten und Hyanten verdrängte oder unterwarf. Durch feindselige Haltung den Nachbarn gegenüber sowie durch Verschmelzung mit nichtgriechischen Gebirgsvölkern entfremdeten sich die Ätolier dem übrigen Hellenentum, so daß sie in der Blütezeit griechischer Kultur als wilde, räuberische, von den Hellenen gemiedene Barbaren erscheinen. Erst in der makedonisch-römischen Periode greifen sie in die Geschichte Griechenlands tätig mit ein. Städte gab es wenige; die wichtigsten waren: Thermon, Kalydon, Pleuron und Chalkis. – Im heutigen Königreich Griechenland bildet Ä. mit Akarnanien (s. d.) einen Nomos. | Die Ätolier zerfielen von alters her in einzelne kleine Gemeinwesen, verteidigten aber ihr Land tapfer, wenn sie von außen bedroht wurden; so schlugen sie 426 den athenischen Feldherrn Demosthenes. Von Bedeutung für das übrige Griechenland wurden sie durch den Ätolischen Bund, zu dem sie der Einfall des [57] Antipatros wegen ihrer Beteiligung am Lamischen Krieg vereinigte (321). An seiner Spitze stand eine Versammlung mit einem Rate, den Vertretern der Bundesmitglieder, und einem Beamten, der im Krieg und im Frieden die höchste Gewalt ausübte. Bald schlossen sich ihm andre Staaten …
in scheme: travel!digital Thesaurus
pref label: Ätolier
related match: Aetolia
related match: Aetolian League

Ätolier
type: Label
in scheme: travel!digital Thesaurus

Pheresiter
type: Concept
definition: Brockhaus' Kleines Konversations-Lexikon 1911: Pheresīter (Peresiter), ein Teil der Kanaaniter, wohnten auf dem Gebirge Ephraim. | Quelle: Brockhaus' Kleines Konversations-Lexikon, fünfte Auflage, Band 2. Leipzig 1911., S. 398. | Permalink: http://www.zeno.org/nid/20001442481
pref label: Pheresiter
in scheme: travel!digital Thesaurus

Pheresiter
type: Label
in scheme: travel!digital Thesaurus

Kondh
type: Concept
in scheme: travel!digital Thesaurus
pref label: Kondh
definition: Meyers Großes Konversations-Lexikon 1907: Khond (Kondh, Kand), drawid. Volksstamm in Britisch-Indien, in den Bergwäldern von Orissa (Bengalen) und von Gandscham und Wizagapatam (Madras), in drei Klassen zerfallend: Betiah oder Söldlinge, Beniah, die eine Abgabe für das Ackerland zahlen, und Maliah, Bergbewohner in großer Unabhängigkeit. Früher ermordeten sie alle Mädchen gleich nach der Geburt und holten sich Weiber aus den Nachbarstämmen. Jetzt sind nur noch kleine Reste im ursprünglichen Zustand, viele haben sich mit den niedern Hindukasten vermischt, auch bilden sie ein Hauptkontingent der Truppen indischer Vasallenfürsten. Vgl. Campbell, Thirteen years service amongst the wild tribes of Khondistân (Lond. 1863); Smith, Grammar of the K. language (Cullack 1876). | Quelle: Meyers Großes Konversations-Lexikon, Band 10. Leipzig 1907, S. 877. | Permalink: http://www.zeno.org/nid/2000688945X

Kondh
type: Label
in scheme: travel!digital Thesaurus

Portugiese
type: Concept
definition: Duden: Einwohnerbezeichnung zu Portugal | Duden: Portugal: Staat im Südwesten Europas | siehe auch: Meyers Großes Konversations-Lexikon 1908: Portūgal | Quelle: Meyers Großes Konversations-Lexikon, Band 16. Leipzig 1908, S. 179-187. | Permalink: http://www.zeno.org/nid/20007277865
in scheme: travel!digital Thesaurus
related match: Portugal
pref label: Portugiese

Portugiese
type: Label
in scheme: travel!digital Thesaurus

Malteser
type: Concept
definition: Duden: 1. Einwohnerbezeichnung zu Malta | Duden: Malta: Inselstaat im Mittelmeer | siehe auch: Meyers Großes Konversations-Lexiko 1908: Malta | Quelle: Meyers Großes Konversations-Lexikon, Band 13. Leipzig 1908, S. 189-191. | Permalink: http://www.zeno.org/nid/20007042604
related match: Malta
pref label: Malteser
in scheme: travel!digital Thesaurus

Malteser
type: Label
in scheme: travel!digital Thesaurus

aragonisch
type: Concept
definition: Duden: Aragonien, die Aragonier betreffend | [Anm.: unvollständig: Aragonien, die Aragonier betreffend; von den Aragoniern stammend, zu ihnen gehörend; in Aragonien gelegen] | Duden: Aragonien: Region in Nordostspanien | Meyers Großes Konversations-Lexikon 1905: Aragonĭen (Aragon), einst selbständiges span. Königreich, welches den ganzen nordöstlichen Teil der Halbinsel einnahm und die sogen. aragonischen Provinzen Aragon, Katalonien und Valencia nebst der Balearengruppe umfaßte; jetzt spanische Landschaft mit dem Titel eines Königreichs, 47,391 qkm (860,9 QM.) groß mit (1900) 912,711 Einw., wird gegen N. von Frankreich, gegen W. von Navarra, Alt- und Neukastilien, gegen S. und O. von Valencia und Katalonien begrenzt. Der Aragonese haßt alles Fremde und zeichnet sich durch ein finsteres, rachsüchtiges, dabei bigottes Wesen aus. Zugleich aber besitzt er Patriotismus, Freiheitssinn, persönlichen Mut, Energie und Enthaltsamkeit. Die Männer sind meist groß, hager und sehr gebräunt, gute Soldaten und Jäger; die Frauen schön gewachsen, mit schwarzen Augen und reichem Lockenhaar. Der ursprüngliche rauhe Dialekt der Aragonesen hat sich allmählich mit dem kastilischen verschmolzen. A. zerfällt in die Provinzen Saragossa, Huesca und Teruel (s. diese Artikel). Hauptstadt des Landes ist Saragossa. [...] | Quelle: Meyers Großes Konversations-Lexikon, Band 1. Leipzig 1905, S. 664-665. | Permalink: http://www.zeno.org/nid/2000624548X
related match: Aragon
in scheme: travel!digital Thesaurus
pref label: aragonisch

aragonisch
type: Label
in scheme: travel!digital Thesaurus

vlämisch
type: Concept
alternative label: altflandrisch
related: Vlame
alt label: altflandrisch
pref label: vlämisch
in scheme: travel!digital Thesaurus
definition: Duden: die Flamen betreffend, von ihnen stammend, zu ihnen gehörend [Anm.: unvollständig: Flandern, die Flamen betreffend; von den Flamen stammend, zu ihnen gehörend; in Flandern gelegen]

Vlame
type: Concept
related match: Flanders
in scheme: travel!digital Thesaurus
pref label: Vlame
definition: Duden: Flame: Einwohnerbezeichnung zu Flandern | Duden: Flandern: 1. historische Landschaft an der Nordseeküste auf dem Gebiet der heutigen Staaten Belgien und Frankreich | 2. belgische Provinz | Meyers Großes Konversations-Lexikon 1906: Flandern (fläm. Vlaanderen, span. Flandes), ehemalige niederländische Grafschaft an der Nordsee, die an Zeeland, Brabant, Hennegau, die Pikardie und Artois grenzte und jetzt teils zu Belgien (nämlich das ehemalige österreichische F., gegenwärtig die zwei Provinzen Ostflandern und Westflandern bildend, s. unten), teils zu den Niederlanden (der südliche Teil der Provinz Zeeland, das sogen. Staatsflandern, mit den Städten Sluys, Hulst, Axel etc.), teils zu Frankreich gehört, wo es einen Teil des jetzigen Departements Nord bildet, und in Seeflandern, vom Meere bis zur Lys, und Wallonisch-F., von der Lys bis zur Scarpe, zerfiel. Die spätere französische Provinz F. umfaßte dazu noch die Landschaften Cambrésis und Hainaut. [...] | Quelle: Meyers Großes Konversations-Lexikon, Band 6. Leipzig 1906, S. 660-661. | Permalink: http://www.zeno.org/nid/20006614299

Vlame
type: Label
in scheme: travel!digital Thesaurus

altflandrisch
type: Label
in scheme: travel!digital Thesaurus

vlämisch
type: Label
in scheme: travel!digital Thesaurus

Temîm
type: Concept
definition: bdk: Stammesgemeinschaft in Arabien
pref label: Temîm
in scheme: travel!digital Thesaurus

Temîm
type: Label
in scheme: travel!digital Thesaurus

Ungarin
type: Concept
related: Ungar
pref label: Ungarin
in scheme: travel!digital Thesaurus
definition: Duden: weibliche Form zu Ungar

Ungarin
type: Label
in scheme: travel!digital Thesaurus

Normanne
type: Concept
definition: Duden: Angehöriger eines nordgermanischen Volkes | Meyers Großes Konversations-Lexikon 1908: Normannen (»Nordmannen«), die germanische Bevölkerung Skandinaviens, vorzugsweise aber jene kühnen Seeräuberscharen, die von den skandinavischen Küsten aus geraume Zeit die Küsten des Abendlandes heimsuchten und von den Deutschen und Franzosen N., von den Engländern Dänen, von den Iren Ostmannen genannt wurden. Die Veranlassungen zu jenen Raubzügen, welche die normannischen »Wikingar«, d.h. Krieger, unter Anführern (See- oder Heerkönigen) in kleinen Schiffen (s. Tafel »Schiffstypen I«, Fig. 5 u. 6) über das Meer unternahmen, waren die Unfruchtbarkeit der Heimat, das Erbrecht, das die jüngern Söhne auf Seeraub und Heerfahrten anwies, dann auch die angestammte Lust an Waffenruhm, Abenteuern und Beute, endlich auch Unzufriedenheit mit der Begründung der zentralisierenden Königsherrschaften in Skandinavien. Ihre Schiffe, die »Wellenrosse« oder »Meeresdrachen«, waren so klein, daß die N. auf ihnen die Flüsse hinauszufahren vermochten; und auf diesen winzigen, selbst des Verdecks entbehrenden Fahrzeugen trotzten sie den Gefahren der nordischen Meere. Bald begannen sie an den Mündungen der Flüsse und auf Inseln feste Niederlassungen zu gründen, und, zu größern Kriegsheeren vereinigt, wurden sie kühne Eroberer und Gründer neuer Reiche. [...] | Quelle: Meyers Großes Konversations-Lexikon, Band 14. Leipzig 1908, S. 784-786. | Permalink: http://www.zeno.org/nid/20007163096
in scheme: travel!digital Thesaurus
pref label: Normanne

Normanne
type: Label
in scheme: travel!digital Thesaurus

Kelte
type: Concept
definition: Duden: Angehöriger eines indogermanischen Volkes | Meyers Großes Konversations-Lexikon 1907: Kelten (Celti, Celtae), Name eines Volkes des indogermanischen Sprachstammes. Wie der Name Germanen, ist auch der der K. nicht in der eignen Sprache des Volkes überliefert und würde auf keltisch Celtos, Mehrz. Celti, heißen, was sich mit dem lateinischen celsus, celsi lautlich und begrifflich deckt, also die Erhabenen bedeutet, während Galli (s. Gallien) von einer keltischen Wurzel gal abgeleitet wird, wovon die Bezeichnungen des Kampfes und der Waffen gebildet sind; Galli heißt also Kämpfer. Innerhalb der indogermanischen Sprachfamilie nehmen die K. zwischen Italikern und Germanen eine Mittelstellung ein (s. Keltische Sprachen). Während der Name K. die Gesamtheit aller die keltische Sprache sprechenden Stämme umfaßt, wird der Name Gallier im Altertum hauptsächlich von den keltischen Bewohnern Frankreichs und Italiens gebraucht; Galatae (Galater) werden die nach Kleinasien vorgedrungenen K. genannt. Die K. wohnten in ältester Zeit, in viele Stämme zerspalten, im W. Europas, in Gallien und Britannien. Ohne Anhänglichkeit an die eigne Scholle, liebten sie das Wanderleben. Die ältesten Auswanderungen gingen nach Spanien, wo sich die Eindringlinge nach heißen Kämpfen mit den schon vorhandenen Iberern zu Einem Volke, den Keltiberern, verbanden. Aber auch unvermischt wohnten in diesem Lande keltische Stämme. Herodot, Aristoteles und Hipparch rechneten wegen der großen Zahl eingewanderter K. Spanien zum Land Keltika. Nach 600 v. Chr. wurden die Auswanderungen, besonders nach Italien, häufiger, deren weiterm Vordringen sich im 4. Jahrh. die Römer mit Erfolg widersetzten. Da der Zudrang der keltischen Stämme in das überfüllte Oberitalien (Gallia cisalpina) fortdauerte, so wandte sich ein Teil weiter gegen O. und nahm Pannonien etc. ein; Krain, Kärnten, Steiermark, Österreich, das westliche Ungarn, Slawonien, Kroatien, Serbien und Bosnien wurden von den kriegerischen K. erobert. Auch …
in scheme: travel!digital Thesaurus
pref label: Kelte

Kelte
type: Label
in scheme: travel!digital Thesaurus

chaldäisch
type: Concept
definition: Duden: Chaldäa, die Chaldäer betreffend; von den Chaldäern stammend, zu ihnen gehörend | [Anm.: unvollständig: Chaldäa, die Chaldäer betreffend; von den Chaldäern stammend, zu ihnen gehörend; in Chaldäa gelegen]
related: Chaldäer
in scheme: travel!digital Thesaurus
pref label: chaldäisch
related: babylonisch

chaldäisch
type: Label
in scheme: travel!digital Thesaurus

babylonisch
type: Concept
definition: Duden: Babylon, die Babylonier betreffend | [Anm.: unvollständig: Babylon/Babylonien, die Babylonier betreffend; von den Babyloniern stammend, zu ihnen gehörend; in Babylon/Babylonien gelegen]
related: Babylonier
in scheme: travel!digital Thesaurus
pref label: babylonisch
narrower: babylonisch-assyrisch

Babylonier
type: Concept
definition: Duden: Einwohnerbezeichnung | [Anm.: unvollständig: Einwohnerbezeichnung zu Babylon] | Duden: Babylon: Ruinenstadt am Euphrat | Duden: Babylonien: antikes Reich zwischen Euphrat und Tigris | Meyers Großes Konversations-Lexikon 1905: Babylon (Babel, keilschriftlich Bāb-ilu, »Pforte Gottes«), erwähnt bereits in der Zeit Sargons I., Hauptstadt Gesamtbabyloniens seit Hammurabi (um 2250), von Sanherib 689 von Grund aus zerstört, von Asarhaddon und später hauptsächlich von Nebukadnezar (604–561) neu gegründet, gebaut und befestigt, eine der ältesten, größten und prächtigsten Städte der Alten Welt, seit zwei Jahrtausenden in Trümmern liegend. Nach der Schilderung Herodots (1,178 ff.), der das B. Nebukadnezars und seiner Nachfolger beschreibt und Babylons Schwesterstadt Borsippa mit unter B. begreift, erstreckte sich die Stadt auf beiden Seiten des Euphrat in Form eines Vierecks, von dessen Seiten jede eine Länge von 120 Stadien (22 km) hatte. Das ungeheure Ganze hätte also einen Raum von ca. 490 qkm (viermal mehr als London) bedeckt und wäre von einer 200 Ellen hohen und 50 Ellen dicken Mauer mit 100 ehernen Toren umschlossen gewesen. Außer dieser äußern waren noch eine innere Mauer sowie eine Mauer längs der beiden Ufer des Euphrat vorhanden. Eine steinerne Brücke führte über den Euphrat. Die Stadt wurde von lauter geraden Straßen mit zum Teil drei- und vierstöckigen Häusern gebildet. In dem einen Teile der Stadt (am linken Euphratufer, da, wo jetzt der Trümmerhügel Kasr sich erhebt) lag »die Königsburg innerhalb einer großen und starken Umfassungsmauer«, d. h. der von Nabopolassar gebaute und von Nebukadnezar restaurierte und verschönerte königliche Palast. In dem andern Teile der Stadt, also in ihrer Westhälfte auf der rechten Euphratseite. befand sich das Heiligtum des Zeus Belos mit ehernen Toren, »ein Viereck im Umfang von 2 Stadien auf jeder Seite«, und inmitten dieses Heiligtums erhob sich »ein Turm in der Länge und Breite eines Stadiums, und auf diesem andre Türme…
pref label: Babylonier
related match: Babylonia
in scheme: travel!digital Thesaurus

Babylonier
type: Label
in scheme: travel!digital Thesaurus

babylonisch
type: Label
in scheme: travel!digital Thesaurus

babylonisch-assyrisch
type: Concept
in scheme: travel!digital Thesaurus
definition: bdk: siehe babylonisch, assyrisch
pref label: babylonisch-assyrisch

babylonisch-assyrisch
type: Label
in scheme: travel!digital Thesaurus

äthiopisch
type: Concept
related match: Ethiopia
in scheme: travel!digital Thesaurus
definition: Duden: Äthiopien, die Äthiopier betreffend; von den Äthiopiern stammend, zu ihnen gehörend | [Anm.: unvollständig: Äthiopien, die Äthopier betreffend; von den Äthiopiern stammend, zu ihnen gehörend; in Äthiopien gelegen] | Duden: Äthiopien: Staat in Ostafrika | Meyers Großes Konversations-Lexikon 1905: Äthiōpien (hebr. Kusch), alter geographischer Name, im weitern Sinne soviel wie Südland, wohin man die Äthiopier (d. h. die schwarzen Völker) versetzte; im engern das südlich von Ägypten am Nil aufwärts gelegene Land zwischen Dar Fur und dem Arabischen Meerbusen, also das-heutige Nubien und Abessinien. Herodot teilt die Äthiopier in östliche, schlichthaarige (die braunen Völker am mittlern Nil mit einem der weißen Rasse zunächst stehenden körperlichen und sprachlichen Typus) und westliche, wollhaarige (Neger). Während die letztern die tiefste Stufe menschlicher Kultur einnehmen, gelten ihm die von den östlichen Äthiopiern bewohnten Länder am obern Nil als Sitze uralter Zivilisation. Als zu den östlichen Äthiopiern gehörige Völkerschaften nennt er die Makrobier (Langlebenden), die Ichthyophagen (Fischesser) und die Troglodyten (Höhlenbewohner) und als Hauptstadt Äthiopiens Meroë (Begerawîje). Genauere Nachrichten geben spätere Schriftsteller, namentlich Ptolemäos, der zuerst den Nigerfluß und eine große Anzahl sonst unbekannter äthiopischer Völker anführt, aber als Hauptstadt Auxumis (Axum) bezeichnet. Nach Plinius bildete der Nil die Grenze zwischen dem östlichen und westlichen Ä. Späterhin übertrug man den Namen Ä. auf die christlichen Reiche in Abessinien; daher versteht man unter den äthiopischen Christen die heutigen christlichen Abessinier, deren alte (semitische) Schriftsprache, das Geez (Ge es), man die äthiopische zu nennen pflegt (s. Äthiopische Sprache und Literatur). Die vorhandenen äthiopischen Altertümer am mittlern Nil geben Zeugnis von der hohen Kultur jener Völker. Auf dem rechten Ufer des Stromes, oberhalb der Einmündung des Atbara, liegen die Trümmer…
pref label: äthiopisch
alternative label: altäthiopisch
narrower: äthiopisch-ägyptisch
alt label: altäthiopisch

äthiopisch
type: Label
in scheme: travel!digital Thesaurus

äthiopisch-ägyptisch
type: Concept
definition: bdk: siehe äthiopisch, ägyptisch
in scheme: travel!digital Thesaurus
pref label: äthiopisch-ägyptisch

äthiopisch-ägyptisch
type: Label
in scheme: travel!digital Thesaurus

altäthiopisch
type: Label
in scheme: travel!digital Thesaurus

Irokese
type: Concept
preferred label: iroquois @en
in scheme: travel!digital Thesaurus
definition: Duden: Angehöriger eines nordamerikanischen Indianerstammes | Meyers Großes Konversations-Lexikon 1907: Irokēsen (franz. u. engl. Iroquois), gemeinsamer Name für eine Gruppe sprachlich verwandter Indianerstämme, die zur Zeit der Entdeckung Amerikas an beiden Ufern des Lorenzstromes und im heutigen Staate New York wohnten und sich durch geistige Begabung, Pflege des Ackerbaues und der Künste und entwickeltes Regierungssystem auszeichneten. Sie zerfielen in eine nördliche und eine südliche Gruppe, deren erstere sich wieder in eine östliche und westliche Abteilung spaltete. Zu letzterer gehörte der berühmte Fünfvölkerbund, durch den in der Mitte des 15. Jahrh. der Onondagahäuptling Hiawatha (s. d.) seinen Stamm mit den Mohawk, Oneida, Cayuga und Seneca verband. Im Anfang des 18. Jahrh. gelangte der Bund durch Besiegung der Algonkin und der mit ihnen verbündeten, zur westlichen Gruppe der I. gehörigen Huronen (s. d.) und durch die Aufnahme der Tuscarora,[26] eines südlichen Irokesenstammes, als sechste Nation (1712) auf den Gipfel seiner Macht. Um 1776 wanderten die Mohawk nach Kanada aus, ihnen folgten die Tuscarora und Oneida. Überreste der sechs Nationen finden sich noch in Kanada, im Staat New York und in Reservationen westlich vom Mississippi. Die Gesamtzahl aller I. beträgt über 17,000, darunter gegen 7500 in den Vereinigten Staaten. Die Sprache der I. hat der Abbé Cuoq lexikalisch bearbeitet (Montreal 1882). Vgl. Morgan, League of the Hodenosaunee or Iroquois (Rochest. 1854); Schoolcraft, Notes on the Iroquois (Albany 1847); Hale, The Iroquois book of rites (Philad. 1883); Donaldson, The six nations of New York (Washington 1892); Canfield, The legends of the Iroquois (neue Ausg., New York 1902). | Quelle: Meyers Großes Konversations-Lexikon, Band 10. Leipzig 1907, S. 26-27. | Permalink: http://www.zeno.org/nid/20006828329
pref label: Irokese
related: Indianer
pref label: iroquois

Irokese
type: Label
hasTranslation: iroquois
in scheme: travel!digital Thesaurus

iroquois
type: Label
isTranslationOf: Irokese
in scheme: travel!digital Thesaurus

Libyer
type: Concept
related match: Libya
definition: Duden: Einwohnerbezeichnung | [Anm.: unvollständig: Einwohnerbezeichnung zu Libyen] | Duden: Libyen: Staat in Nordafrika | Meyers Großes Konversations-Lexikon 1908: Libyen, Name für Afrika, wie er schon bei Homer vorkommt, und wie ihn die Griechen von den Ägyptern für das Land westlich vom Niltal (Libu) erfahren haben. Noch Hekatäos sah dasselbe als den westlichen Teil Asiens an. Erst in der hellenistischen Zeit wird der Name L. auch auf das Land östlich des Nils bis zum Arabischen Meerbusen ausgedehnt. | Quelle: Meyers Großes Konversations-Lexikon, Band 12. Leipzig 1908, S. 509. | Permalink: http://www.zeno.org/nid/20007000189
pref label: Libyer
in scheme: travel!digital Thesaurus

Libyer
type: Label
in scheme: travel!digital Thesaurus

Manasse
type: Concept
related match: Tribe of Joseph
definition: Meyers Großes Konversations-Lexikon 1908: Manasse, 1) erster Sohn Josephs und der Priestertochter von Heliopolis, Asnath, in Ägypten geboren, älterer Bruder Ephraims, von Jakob in Kindesrechte eingesetzt, daher Ahnherr eines der zwölf Stämme, der stets neben Ephraim genannt wird und dessen einer Teil, »Halbmanasse«, im Ostjordanland sich angesiedelt hatte (s. das Textkärtchen beim Artikel »Juden«, S. 331). | 2) König von Juda, Sohn und Nachfolger Hiskias, bestieg als zwölfjähriger Knabe den Thron 698, regierte bis 642. Er huldigte heidnischem Kultus, wie dem babylonischen Sterndienst, errichtete auf Zion der Astarte und im Tal Hinnom dem Moloch, dem er seinen Sohn opferte, Altäre. Grausam verfolgte er die Propheten. Der Sage nach ließ er Jesaias töten. Nach außen sank die Macht des Reiches, die benachbarten Stämme machten sich unabhängig, und die Angabe 2. Chron. 33,1–20, daß er von den Assyrern als Gefangener nach Babylon abgeführt worden, in der Gefangenschaft geläutert sei und nach seiner Rückkehr besser regiert habe, ist nicht unwahrscheinlich. Auch zeigte sich im Volk eine Wendung zum Bessern. In der letzten Zeit seiner Herrschaft sicherte M. das Reich durch Befestigungen und durch ein Bündnis mit Ägypten. Das Gebet Manasses, ein in manchen Handschriften der Septuaginta vorhandener Bußpsalm, ist unecht und gilt auch der katholischen Kirche nicht für kanonisch. | Quelle: Meyers Großes Konversations-Lexikon, Band 13. Leipzig 1908, S. 202. | Permalink: http://www.zeno.org/nid/20007043910
pref label: Manasse
in scheme: travel!digital Thesaurus

Manasse
type: Label
in scheme: travel!digital Thesaurus

Lyder
type: Concept
related match: Lydia
definition: Duden: Einwohner Lydiens | Duden: Lydien: historische Landschaft in Kleinasien | Meyers Großes Konversations-Lexikon 1908: Lydĭen (ursprünglich Mäonia), im Altertum Landschaft an der Westküste Kleinasiens, welche die heutigen Liwas Saruchan und Syghla umfaßte, grenzte gegen N. an Mysien, von dem es der Temnos (Demirdschi Dagh) trennte, gegen O. an Phrygien, gegen S. an Karien, wovon es das Gebirge Messogis (Güme Dagh) schied, und gegen W. an das Ägäische Meer. Im Innern erhebt sich der Tmolos (Bos Dagh) mit seinen westlichen Fortsetzungen Drakon (Mahmud Dagh) und Sipylos (Manisa Dagh). Zwischen diesen Gebirgen breiten sich große, fruchtbare Ebenen aus, das Kilbianische Gefilde am obern Kaystros, das Kaystrische zu beiden Seiten des Kaystros und das Hyrkanische nördlich vom Sipylos. Die sogen. Katakekaumene (d.h. die »verbrannte« Gegend) im O. ist öde, unfruchtbar und trägt vielfach Spuren früherer vulkanischer Tätigkeit. Als Flüsse sind zu nennen: der Hermos (Gediz-tschai) mit den Nebenflüssen Hyllos, Kogamos und Paktolos, und der schon erwähnte Kaystros (Kütschük-Menderez). Die Hauptprodukte waren: Wein, Safran, Gold, das in den Gruben des Tmolos und dem Sande des Paktolos gewonnen wurde. Die Bewohner des Binnenlandes, die Lydier (die Küste war von Äoliern und Ioniern besetzt), waren vermutlich von O. her eingewanderte Eroberer semitischen Stammes, die hier mit einem ältern phrygischen Volk arischer Abkunft verwuchsen. Andre halten die Lydier für thrakischen Stammes. Unternehmend,[894] kaufmännisch und gewerbfleißig, wurden sie auf dem Landweg die Vermittler zwischen Hellas und Vorderasien. S. Karte »Alt-Griechenland«. – Anfangs herrschten in L. die zwei mythischen Geschlechter der Atyaden und Herakliden (Sandoniden), denen 687 v. Chr. mit Gyges die kräftigern Mermnaden folgten. Den Grund zu Lydiens Größe legte der vierte König dieser Dynastie, Alyattes (612–563), durch die Vertreibung der Kimmerier aus Kleinasien u. durch die Vernichtung des phrygischen Reiches; s…
in scheme: travel!digital Thesaurus
pref label: Lyder

Lyder
type: Label
in scheme: travel!digital Thesaurus

norwegisch
type: Concept
in scheme: travel!digital Thesaurus
related: Norweger
pref label: norwegisch
definition: Duden: Norwegen, die Norweger betreffend; aus Norwegen stammend | [Anm.: unvollständig: Norwegen, die Norweger betreffend; von den Norwegern stammend, zu ihnen gehörend; in Norwegen gelegen]

Norweger
type: Concept
definition: Duden: 1. Einwohnerbezeichnung | [Anm.: unvollständig: Einwohnerbezeichnung zu Norwegen] | Duden: Norwegen: Staat in Nordeuropa | siehe auch: Meyers Großes Konversations-Lexikon 1908: Norwegen | Quelle: Meyers Großes Konversations-Lexikon, Band 14. Leipzig 1908, S. 791-804. | Permalink: http://www.zeno.org/nid/20007163754
in scheme: travel!digital Thesaurus
pref label: Norweger
related match: Norway

Norweger
type: Label
in scheme: travel!digital Thesaurus

norwegisch
type: Label
in scheme: travel!digital Thesaurus

abessinisch
type: Concept
definition: Duden: Abessinien betreffend; die Abessinier, Abessinierinnen betreffend | [Anm.: unvollständig: Abessinien, die Abessinier betreffend; von den Abessiniern stammend, zu ihnen gehörend; in Abessinien gelegen]
related: Abessinier
in scheme: travel!digital Thesaurus
pref label: abessinisch

Abessinier
type: Concept
definition: bdk: Einwohnerbezeichnung zu Abessinien | Duden: Abessinien: ältere Bezeichnung für Äthiopien | Meyers Großes Konversations-Lexikon 1905: Abessinien (Abyssinien; s. Karte »Ägypten etc.«), Reich im nordöstlichen Afrika, in Ägypten und Nubien Beled el Habesch oder Beled el Habscha, im abessinischen Hofstil Aitiopya genannt. Der Name A. wird abgeleitet von dem Worte Habesch (Habasch), womit die Araber das Völkergemisch jenes Berglandes bezeichnen wollten. Das eigentliche A. erstreckt sich vom 15. bis über den 10.° nördl. Br. hinaus und vom 40.° östl. L. bis zum Westabfall des Hochlandes. Die Ansprüche des Herrschers dehnen sich jetzt auf folgende Länder aus: [...] | [Bevölkerung.] Als Ureinwohner des abessinischen Alpenlandes sind die Agau (s. d.) anzusehen, die noch heute den Grundstock der ganzen dortigen Bevölkerung bilden. Unverfälscht wohnen sie noch in der Provinz Agameder und in der eigentlichen Provinz Agau. Ihnen nahe stehen die Falascha (s. d.) und die heidnischen Gamant. Über das Rote Meer drangen südsemitische Stämme, die Geezvölker, in das Hochland vor, die sich mit den Agau vermischten und die Herrschaft über sie gewannen. Als dritter Typus erscheinen die Gallavölker mit negerhaften Zügen, die von S. her in das Land brachen. Aus dieser Vermischung ging die Bevölkerung Abessiniens hervor, die sich in mehrere Stämme gliedert. Die mächtigen Amhara haben nicht nur die gleichnamige Provinz, sondern auch Schoa im Besitz und wohnen zerstreut in den übrigen Landesteilen. Die Tigré, mit etwas schärfern Zügen als die vorigen, wohnen in der gleichnamigen Provinz. Sie sind mehr mit semitischen Volkselementen gemischt als die Amhara. In der Samhara ziehen nomadisierend die Schoho umher, die Steppen zwischen dem obern Setit und obern Mareb bewohnen die Homran. Von großer Bedeutung sind die Galla geworden, welche die Zerrüttung des altabessinischen Reiches benutzt haben, um sich wie ein Keil zwischen Schoa und Amhara und als Wollo-Galla sogar ins nördliche Hochland einz…
pref label: Abessinier
related match: Ethiopian Empire
in scheme: travel!digital Thesaurus

Abessinier
type: Label
in scheme: travel!digital Thesaurus

abessinisch
type: Label
in scheme: travel!digital Thesaurus

kurdisch
type: Concept
pref label: kurdisch
related: Kurde
in scheme: travel!digital Thesaurus
definition: Duden: 1. die Kurden betreffend; von den Kurden stammend, zu ihnen gehörend

kurdisch
type: Label
in scheme: travel!digital Thesaurus

Kurde
type: Concept
definition: Duden: Angehöriger eines iranischen Volkes in Vorderasien | Meyers Großes Konversations-Lexikon 1907: Kurden, Bergvolk in Vorderasien, zur iranischen Familie des indogermanischen Stammes gehörig, Nachkommen der alten arischen Bewohner im Süden des Wansees, die bereits die Griechen unter dem Namen Kyrtier oder Karduchen (bei Xenophon), Gordyäer (bei Strabon) kannten. Von dort haben sie sich in die anstoßenden Gebiete verbreitet. Im Zagrosgebirge, von Luristan bis zum Urmiasee und nördlich von ihm bis zum Gebiet von Maku wohnen die Kelhur, südwestlich von Kermanschah, die Dschaf zwischen Sihne und Suleimania, die Rivandi, Baliki, Mikrikurden südlich vom Urmiasee, die Schekaki zwischen Urmia- und Wansee, die Melakurden und die Dschelali bei Maku. Alle diese Stämme faßt man als östliche K. zusammen, während die westlichen K., die sich selbst als Kurmandschkurden bezeichnen, hauptsächlich im Wilajet Wan sowie in den Sandschaks Diarbekr, Wardin und Söörd wohnen, vielfach zwischen Armeniern, Nestorianern und Chaldäern sitzend. Etwas abseits bei Musch und Palu hausen die Duschikurden und Dumbeli mit eigentümlichem Dialekt. Die Zahl der K. wird für Türkisch-Asien auf 1,500,000, für Persien auf 750,000, zusammen auf 2,250,000 unsicher geschätzt, andre nehmen niedrigere Zahlen an. Die K. befinden sich in der Türkei in steter Ausbreitung. Auch die Bachtijaren (Große Luren) und Feili (Kleine Luren) werden zu den K. gerechnet. In Chorasan am Nordabhang des Elburz wurden sie vom Schah Abbas gegen die Turkmenen angesiedelt. Im kurdischen Hochland zerfallen die K. in zwei scharf geschiedene, auch äußerlich sehr verschiedene Stände oder Kasten: die Assireten, welche die Kriegerkaste bilden und nur Viehzucht, keinen Ackerbau treiben, und die Guranen, die Kaste der Ackerbauer, die nie Krieger werden können und von den erstern sehr gedrückt und ausgebeutet werden. Der Assirete hat grobe, eckige Gesichtszüge, dicken Vorderkopf und tief liegende blaue oder graue, starre Augen, während der…
in scheme: travel!digital Thesaurus
pref label: Kurde
related match: Kurdistan

Kurde
type: Label
in scheme: travel!digital Thesaurus

Siamese
type: Concept
definition: Duden: Einwohnerbezeichnung | [Anm.: unvollständig: Einwohnerbezeichnung zu Siam] | Duden: Siam: alter Name von Thailand | Meyers Großes Konversations-Lexikon 1909: Siam (wahrscheinlich = Schan, ferner Sayam Thai, Muong Thai, »Land der Freien«), Reich in Hinterindien (s. Karten »Französisch-Indochina« und »Hinterindien«), zwischen 4 und 203/4° nördl. Br. und 971/2-106° östl. L., begrenzt durch das britische Nieder- und Oberbirma im W. und N. (Schanstaaten), Französisch-Indochina im NO., O. und SO., den Meerbusen von S. und die unter britischem Schutz stehenden malaiischen Staaten im Süden, die Straße von Malakka im W., 634,000 qkm, einschließlich der zahlreichen der Küste vorgelagerten kleinen Inseln mit 4200 qkm Gesamtfläche, wovon 1400 qkm auf Tantalam, 2000 auf die Inseln an der Westküste der Halbinsel Malakka, 800 auf die im Golf von S. kommen. Nachdem im Vertrag vom 15. Jan. 1896 das Mekonggebiet als französische, das der malaiischen Halbinsel als englische Interessensphäre erklärt worden[411] ist, bleiben für S. nur 238,700 qkm als unabhängig garantiert (Pufferstaat). Das Land wird von mehreren von Norden nach Süd streichenden Gebirgsketten durchzogen, von denen die westlichste (höchster Gipfel Intanan 2576 m), in ihrem nördlichen Teil Tanelung Gji benannt, die Täler des Salwen und Menam trennt, während die das Gebiet des letztern Flusses von dem des Mekong scheidenden Ketten als Kao Donrek bis an diesen herantreten. Die Westgrenze wird vom Salwen berührt; der Menam fällt mit seinen Nebenflüssen ganz innerhalb des Landes; die Ostgrenze nach ihrer Festlegung von 1893 begleitet der Mekong, der hier den Nammun mit dem Namsi aufnimmt. Diese Flüsse haben bei dem Mangel an brauchbaren Straßen große Bedeutung für den Binnenverkehr, auch für die Landwirtschaft, da bei Hochwasser unzählige natürliche und künstliche Kanäle, namentlich des Menam, das Wasser mit seinem befruchtenden Schlamm auf die Felder verteilen. Außer der aus Flußschlamm bestehenden Küstenniederung is…
related: Thai-Volk
related match: Thailand
pref label: Siamese
in scheme: travel!digital Thesaurus

Thai-Volk
type: Concept
related match: Thailand
in scheme: travel!digital Thesaurus
pref label: Thai-Volk
definition: Duden: Thai, Tai: 1. (umgangssprachlich) Thailänder | 2. Angehöriger einer Völkergruppe in Südostasien | Duden: Thailänder: Einwohnerbezeichnung | [Anm.: unvollständig: Einwohnerbezeichnung zu Thailand] | Duden: Thailand: Staat in Hinterindien | Meyers Großes Konversations-Lexikon 1909: Tai (Thai), große, zu den Indochinesen gehörige Völkerfamilie, die den größten Teil der hinterindischen Halbinsel einnimmt, aber auch in Assam und zerstreut im südlichen China wohnt. Die T. zerfallen in die Siamesen im Stromgebiete des untern Menam, die Schau und Lao. Ferner rechnet man ihnen die Khâmtî und Miaotse (s. diese Artikel), auch wohl die Ahom in Assam zu. Sie sind meist Buddhisten, in Yünnan auch Mohammedaner, zum Teil auch Heiden. Vgl. Diguet, Étude de la langue Taï (Par. 1897, Grammatik, Vokabular etc.). | Quelle: Meyers Großes Konversations-Lexikon, Band 19. Leipzig 1909, S. 286. | Permalink: http://www.zeno.org/nid/20007558139

Thai-Volk
type: Label
in scheme: travel!digital Thesaurus

Siamese
type: Label
in scheme: travel!digital Thesaurus

Cayuga
type: Concept
definition: Meyers Großes Konversations-Lexikon 1907: Irokēsen (franz. u. engl. Iroquois), gemeinsamer Name für eine Gruppe sprachlich verwandter Indianerstämme, die zur Zeit der Entdeckung Amerikas an beiden Ufern des Lorenzstromes und im heutigen Staate New York wohnten und sich durch geistige Begabung, Pflege des Ackerbaues und der Künste und entwickeltes Regierungssystem auszeichneten. Sie zerfielen in eine nördliche und eine südliche Gruppe, deren erstere sich wieder in eine östliche und westliche Abteilung spaltete. Zu letzterer gehörte der berühmte Fünfvölkerbund, durch den in der Mitte des 15. Jahrh. der Onondagahäuptling Hiawatha (s. d.) seinen Stamm mit den Mohawk, Oneida, Cayuga und Seneca verband. Im Anfang des 18. Jahrh. gelangte der Bund durch Besiegung der Algonkin und der mit ihnen verbündeten, zur westlichen Gruppe der I. gehörigen Huronen (s. d.) und durch die Aufnahme der Tuscarora,[26] eines südlichen Irokesenstammes, als sechste Nation (1712) auf den Gipfel seiner Macht. Um 1776 wanderten die Mohawk nach Kanada aus, ihnen folgten die Tuscarora und Oneida. Überreste der sechs Nationen finden sich noch in Kanada, im Staat New York und in Reservationen westlich vom Mississippi. Die Gesamtzahl aller I. beträgt über 17,000, darunter gegen 7500 in den Vereinigten Staaten. Die Sprache der I. hat der Abbé Cuoq lexikalisch bearbeitet (Montreal 1882). Vgl. Morgan, League of the Hodenosaunee or Iroquois (Rochest. 1854); Schoolcraft, Notes on the Iroquois (Albany 1847); Hale, The Iroquois book of rites (Philad. 1883); Donaldson, The six nations of New York (Washington 1892); Canfield, The legends of the Iroquois (neue Ausg., New York 1902). | Quelle: Meyers Großes Konversations-Lexikon, Band 10. Leipzig 1907, S. 26-27. | Permalink: http://www.zeno.org/nid/20006828329
related: Indianer
in scheme: travel!digital Thesaurus
pref label: Cayuga

Cayuga
type: Label
in scheme: travel!digital Thesaurus

karisch
type: Concept
definition: Duden: Karien betreffend, zu Karien gehörend | [Anm.: unvollständig: Karien, die Karer betreffend; von den Karern stammend, zu ihnen gehörend; in Karien gelegen]
related: Karer
in scheme: travel!digital Thesaurus
pref label: karisch

karisch
type: Label
in scheme: travel!digital Thesaurus

Benjaminit
type: Concept
alt label: Benjamin
pref label: Benjaminit
in scheme: travel!digital Thesaurus
alternative label: Benjamin
definition: Meyers Großes Konversations-Lexikon 1905: Benjamin (hebr., »Sohn der Rechten, Glückssohn«), jüngster Sohn Jakobs und der Rahel, die bei seiner Geburt starb, und Stammvater des nach ihm benannten Stammes, dessen Gebiet in der Mitte des Westjordanlandes lag. Der Stamm B. wurde im Zeitalter der Richter in einen Bürgerkrieg mit den übrigen Stämmen verwickelt, der mit seiner Vernichtung geendigt hätte, wäre den Besiegten nicht gestattet worden, durch Raub sich mit Frauen zu versehen. Er gab dem Volk Israel seinen ersten König, Saul, und blieb auch mit zehn andern Stämmen dessen Sohn Jsboseth treu, bis sich David zum König über ganz Israel aufschwang. Bei der Teilung schloß sich der Stamm B. dem Nordreich an; unter König Josias verschmolz er ganz mit dem Stamm Juda. | Quelle: Meyers Großes Konversations-Lexikon, Band 2. Leipzig 1905, S. 635. | Permalink: http://www.zeno.org/nid/20006312527

Benjamin
type: Label
in scheme: travel!digital Thesaurus

Benjaminit
type: Label
in scheme: travel!digital Thesaurus

Ephraimit
type: Concept
related match: Tribe of Joseph
in scheme: travel!digital Thesaurus
alt label: Ephraim
alternative label: Ephraim
pref label: Ephraimit
definition: Meyers Großes Konversations-Lexikon 1906: Ephraim, alter Name eines Gebirges in Mittelpalästina, im Gebiete der Stämme Ephraim und Benjamin.[861] | Quelle: Meyers Großes Konversations-Lexikon, Band 5. Leipzig 1906, S. 861-862. | Permalink: http://www.zeno.org/nid/20006559182

Ephraim
type: Label
in scheme: travel!digital Thesaurus

Ephraimit
type: Label
in scheme: travel!digital Thesaurus

Ruben
type: Concept
definition: Meyers Großes Konversations-Lexikon 1909: Ruben (hebr., »sehet einen Sohn!«, 1. Mos. 29, 23), älterer Sohn Jakobs und der Lea, Ahnherr des Stammes R., der nach der Einnahme Kanaans den südlichsten Teil des Ostjordanlandes zum Wohnsitz erhielt. | Quelle: Meyers Großes Konversations-Lexikon, Band 17. Leipzig 1909, S. 206. | Permalink: http://www.zeno.org/nid/20007370849
pref label: Ruben
in scheme: travel!digital Thesaurus

Ruben
type: Label
in scheme: travel!digital Thesaurus

Gog
type: Concept
definition: Duden: Gog und Magog: barbarisches Volk der Bibel, das in der Endzeit herrscht und untergeht (Offenbarung 20, 8; eigentlich der König Gog von Magog, Hesekiel 38 f.) | Meyers Großes Konversations-Lexikon 1908: Magog, Name eines Volkes (1. Mos. 10,2; Hesek. 38,2; vgl. 39,6), das unter seinem König Gog, verbündet mit Persern, Armeniern und Kimmeriern, gegen Palästina heranzieht. Wahrscheinlich ist unter M. die Gesamtheit der nördlich von den kaukasischen Gebirgen wohnenden Völker zu verstehen, von denen zu den Hebräern nur dunkle Sagen gedrungen waren. Später galten Gog und M. als Zusammenfassung aller zukünftigen Feinde des Reiches Gottes (Offenb. 20,8). Ebenso werden auch zwei kolossale Kriegerfiguren in der Guildhall zu London bezeichnet, die nach der Sage den Sieg eines sächsischen Riesen über einen Riesen von Cornwallis versinnlichen sollen. | Quelle: Meyers Großes Konversations-Lexikon, Band 13. Leipzig 1908, S. 100. | Permalink: http://www.zeno.org/nid/20007035675
in scheme: travel!digital Thesaurus
pref label: Gog

Gog
type: Label
in scheme: travel!digital Thesaurus

russisch
type: Concept
narrower: russisch-griechisch
narrower: türkisch-russisch
narrower: russisch-türkisch
pref label: russian
alt label: neurussisch
pref label: russe
in scheme: travel!digital Thesaurus
pref label: russisch
preferred label: russe @fr
preferred label: russian @en
preferred label: moskôwi @ar
pref label: moskôwi
definition: Duden: 1. Russland, die Russen betreffend; von den Russen stammend, zu ihnen gehörend | [Anm.: unvollständig: Russland, die Russen betreffend; von den Russen stammend, zu ihnen gehörend; in Russland gelegen]
alternative label: neurussisch
narrower: südrussisch
related: Russe

russisch-griechisch
type: Concept
definition: bdk: siehe russisch, griechisch
in scheme: travel!digital Thesaurus
pref label: russisch-griechisch

russisch-griechisch
type: Label
in scheme: travel!digital Thesaurus

russian
type: Label
isTranslationOf: russisch
hasTranslation: russe
in scheme: travel!digital Thesaurus
hasTranslation: moskôwi

russisch
type: Label
hasTranslation: russe
hasTranslation: russian
in scheme: travel!digital Thesaurus
hasTranslation: moskôwi

russe
type: Label
isTranslationOf: russisch
hasTranslation: russian
in scheme: travel!digital Thesaurus
hasTranslation: moskôwi

moskôwi
type: Label
in scheme: travel!digital Thesaurus
isTranslationOf: russisch
hasTranslation: russian
hasTranslation: russe

neurussisch
type: Label
in scheme: travel!digital Thesaurus

südrussisch
type: Concept
in scheme: travel!digital Thesaurus
pref label: südrussisch
definition: bdk: siehe russisch

südrussisch
type: Label
in scheme: travel!digital Thesaurus

Russe
type: Concept
narrower: Deutsch-Russin
narrower: Deutsch-Russe
related match: Russia
related match: Russian Empire
pref label: Russe
definition: Duden: 1. a. Angehöriger eines ostslawischen Volks | b. russischer Staatsbürger | 2. (umgangssprachlich früher) Sowjetbürger | Duden: Russland: 1. a. nicht amtliche Bezeichnung für: Russische Föderation; Staat in Osteuropa und Asien | b. (Geschichte) Russisches Reich | 2. (früher) nicht amtliche Bezeichnung für: Sowjetunion | Meyers Großes Konversations-Lexikon 1909: Russisches Reich (hierzu die Übersichtskarte »Europäisches Rußland« und Spezialkarte »Mittleres Rußland«), ein Kaisertum, das den ganzen Osten Europas, dazu den Norden und einen Teil der Mitte Asiens einnimmt, d.h. ein Sechstel alles festen Bodens auf der Erde, reicht von 17°38´ östl. L. (Ruda Komarowska im Gouv. Kalisch) bis zu 169°44´ westl. L. (Beringstraße) und von 35°38´ (Grenzpfosten Nr. 23 gegen Afghanistan am rechten Ufer des Kuschka) bis zu 77°37´ nördl. Br. (Kap Tscheljuskin im Eismeer). Gegen N. wird das russische Reich vom Nördlichen Eismeer begrenzt, im W. von Norwegen, Schweden, der Ostsee, Deutschland, Österreich und Rumänien, im S. vom Schwarzen Meer, dem türkischen Armenien, von Persien, dem Kaspischen Meer, Afghanistan und den nördlichen Teilen des chinesischen Reiches, im O. vom Großen Ozean. | Das europäische Rußland nebst Polen und Finnland nimmt den ganzen Osten Europas ein und dehnt sich als zusammenhängende Masse des osteuropäischen Tieflandes von 44°28´ nördl. Br. bis 69°56´ oder mit Einschluß der Insel Nowaja Semlja bis 76° nördl. Br. aus, d.h. von der Südspitze der Krim bis zum Karischen Meer etwa 3153 km; die Ausdehnung vom Westende Polens unter 17°38´ bis zu 66° östl. L., dem Ural (im Gouv. Archangelsk), beträgt 3059 km. Vgl. beifolgende Karten, dazu die Karte der »Ostseeprovinzen« beim Artikel »Livland« und Karte »Westrußland« beim Artikel »Polen«. Im folgenden ist ausschließlich von dem europäischen Rußland und Polen die Rede; vgl. daneben noch den Artikel »Finnland«. [...] | Quelle: Meyers Großes Konversations-Lexikon, Band 17. Leipzig 1909, S. 289-328. | Permalink: http:…
in scheme: travel!digital Thesaurus

Deutsch-Russin
type: Concept
related: Deutsch-Russe
pref label: Deutsch-Russin
related: deutsch
in scheme: travel!digital Thesaurus
definition: bdk: weibliche Bezeichnung zu Deutsch-Russe

Deutsch-Russe
type: Concept
related: deutsch
pref label: Deutsch-Russe
in scheme: travel!digital Thesaurus
definition: Duden: 1. jemand, der deutsche und russische Vorfahren hat | 2. (umgangssprachlich) in Deutschland lebender Russe | 3. in Russland geborener [und dort lebender] ethnischer Deutscher

deutsch
type: Concept
narrower: deutsch-protestantisch
preferred label: alemânia @ar
narrower: deutsch-amerikanisch
alt label: altdeutsch
related: Deutsche
preferred label: aléman @es
pref label: deutsch
pref label: allemande
narrower: süddeutsch
narrower: national-deutsch
narrower: römisch-deutsch
in scheme: travel!digital Thesaurus
pref label: german
pref label: aléman
preferred label: germana @ro
pref label: alemânia
narrower: norddeutsch
alternative label: altdeutsch
preferred label: german @en
narrower: deutsch-asiatisch
pref label: germana
preferred label: allemande @fr
definition: Duden: 1. die Deutschen, Deutschland betreffend; Abkürzung: dt. | [Anm.: unvollständig: Deutschland, die Deutschen betreffend; von den Deutschen stammend, zu ihnen gehörend; in Deutschland gelegen]

deutsch-protestantisch
type: Concept
alternative label: deutsch-evangelisch
alt label: deutsch-evangelisch
definition: bdk: siehe deutsch, protestantisch
in scheme: travel!digital Thesaurus
pref label: deutsch-protestantisch

deutsch-evangelisch
type: Label
in scheme: travel!digital Thesaurus

deutsch-protestantisch
type: Label
in scheme: travel!digital Thesaurus

deutsch-amerikanisch
type: Concept
definition: bdk: siehe deutsch, amerikanisch
in scheme: travel!digital Thesaurus
pref label: deutsch-amerikanisch

deutsch-amerikanisch
type: Label
in scheme: travel!digital Thesaurus

altdeutsch
type: Label
in scheme: travel!digital Thesaurus

Deutsche
type: Concept
in scheme: travel!digital Thesaurus
definition: Duden: Deutscher: 1. Angehöriger des deutschen Volkes, aus Deutschland stammende Person | 2. das deutsche Volk | Duden: Deutschland: Staat in Mitteleuropa | siehe auch: Meyers Großes Konversations-Lexikon 1906: Deutschland | Quelle: Meyers Großes Konversations-Lexikon, Band 4. Leipzig 1906, S. 761-837. | Permalink: http://www.zeno.org/nid/20006484107
alt label: Reichsdeutsche
alternative label: Reichsdeutsche
pref label: Deutsche
related match: Germany

Reichsdeutsche
type: Label
in scheme: travel!digital Thesaurus

Deutsche
type: Label
in scheme: travel!digital Thesaurus

deutsch
type: Label
hasTranslation: alemânia
hasTranslation: allemande
hasTranslation: germana
in scheme: travel!digital Thesaurus
hasTranslation: aléman
hasTranslation: german

alemânia
type: Label
hasTranslation: germana
hasTranslation: aléman
hasTranslation: allemande
hasTranslation: german
isTranslationOf: deutsch
in scheme: travel!digital Thesaurus

germana
type: Label
hasTranslation: alemânia
isTranslationOf: deutsch
hasTranslation: aléman
hasTranslation: allemande
hasTranslation: german
in scheme: travel!digital Thesaurus

aléman
type: Label
hasTranslation: alemânia
isTranslationOf: deutsch
hasTranslation: allemande
hasTranslation: germana
hasTranslation: german
in scheme: travel!digital Thesaurus

allemande
type: Label
hasTranslation: alemânia
isTranslationOf: deutsch
hasTranslation: aléman
hasTranslation: german
in scheme: travel!digital Thesaurus
hasTranslation: germana

german
type: Label
hasTranslation: alemânia
isTranslationOf: deutsch
hasTranslation: allemande
hasTranslation: germana
in scheme: travel!digital Thesaurus
hasTranslation: aléman

süddeutsch
type: Concept
definition: bdk: siehe deutsch
in scheme: travel!digital Thesaurus
pref label: süddeutsch

süddeutsch
type: Label
in scheme: travel!digital Thesaurus

national-deutsch
type: Concept
pref label: national-deutsch
in scheme: travel!digital Thesaurus
definition: bdk: siehe deutsch | Duden: national: 1. eine Nation betreffend; zur Nation gehörend | 2. überwiegend die Interessen der eigenen Nation vertretend; patriotisch gesinnt

national-deutsch
type: Label
in scheme: travel!digital Thesaurus

römisch-deutsch
type: Concept
definition: bdk: siehe römisch, deutsch
in scheme: travel!digital Thesaurus
pref label: römisch-deutsch

römisch-deutsch
type: Label
in scheme: travel!digital Thesaurus

norddeutsch
type: Concept
in scheme: travel!digital Thesaurus
pref label: norddeutsch
definition: bdk: siehe deutsch

norddeutsch
type: Label
in scheme: travel!digital Thesaurus

deutsch-asiatisch
type: Concept
in scheme: travel!digital Thesaurus
definition: bdk: siehe deutsch, asiatisch
pref label: deutsch-asiatisch

deutsch-asiatisch
type: Label
in scheme: travel!digital Thesaurus

Deutsch-Russe
type: Label
in scheme: travel!digital Thesaurus

Deutsch-Russin
type: Label
in scheme: travel!digital Thesaurus

Russe
type: Label
in scheme: travel!digital Thesaurus

Bhutaner
type: Concept
pref label: bhot
in scheme: travel!digital Thesaurus
pref label: Bhutaner
preferred label: bhot @en
definition: Duden: Einwohnerbezeichnung | [Anm.: unvollständig: Einwohnerbezeichnung zu Bhutan] | Duden: Bhutan: Staat im Himalaja | Meyers Großes Konversations-Lexikon 1905: Bhutan (Bhotan), unabhängiger Staat im östlichen Himalaja (s. Karte »Ostindien«), zwischen 26°45´ bis 28° nördl. Br. und 89–92° östl. L., grenzt im N. an Tibet, im W. an Sikkim, im O. an wilde Gebirgsstämme, im S. an Assam und Bengalen; 34,000 qkm. Der nördlich. Teil ist von Hochgebirgen eingenommen, der südliche von den Vorbergen des Himalaja mit tiefen Flußtälern, wo Reis, Getreide und Zucker gedeihen. Breite Hügelrücken (Dwars) leiten nach S. zur Ebene über, der Bjelja (3405 m) nach Paro, der Pelilapsa (3316 m) nach Tongsa. Von den zahlreichen Flüssen (zum Brahmaputra) ist der Manas der wichtigste. Das Klima geht von der heißen bis zur kalten Zone aufwärts. Die Tierwelt ist sehr reich: Elefanten, Leoparden, mehrere Hirscharten, Wildschweine, seltener Tiger, Bären und Rhinozeros. Die Bewohner, etwa 200,000, nennen sich Bhutja (s. Bhot). B. steht unter[810] zwei Herrschern: dem Dharma Radscha als geistlichem Oberhaupt und Verkörperung der Gottheit, und dem Deb Radscha als weltlichem Herrscher, den alle drei Jahre die drei Penlos (Gouverneure der Provinzen Paro, Tongsa und Andipur) aus ihrer eignen Zahl wählen. Ihnen ist ein ständiger Ministerrat beigegeben. Die Willkür und Habgier der höchsten Beamten und die vielen Geistlichen, die ihre ausgedehnten Klostergüter in Pacht geben, hindern die Entwickelung des Landes. Die Industrie ist nur eine häusliche. Der Handel mit Britisch-Indien betrug 1900/1901: 550,190 Rupien; ausgeführt werden Goldstaub, Salz, Walnüsse, Orangen, Moschus, Seide und die einheimischen Ponies. 6000 Soldaten verteilen sich auf die festen Plätze. Die beiden Radscha residieren im Winter in Panakka (1222 m), im Sommer in Tassisudon (2225 m ü. M.), wo im Palast des Dharma Radscha allein 1500 Geistliche hausen. – Nach längerm Streit wegen der Assam-Duars und der Mißhandlung seiner 1863 nach …
related match: Bhutan
preferred label: bhotiâ @dz
pref label: bhotiâ

bhot
type: Label
isTranslationOf: Bhutaner
hasTranslation: bhotiâ
in scheme: travel!digital Thesaurus

Bhutaner
type: Label
hasTranslation: bhotiâ
in scheme: travel!digital Thesaurus
hasTranslation: bhot

bhotiâ
type: Label
isTranslationOf: Bhutaner
hasTranslation: bhot
in scheme: travel!digital Thesaurus

Chasorener
type: Concept
definition: bdk: kanaanitischer Stamm
related: Kanaʿaniter
in scheme: travel!digital Thesaurus
pref label: Chasorener

Kanaʿaniter
type: Concept
definition: bdk: Einwohnerbezeichnung zu Kanaan | Duden: Kanaan: das vorisraelitische Palästina | Meyers Großes Konversations-Lexikon 1907: Kanăan (»Tiefland«), alter Name des Küstenstriches von Palästina (s. Karte »Palästina«), ehe die Israeliten Besitz davon ergriffen, mit Einschluß von Phönikien und Philistäa, erst später auch über das höher gelegene Land bis zum Jordan erweitert. Als Kanaaniter erscheinen in der Völkertafel (1. Mos. 10) folgende Stämme: Sidonier (Bewohner von Sidon), Hettiter, Jebusiter, Amoriter, Girgasiter, Heviter, Arkiter, Siniter, Arvaditer, Zemariter und Hamathiter (am Orontes in Syrien). Mitunter erscheinen aber im Alten Testament nur 5–7 dieser Stämme als Kanaaniter, oft auch nur ein einziger. Diese Kanaaniter sind sprachlich (ob ethnisch?) den Juden verwandt, wenn diese spätern Ankömmlinge auch die Verwandtschaft nicht anerkannten. Sie standen unter kleinen Königen und hatten eine gewisse [527] Stufe des Wohlstandes und der Kultur erreicht, als sie von den Israeliten unter Josua bekriegt wurden. Sie leisteten diesen hartnäckigen Widerstand und mußten in nicht geringer Menge auch noch später im Lande geduldet werden, wo sie den Israeliten viel zu schaffen machten. | Quelle: Meyers Großes Konversations-Lexikon, Band 10. Leipzig 1907, S. 527-528. | Permalink: http://www.zeno.org/nid/20006863779
pref label: Kanaʿaniter
related match: Canaan
in scheme: travel!digital Thesaurus

Kanaʿaniter
type: Label
in scheme: travel!digital Thesaurus

Chasorener
type: Label
in scheme: travel!digital Thesaurus

Malaye
type: Concept
alternative label: Malaie
pref label: Malaye
definition: Duden: Malaie: Angehöriger mongolischer Völker Südostasiens; | Duden: Malysier: Einwohnerbezeichnung | [Anm.: unvollständig: Einwohnerbezeichnung zu Malaysien] | Meyers Großes Konversations-Lexikon 1908: Malaien (Orang Malaju, »herumschweifende Menschen«; hierzu Tafel »Malaiische Kultur I u. II«), im weitesten Sinne die von Blumenbach als malaiische Rasse zusammengefaßten Bewohner der Sundainseln und Malakkas sowie Australiens und Ozeaniens und zum Teil Madagaskars. Doch hat man die Bewohner des Australkontinents und Melanesiens längst ausgeschieden in Rücksicht auf körperliche und ethnologisch-linguistische Eigentümlichkeiten (s. unten). Dieser Menschenschlag hat sich von den Komoren bis zur Osterinsel, vom 61. bis 268. Längengrad, und zwischen Hawaï und Neuseeland, also über 70 Breitengrade, ausgedehnt. Als Ausgangspunkt muß man den Südosten des südasiatischen Festlandes ansehen. Vom linguistischen und kulturhistorischen Standpunkt aus zerfällt die malaiische Rasse in eine westliche, die M. im engern Sinn, und eine östliche, die Polynesier. Nach übereinstimmenden Überlieferungen verbreiteten sich die M. zuerst über den Indischen Archipel bis Buru und rückten von da zur Samoa- und Tongagruppe vor, um dann die polynesischen Inseln zu bevölkern. Als Zeitpunkt der Trennung in westliche und östliche M. nimmt Friedrich Müller das Jahr 1000 v. Chr. an. Nach ihren Körpermerkmalen gehören die asiatischen M. unter die kleinen Völker, während die polynesischen M. durch Körpergröße hervorragen. Namentlich die erstern haben viel mit den Mongolen gemein, das lange, straffe Haar, den spärlichen Bartwuchs, eine Trübung der Hautfarbe vom Weizen- und Ledergelb bis zum tiefen Braun, vorstehende Jochbogen und teilweise schiefe Augenstellung. Innerhalb der asiatischen M. sind wieder zwei Grundtypen zu erkennen, ein eigentlicher malaiischer und ein battascher, letzterer größer, stärker, mit hellerer Hautfarbe, lichterm Haar und weniger hervortretenden Backenknochen. Die asiatischen M. …
alternative label: Malayenstamm
in scheme: travel!digital Thesaurus
alt label: Malayenstamm
alt label: Malaie

Malaye
type: Label
hasVariant: Malaie
in scheme: travel!digital Thesaurus

Malaie
type: Label
isVariantOf: Malaye
in scheme: travel!digital Thesaurus

Malayenstamm
type: Label
in scheme: travel!digital Thesaurus

Nicht-Israelit
type: Concept
pref label: Nicht-Israelit
related: Israelit
in scheme: travel!digital Thesaurus
related: Jude
definition: bdk: siehe Israelit

Nicht-Israelit
type: Label
in scheme: travel!digital Thesaurus

normannisch
type: Concept
related: Normanne
alternative label: spätnormannisch
definition: Duden: die Normannen betreffend, von ihnen stammend, zu ihnen gehörend
narrower: arabisch-normannisch
in scheme: travel!digital Thesaurus
narrower: normannisch-romanisch
pref label: normannisch
alt label: spätnormannisch

arabisch-normannisch
type: Concept
pref label: arabisch-normannisch
in scheme: travel!digital Thesaurus
definition: bdk: siehe arabisch, normannisch

arabisch-normannisch
type: Label
in scheme: travel!digital Thesaurus

normannisch-romanisch
type: Concept
related match: Romanesque art
in scheme: travel!digital Thesaurus
pref label: normannisch-romanisch
definition: bdk: siehe normannisch | Duden: 2. romanisch: die [Kunst der] Romanik betreffend, zu ihr gehörend; für die Romanik typisch | Duden: Romanik: der Gotik vorangehende europäische Stilepoche des frühen Mittelalters, für die besonders in der sakralen Baukunst Rundbogen, Tonnengewölbe und die quaderartige, schwer wirkende Form charakteristisch sind

normannisch-romanisch
type: Label
in scheme: travel!digital Thesaurus

normannisch
type: Label
in scheme: travel!digital Thesaurus

spätnormannisch
type: Label
in scheme: travel!digital Thesaurus

Htêm
type: Concept
definition: bdk: arabische Stammesgemeinschaft in Palästina
in scheme: travel!digital Thesaurus
pref label: Htêm

Htêm
type: Label
in scheme: travel!digital Thesaurus

Gote
type: Concept
definition: Duden: Angehöriger eines germanischen Volkes | Meyers Großes Konversations-Lexikon 1907: Goten, germanisches Volk, wird zuerst von Tacitus (»Germania«, 44) als Gotones (Guttonen) erwähnt, als jenseit der Ligier im Nordosten Germaniens, etwa an der Ostsee, wohnend und von Königen beherrscht. Nach einer nicht beglaubigten Volksüberlieferung wanderten sie von der Insel Scanzia (Skandinavien) nach der »Bernsteinküste« und zogen wahrscheinlich zur Zeit der Markomannenkriege im 2. Jahrh. n. Chr. nach dem Flachland, das sich oft- und südwärts von den Karpathen an der Donau und an den Gestaden des Schwarzen Meeres ausdehnt. Sie besetzten Länder, die früher Geten und Skythen bewohnt hatten; dies sowie die Ähnlichkeit der Namen Geten und G. haben es veranlaßt, daß alte Schriftsteller die germanischen G. Skythen nennen, andre (selbst gotische Geschichtschreiber) sie für Abkömmlinge der Geten halten. Die angrenzenden Völker germanischen und sarmatischen Ursprungs durch Bündnis oder Gewalt mit sich vereinigend, breiteten die G. ihr Reich von der Theiß bis zum Don, vom Pontus bis zur Ostsee aus; Heruler, Rugier, Skiren, Turcilinger, Wandalen, Gepiden etc. gehörten dem Gotenreich an. Die eigentlichen G. zerfielen in die Westgoten (Thervingen), die unter dem Fürstengeschlecht der Balten (Kühnen) von den Karpathen bis zum Dnjepr wohnten, und die Ostgoten (Greuthungen) unter der Herrschaft der Amaler (Makellosen) in den Steppen Südrußlands.[151] Zu Wasser und zu Lande unternahmen die G. Raubzüge in das römische Reich: 251 verheerten sie Mösien und Thrakien und besiegten den Kaiser Decius. 258–259 suchten sie die Küstenländer des Schwarzen Meeres, der Propontis und des Archipels mit ihren flachen, durch ein Dach gegen Wind und Wetter geschirmten Fahrzeugen heim, schleppten aus den Städten Beute weg, steckten den Tempel der Artemis zu Ephesos in Brand, plünderten Athen und dachten sogar an eine Landung in Italien. Da wurde 269 ein großes Gotenheer, das, 320,000 streitbare Männer stark,…
narrower: Westgote
pref label: Gote
in scheme: travel!digital Thesaurus
narrower: Ostgote

Westgote
type: Concept
related match: Visigothic Kingdom
definition: Meyers Großes Konversations-Lexikon 1907: [...] Der Einfall der Hunnen 375 zerstörte dies Reich: Hermanrich, infolge eines Mordanfalles schwerverwundet daniederliegend, gab sich selbst den Tod, um den Fall seines Reiches nicht zu überleben; sein Nachfolger Withimer wagte eine Feldschlacht gegen die Hunnen, verlor aber diese und auch sein Leben. Nun unterwarfen sich die Ostgoten den Hunnen; die Westgoten aber, 200,000 waffenfähige Männer mit Weibern und Kindern, zogen unter der Führung ihres Richters Fritigern nach der Donau und stellten sich unter den Schutz des römischen Reiches, dessen Kaiser Valens ihnen erlaubte, sich in Thrakien anzusiedeln. Doch die Erpressungen der römischen Statthalter reizten die G. zu einem Aufstand, der 377 in Marcianopolis in Niedermösien ausbrach; plündernd durchzogen die Scharen die Donauprovinzen. Die Schlacht, die ihnen die römischen Feldherren auf dem Weidenfeld (ad salices) 377 lieferten, blieb unentschieden; aber 9. Aug. 378 vernichteten die Westgoten, durch andre Barbaren verstärkt, bei Adrianopel ein großes römisches Heer, und Valens fand selbst seinen Tod. Nun setzten sie ihre Verwüstungszüge fort. Theodosius d. Gr. gelang es 380, sie zu beschwichtigen (s. Athanarich) und 394 sogar zu Bundesgenossen gegen den Usurpator Eugenius zu machen. Indes sofort nach Theodosius' Tod (17. Jan. 395) erhoben sie sich wieder und zogen unter ihrem Häuptling Alarich I. (s. d.) im Winter von 395 auf 396 vor Konstantinopel, plünderten Athen, verbrannten Korinth und verwüsteten die Peloponnes. Der weströmische Feldherr Stilicho zwang Alarich, Griechenland zu räumen. Dieser, vom oströmischen Hof aus Eifersucht gegen Stilicho zum Statthalter Illyriens ernannt, hielt fünf Jahre Ruhe, wandte sich aber im November 401 gegen Italien. Am 6. April 402 kam es bei Pollentia zwischen Alarich und Stilicho zu einer Schlacht, in der die Westgoten unterlagen; nach einer zweiten Niederlage bei Verona mußte Alarich Italien räumen, erzwang sich aber 407 eine Zahlun…
in scheme: travel!digital Thesaurus
pref label: Westgote

Westgote
type: Label
in scheme: travel!digital Thesaurus

Gote
type: Label
in scheme: travel!digital Thesaurus

Ostgote
type: Concept
definition: Meyers Großes Konversations-Lexikon 1907: [...] Die Ostgoten hatten sich 375 den Hunnen unterworfen, blieben nördlich von der Donau wohnen und nahmen an den Kriegszügen Attilas teil. Erst nach seinem Tode (453) erhoben sie sich unter drei Brüdern aus dem Haus der Amaler, Walamir, Theodemir und Widemir, erstritten am Fluß Netad in Pannonien 454 ihre Selbständigkeit und schlugen von Wien bis Sirmium ihre Wohnsitze auf. Hier wurde nach Theodemirs Tode 475 Theoderich auf den Thron erhoben. Er zog nach der griechischen Halbinsel, um Kaiser Zenon gegen Aufrührer zu unterstützen, wurde aber dann, da die Ostgoten sich durch Plünderungen lästig machten, nach Italien geschickt, um dort Odoakers Herrschaft zu stürzen. 488 sammelten sich 200,000 Ostgoten zu Nova in Niedermösien, brachen sich durch das inzwischen von den Gepiden besetzte Pannonien Bahn, überschritten die Julischen Alpen und überwältigten Odoakers Scharen am Isonzo und bei Verona (489). Mit Hilfe der Westgoten errangen sie 490 einen dritten Sieg an der Adda und nötigten Odoaker zur Flucht nach Ravenna, wo er sich 493 ergeben mußte, nachdem die Ostgoten ganz Italien schon erobert hatten. Vom oströmischen Kaiser als König von Italien anerkannt, wußte Theoderich in kurzer Zeit dem ostgotischen Reich durch Energie und Klugheit Macht und Ansehen zu verschaffen und es zur Schutzmacht für kleinere germanische Völker gegen die Angriffe habgieriger Eroberer, namentlich Chlodwigs, zu erheben. Die Wandalen traten Sizilien ab; im Nordosten bis zur Donau stellten sich die Heruler unter den Schutz der Ostgoten, in den Alpen die Alemannen. Zugunsten der Westgoten schritt Theoderich 507 ein und rettete ihnen Septimanien, während er die Provence mit seinem Reich vereinigte. | Vortrefflich war die innere Organisation des Reiches. Die Ostgoten bekamen den dritten Teil alles eroberten Landes in ganz Italien nebst der entsprechenden Anzahl Sklaven zur Bebauung; sie hatten dafür allein die ehrenvolle Pflicht des Kriegsdienstes und dur…
in scheme: travel!digital Thesaurus
pref label: Ostgote
related match: Ostrogothic Kingdom

Ostgote
type: Label
in scheme: travel!digital Thesaurus

vor-toltekisch
type: Concept
related: Tolteke
definition: bdk: toltekisch: die Tolteken betreffend; von den Tolteken stammend, zu ihnen gehörend
pref label: vor-toltekisch
in scheme: travel!digital Thesaurus

Tolteke
type: Concept
related: Indianer
alternative label: Tolteken-Rasse
definition: Duden: Angehöriger eines altmexikanischen Kulturvolkes | Meyers Großes Konversations-Lexikon 1909: Toltēken, amerikan. Volk, das nach den mexikanischen Überlieferungen im 4. oder 5. Jahrh. aus einem nördlichern Land, Huehuetlapallan, in Anahuac einwanderte und hier um die Mitte des 7. Jahrh. ein großes Reich mit der Hauptstadt Tollan (Tula) gründete, das aber bereits in der Mitte des 11. Jahrh. von den Chichimeken (s. d.) zerstört wurde. Nach neuern Ansichten sind die T. entweder ein durchaus mythisches Volk oder doch nur ein kleiner Stamm gewesen, sei es der Mexikaner oder Nahuatl, sei es der Maya (s. d.). von denen man annimmt, daß sie früher bis zum 23.° nördl. Br. verbreitet waren. Vgl. Valentini, The Olmecas and the Tultecas (Worcester 1883); Dieseldorf, Wer waren die T.? (in der »Festschrift für A. Bastian«, Berl. 1896); Förstermann, Neue Mayaforschungen (»Globus«, Bd. 70). | Quelle: Meyers Großes Konversations-Lexikon, Band 19. Leipzig 1909, S. 600. | Permalink: http://www.zeno.org/nid/20007591136
in scheme: travel!digital Thesaurus
pref label: Tolteke
alt label: Tolteken-Rasse

Tolteke
type: Label
in scheme: travel!digital Thesaurus

Tolteken-Rasse
type: Label
in scheme: travel!digital Thesaurus

vor-toltekisch
type: Label
in scheme: travel!digital Thesaurus

malayisch
type: Concept
definition: Duden: malaiisch: 1. die Malaien betreffend, zu ihnen gehörend | [Anm.: unvollständig: die Malaien betreffend; von den Malaien stammend, zu ihnen gehörend]
related: Malaye
preferred label: malay @en
narrower: indomalayisch
in scheme: travel!digital Thesaurus
pref label: malay
preferred label: malaju @ms
narrower: ostmalayisch
pref label: malaju
alternative label: malaiisch
alt label: malaiisch
pref label: malayisch

indomalayisch
type: Concept
alternative label: indo-malayisch
in scheme: travel!digital Thesaurus
related: indisch
definition: bdk: siehe indisch, malayisch
pref label: indomalayisch
alt label: indo-malayisch

indomalayisch
type: Label
hasVariant: indo-malayisch
in scheme: travel!digital Thesaurus

indo-malayisch
type: Label
isVariantOf: indomalayisch
in scheme: travel!digital Thesaurus

malay
type: Label
isTranslationOf: malayisch
hasTranslation: malaju
in scheme: travel!digital Thesaurus

malayisch
type: Label
hasVariant: malaiisch
in scheme: travel!digital Thesaurus
hasTranslation: malaju
hasTranslation: malay

malaiisch
type: Label
isVariantOf: malayisch
in scheme: travel!digital Thesaurus

malaju
type: Label
isTranslationOf: malayisch
hasTranslation: malay
in scheme: travel!digital Thesaurus

ostmalayisch
type: Concept
in scheme: travel!digital Thesaurus
pref label: ostmalayisch
definition: bdk: siehe malayisch

ostmalayisch
type: Label
in scheme: travel!digital Thesaurus

japhetitisch
type: Concept
definition: bdk: die Japhetiten betreffend; von den Japhetiten stammend, zu ihnen gehörend | Pierer's Universal-Lexikon 1859: Japhet, der dritte Sohn Noahs. Seine Nachkommen (Japhetiten) verbreiteten sich nach den Inseln der Heiden u. bevölkerten dieselben. Diese hält man für Südeuropa, u. so gilt J. für den Stammvater der Meder, Armenier, Griechen, Thracier u. wird für den Japetos der Griechen gehalten, u. man hat deshalb die Indo-europäischen Sprachen auch Japhetische Sprachen neunen wollen. Die arabischen Sagen geben ihm 11 Söhne, welche die Stammväter eben so vieler asiatischen Nationen sein sollen. | Quelle: Pierer's Universal-Lexikon, Band 8. Altenburg 1859, S. 753. | Permalink: http://www.zeno.org/nid/20010158677
related match: Japheth
in scheme: travel!digital Thesaurus
pref label: japhetitisch

japhetitisch
type: Label
in scheme: travel!digital Thesaurus

Baske
type: Concept
definition: Duden: Einwohnerbezeichnung | [Anm.: unvollständig: Einwohnerbezeichnung zu Baskenland] | Duden: Baskenland: Region am Golf von Biskaya, die zum Teil zu Spanien, zum Teil zu Frankreich gehört | Meyers Großes Konversations-Lexikon 1905: Basken (Baskonier, span. Vascongados, in ihrer eignen Sprache Euskaldunak, d. h. Menschen, die Euskara reden), ein kleines Volk auf beiden Abhängen der Pyrenäen, in Spanien in den Provinzen Vizcaya, Guipuzcoa u. Alava (den baskischen Provinzen, Vascongadas) sowie in einem Teil von Navarra wohnhaft, in Frankreich in den Arrondissements Mauléon und Bayonne (Depart. Niederpyrenäen), im ganzen reichlich 500,000 Seelen, wovon 4/5 auf Euskalearia (das spanische Baskenland) und nur 1/5 auf Heskualherriak (das französische Baskenland) entfallen. Eine starke Auswanderung, besonders in den Jahren 1865–75, hat mehr als 200,000 B. nach Argentinien, Mexiko und Cuba geführt. Die B. verlieren immer mehr an Terrain, weil der Gebrauch der baskischen Sprache in Schule und Kirche, vor Gericht und bei den Regierungsämtern gesetzlich verboten und die 1394 veranstaltete Gesetzsammlung (Fueros) nicht mehr in baskischer, sondern in spanischer Sprache im Gebrauch ist. Über die Sprache der B. vgl. Art. »Baskische Sprache und Literatur«. Der ursprüngliche Typus der B. ist brachykephal und findet sich am reinsten in Frankreich, während der spanische Typus zur Dolichokephalie neigt und wohl von den Iberern abzuleiten ist; ebenso findet man dunkles (bei 20,5 Proz. der französischen und 23,4 Proz. der spanischen B. selbst schwarzes) und blondes Haar, dunkle und helle Augen. Männer und Frauen sind von schönem Körperbau und zeichnen sich durch hellere Hautfarbe, Stärke und Gewandtheit vor ihren spanischen und französischen Nachbarn aus. Sie halten vielfach noch an ihrer alten Tracht (rote oder blaue Mütze, ebensolcher Gürtel, kurze Jacke) fest. Ballspiel, Tanz, Gesang und bei den französischen B. jährliche Volksschauspiele sind außerordentlich beliebt. Die Wohnhäuser…
in scheme: travel!digital Thesaurus
pref label: Baske
related match: Basque Country (greater region)

Baske
type: Label
in scheme: travel!digital Thesaurus

algerisch
type: Concept
preferred label: algerian @en
alt label: neualgerisch
related: Algerier
pref label: algerisch
pref label: algerian
definition: Duden: Algerien, die Algerier betreffend; von den Algeriern stammend, zu ihnen gehörend | [Anm.: unvollständig: Algerien die Algerier betreffend; von den Algeriern stammend, zu ihnen gehörend; in Algerien gelegen]
in scheme: travel!digital Thesaurus
narrower: westalgerisch
alternative label: neualgerisch
alternative label: altalgerisch
preferred label: algérien @fr
narrower: ostalgerisch
narrower: südalgerisch
pref label: algérien
alt label: altalgerisch

neualgerisch
type: Label
in scheme: travel!digital Thesaurus

Algerier
type: Concept
definition: Duden: Einwohnerbezeichnung | [Anm.: unvollständig: Einwohnerbezeichnung zu Algerien] | Duden: Algerien: Staat in Nordafrika | Meyers Großes Konversations-Lexikon 1905: Algerĭen (hierzu Karte »Algerien, Marokko und Tunis«), franz. Kolonie an der Nordküste von Afrika, zwischen Marokko und Tunis, dem Mittelmeer und der Sahara. Während die östliche und westliche Grenze gegen Tunis und Marokko auf eine gewisse Strecke festgelegt ist, ist die südliche ganz unbestimmt und wird von den Franzosen immer weiter in die Sahara vorgeschoben. Im allgemeinen kann der 30. Breitegrad als Südgrenze bezeichnet werden, von Ghadames an der Grenze von Tripolis bis nördlich von Gurara, einer Oase Tuats. Innerhalb dieser äußersten Ausdehnung hat A. 797,770 qkm Flächeninhalt. [...] | [Bevölkerung.] Umfang und Bevölkerung der Kolonie betrugen nach den letzten Erhebungen (1901): | Davon sind: 4,480,456 französische Untertanen (358,045 Franzosen, 57,044 Juden, 4,065,367 Mohammedaner)[319] und 245,641 Fremde (155,124 Spanier, 38,730 Italiener, 23,864 Marokkaner, 2397 Tunesen und 25,526 andre Fremde). Die Zahl der Deutschen nimmt nur durch Zuwanderung, namentlich von Elsaß-Lothringern, zu, da die Geburtsziffer bei ihnen immer noch hinter den Sterbefällen zurückbleibt, während bei den Franzosen, bei denen das früher auch der Fall war, sich schon ein Geburtenüberschuß herausstellt. Am besten gedeihen in A. Spanier, Italiener, vor allen aber Juden (Geburten 43–57, Sterbefälle 24–28 auf Tausend), so daß man schon sagt, A. werde ein neues Palästina werden. Aber noch rascher wächst die einheimische mohammedanische Bevölkerung. Schon daraus ergibt sich, daß A. weder Betriebs-noch Besiedelungskolonie ist. Zwischen den Eingebornen und Fremden besteht eine tiefe Kluft: Sitten, Sprache, Religion, Geschichte, Traditionen, alles trennt die Muslims von dem verhaßten Rumih (Christen). Abgesehen von kleinern Stämmen und Rassen gehören die Eingebornen zwei verschiedenen Völkern an: den Arabern und Berbern (zusam…
related match: Algeria
in scheme: travel!digital Thesaurus
pref label: Algerier

Algerier
type: Label
in scheme: travel!digital Thesaurus

algerisch
type: Label
hasTranslation: algerian
hasTranslation: algérien
in scheme: travel!digital Thesaurus

algerian
type: Label
isTranslationOf: algerisch
hasTranslation: algérien
in scheme: travel!digital Thesaurus

algérien
type: Label
isTranslationOf: algerisch
hasTranslation: algerian
in scheme: travel!digital Thesaurus

westalgerisch
type: Concept
in scheme: travel!digital Thesaurus
pref label: westalgerisch
definition: bdk: siehe algerisch

westalgerisch
type: Label
in scheme: travel!digital Thesaurus

ostalgerisch
type: Concept
in scheme: travel!digital Thesaurus
pref label: ostalgerisch
definition: bdk: siehe algerisch

ostalgerisch
type: Label
in scheme: travel!digital Thesaurus

südalgerisch
type: Concept
in scheme: travel!digital Thesaurus
pref label: südalgerisch
definition: bdk: siehe algerisch

südalgerisch
type: Label
in scheme: travel!digital Thesaurus

altalgerisch
type: Label
in scheme: travel!digital Thesaurus

sikelisch
type: Concept
related: sizilisch
related match: Sicels
pref label: sikelisch
in scheme: travel!digital Thesaurus
definition: Meyers Großes Konversations-Lexikon 1909: Sikŭler (Sikeler), altes, den Ligurern (s. Ligurien) verwandtes Volk in der untern Tibergegend, wurde von dort durch die Aboriginer (s. d.) nach dem Süden verdrängt, setzte im 11. Jahrh. v. Chr. nach der nach ihnen benannten Insel Sizilien über und nahm im Osten die Sitze der westwärts geschobenen Sikaner (s. d.) ein. | Quelle: Meyers Großes Konversations-Lexikon, Band 18. Leipzig 1909, S. 462. | Permalink: http://www.zeno.org/nid/20007476094

sizilisch
type: Concept
alt label: sizilianisch
in scheme: travel!digital Thesaurus
pref label: sizilisch
definition: Duden: Sizilien, die Sizilianer betreffend; von den Sizilianern stammend, zu ihnen gehörend | [Anm.: unvollständig: Sizilien, die Sizilianer betreffend; von den Sizilianern stammend, zu ihnen gehörend; auf Sizilien gelegen]
related: Sizilianer
alternative label: sizilianisch

sizilianisch
type: Label
isVariantOf: sizilisch
in scheme: travel!digital Thesaurus

sizilisch
type: Label
in scheme: travel!digital Thesaurus
hasVariant: sizilianisch

Sizilianer
type: Concept
pref label: Sizilianer
in scheme: travel!digital Thesaurus
related match: History of Sicily
definition: Duden: Einwohnerbezeichnung zu Sizilien | Duden: Sizilien: süditalienische Insel | siehe auch: Meyers Großes Konversations-Lexikon: Sizilien | Quelle: Meyers Großes Konversations-Lexikon, Band 18. Leipzig 1909, S. 508-511. | Permalink: http://www.zeno.org/nid/20007482566
related match: Sicily

Sizilianer
type: Label
in scheme: travel!digital Thesaurus

sikelisch
type: Label
in scheme: travel!digital Thesaurus

amoritisch
type: Concept
related: Amoriter
pref label: amoritisch
in scheme: travel!digital Thesaurus
definition: bdk: die Amoriter betreffend; von den Amoritern stammend, zu ihnen gehörend

Amoriter
type: Concept
pref label: Amoriter
in scheme: travel!digital Thesaurus
definition: Meyers Großes Konversations-Lexikon 1905: Amorīter, Volksstamm der Kanaaniter, der oft für diese überhaupt genannt wird. Sie wohnten nordostwärts vom Jordan am Jabok im S. bis zum Hermon im N. Im 13. Jahrh. v. Chr. unterwarfen sie die Moabiter, drangen über den Jordan, stürzten die Macht der Chetiter und eroberten das ganze Kanaan bis zum Meer. Doch wurde ihre Macht durch den Sieg der Hebräer unter Josua bei Gibeon gebrochen. | Quelle: Meyers Großes Konversations-Lexikon, Band 1. Leipzig 1905, S. 449. | Permalink: http://www.zeno.org/nid/20006224040

Amoriter
type: Label
in scheme: travel!digital Thesaurus

amoritisch
type: Label
in scheme: travel!digital Thesaurus

lykisch
type: Concept
related match: Lycia
related match: Lycians
definition: Duden: Lykien, die Lykier betreffend; von den Lykiern stammend, zu ihnen gehörend | [Anm.: unvollständig: Lykien, die Lykier betreffend; von den Lykiern stammend, zu ihnen gehörend; in Lykien gelegen] | Duden: Lykien: historische Landschaft in Kleinasien | Meyers Großes Konversations-Lexikon 1908: Lykĭen, im Altertum Landschaft an der Südküste Kleinasiens (s. Karte »Alt-Griechenland«), die gegen NW. von Karien, gegen N. von Phrygien und Pisidien, gegen NO. von Pamphylien, im übrigen vom Mittelländischen Meer begrenzt ward. Das Land, überwiegend gebirgig, zum Teil von bis 3000 m ansteigenden Hochgebirgen (Tauros) erfüllt, war trotzdem reich an Wein, Getreide und den übrigen Produkten Kleinasiens; namentlich wurden die Zedern, Tannen und Platanen von L. gerühmt. Besonders fruchtbar und städtereich war das die Landschaft von N. nach S. durchschneidende Xanthostal. Der ältere Name von L. war nach Herodot Milyas, der sich in dem nördlichen Gebirgsland erhielt, der seiner Einwohner Termilen (Tramili), arischen Stammes Im O. saßen die vielleicht semitischen Solymer. Die Lykier, bei Homer Bundesgenossen der Troer, behaupteten ihre Freiheit gegen Krösos, erlagen aber später der persischen Übermacht. L. gehörte dann zum Attischen Seebunde, stand bis 190 v. Chr. unter der Oberhoheit der Seleukiden, gehörte dann nominell den Rhodiern, war aber tatsächlich frei und wurde 43 n. Chr. als Teil der Provinz Pamphylia dem Römerreich einverleibt. Erst seitdem wurde, wie die Inschriften beweisen, das Volk gräzisiert und erlangte dann in der Kaiserzeit rasch einen erstaunlichen Wohlstand, als dessen Zeugen die Reste zahlreicher Theater, Grabmäler und Hafenbauten sich erhalten haben. Zur Zeit seiner Freiheit bildete es einen aus 23 selbständigen Republiken bestehenden Städtebund, an dessen Spitze ein Generalstatthalter (der Lykiarches) stand. Die Zahl der Städte betrug nach Plinius 70; die sechs größten mit doppeltem Stimmrecht waren: Xanthos, Sitz der Bundesversammlung, Patara, Pinara, O…
in scheme: travel!digital Thesaurus
pref label: lykisch

lykisch
type: Label
in scheme: travel!digital Thesaurus

Äolier
type: Concept
related match: Aeolis
definition: Duden: Einwohnerbezeichnung | [Anm.: unvollständig: Einwohnerbezeichnung zu Äolien] | Duden: Äolien: antike Landschaft an der Nordwestküste Kleinasiens | Meyers Großes Konversations-Lexikon 1905: Äolĭer, einer der vier Hauptstämme des griech. Volkes, der seinen Ursprung von Äolos ableitete und sich durch einen besondern Dialekt von den übrigen unterschied. Der Name findet sich an verschiedenen Orten von Griechenland, in Thessalien, Elis, Messenien, Lokris, Ätolien und Kephallinia; aber geschichtliche Bedeutung erhielt der Stamm erst an der Küste Kleinasiens, in Lesbos und Kyme, von wo aus er in langwierigen Kämpfen zusammen mit Achäern Troas und Mysien eroberte; die aus der thessalischen Heimat mitgebrachten Sagen wurden damals zu der bekannten Achilleussage ausgebildet und mit peleponnesischen zu den Homerischen Gesängen zusammengearbeitet (s. Achäer). An dem üppigen Gestade zwischen dem Kaikos und dem Hermos, auf einem Raum von 53 km Länge und ebensoviel Kilometer Breite, erhoben sich 30 äolische Städte, von denen 11 als die bedeutendsten genannt werden: Kyme (Cumä), Larissa, Neonteichos, Killa, Notion, Ägiroessa, Pitane, Ägää, Myrina, Gryneia, Temnos. Sie schlossen untereinander ein Schutzbündnis, zu dem eine Zeitlang auch das mächtige Smyrna gehörte, das später gezwungen wurde, dem Ionischen Bunde beizutreten. Unter Krösus mußten sie Lydiens, darauf Persiens Oberhoheit anerkennen. Die Perserkriege gaben ihnen ihre Freiheit zurück, aber der Friede des Antalkidas (387 v. Chr.) brachte sie von neuem unter persische Herrschaft. Nach Alexanders d. Gr. Tode kamen sie unter syrische Gewalt und wurden dann, weil sie sich mit Mithradates verbündet hatten, durch Sulla der römischen Provinz Asien einverleibt. S. Karte »Alt-Griechenland«. – Über den äolischen Dialekts. Griechische Sprache. In der Literatur ist der äolische Stamm nur für die älteste Zeit von Bedeutung. Sprachliche Spuren in den Homerischen Gedichten erweisen sehr wesentlichen Anteil der Ä. an der Ausbildung …
in scheme: travel!digital Thesaurus
pref label: Äolier

Äolier
type: Label
in scheme: travel!digital Thesaurus

Levit
type: Concept
alt label: Levi
alternative label: Levi
pref label: Levit
in scheme: travel!digital Thesaurus
definition: Duden: hebräisch-griechisch-mittellateinisch; nach dem jüdischen Stamm Levi | Meyers Großes Konversations-Lexikon 1908: Leviten, die Söhne Levis (s. Levi), mit Namen: Gerson, Kehat, Merari, sodann deren sämtliche Nachkommen. Im Pentateuch wird ihnen der Schutz des Heiligtums und der Opferdienst übertragen. Bei der Verteilung des Heiligen Landes durch Josua fällt den L. kein besonderer Länderbesitz zu, auch die ihnen 4. Mos. 35, 1–8 zugesprochenen 48 Städte mit ihren Feldmarken erhielten sie nicht. Später warf ihnen die Beschäftigung mit dem Priesterdienst den Lebensunterhalt[488] ab, der ihnen aber verkürzt wurde, als sie zu dem Stande von Tempeldienern bestimmt und ihre Pflichten und Rechte gesetzlich geordnet wurden. Seit der Zeit Davids unterscheidet man folgende levitische Bedienstete: 1) Sänger und Musiker, 2) Priestergehilfen, 3) Torwärter, 4) Verwalter der Tempelschätze, 5) Schreiber und Registratoren. In der katholischen Kirche heißen L. die Kleriker, welche die den Gottesdienst verrichtenden Priester am Altar bedienen müssen. Ihre Bekleidung (Levitenkleid) ist die sogen. Dalmatika (s. d.) oder Tunicella. – Jemand den oder die L. lesen heißt in der Vulgärsprache soviel wie einen derben Verweis erteilen, mit Bezug auf das 3. Buch Mosis (Leviticus). | Quelle: Meyers Großes Konversations-Lexikon, Band 12. Leipzig 1908, S. 488-489. | Permalink: http://www.zeno.org/nid/20006998267

Levi
type: Label
in scheme: travel!digital Thesaurus

Levit
type: Label
in scheme: travel!digital Thesaurus

Ionier
type: Concept
related match: Ionia
pref label: Ionier
in scheme: travel!digital Thesaurus
definition: Duden: Einwohnerbezeichnung | [Anm.: unvollständig: Einwohnerbezeichnung zu Ionien] | Duden: Ionien: Küstenlandschaft Kleinasiens | Meyers Großes Konversations-Lexikon 1907: Ionĭer, einer der drei Hauptstämme der Hellenen, den die genealogische Sage auf Ion (s. d. 1) zurückführt, den Sohn des Xuthos, eines Nachkommen des Deukalion. Der Grundstock der J. tritt uns zuerst in Athen entgegen, ihre geschichtliche Eigenart hat sich indes erst an der kleinasiatischen Küste entwickelt, als diese von Athen aus durch eine aus verschiedenen Stämmen gemischte Bevölkerung besiedelt wurde. Die zwölf von ihnen gegründeten Städte, die den Ionischen Städtebund bildeten, waren in der Richtung von N. nach S. folgende: an der lydischen Küste: Phokäa, Erythrä, Klazomenä, Teos, Lebedos, Kolophon, Ephesos; an der karischen Küste: Priëne, Myus, Miletos; auf den der Küste nahen Inseln: Samos und Chios; später (um 700 v. Chr.) kam auch das äolische Smyrna zum Ionischen Bunde, der seitdem 13 Städte umschloß. Das ganze von den Ioniern bewohnte Küstenland hieß Ionien (Ionia; s. Karte »Alt-Griechenland« im 8. Band). In diesen Wohnsitzen in Kleinasien zwischen andern griechischen Niederlassungen, den äolischen im N. und den dorischen im S., gelangten die J., durch die alle Vorteile für den Verkehr in sich vereinigende Lage ihres Landes, dessen herrliches Klima und ausnehmende Fruchtbarkeit begünstigt, sehr bald zu einer hohen weltgeschichtlichen Bedeutung und übten namentlich durch ihre rege wissenschaftliche Tätigkeit auch auf das Mutterland großen Einfluß aus. Jeder einzelne Freistaat entwickelte sich bei demokratischer Verfassung völlig selbständig; einen vereinigenden Mittelpunkt jedoch gewährte das jährliche Fest des Poseidon Helikonios am Vorgebirge Mykale (Panionion), wo die J. ihre Bundestage abhielten. Geraume Zeit hindurch bestand der Bund in unbeeinträchtigter Freiheit und ungestörter Ruhe und beteiligte sich in hervorragender Weise an dem Werke der Kolonisation, indem er im 8. und 7. …

Ionier
type: Label
in scheme: travel!digital Thesaurus

bithynisch
type: Concept
related match: Bithynia
related match: List of ancient tribes in Thrace and Dacia
definition: Duden: Bithynien, die Bithynier betreffend; aus Bithynien stammend | [Anm.: unvollständig: Bithynien, die Bithynier betreffend; von den Bithyniern stammend, zu ihnen gehörend; in Bithynien gelegen] | Duden: Bithynien: antike Landschaft in Kleinasien | Meyers Großes Konversations-Lexikon 1905: Bithynien, alte Landschaft im nordwestlichen Kleinasien (s. die Karten »Kleinasien«, »Altgriechenland«), die gegen W. und N. von der Propontis (Marmarameer) und dem Pontos Euxeinos (Schwarzes Meer), gegen S. vom Olympos (Keschisch Dagh) und etwa dem 40.° nördl. Br., gegen O. von Paphlagonien, im S. von Galatien, Phrygien und Mysien begrenzt war. Das Land ist im O. und S. mit waldreichen Gebirgen erfüllt (außer dem Olympos bei Prusa der Orminios, jetzt Ala Dagh, im O.); die niedrigere und von fruchtbaren Tälern durchschnittene Westhälfte enthält einige große Landseen, den Askanischen (Isnik Göl) und den Sophon (Sabandscha Gjölü). Hier im W. schneiden auch zwei Meerbusen tief ins Festland ein: der von Astakos (Ismid Körfesi) und der von Kios (Indschir Liman). Der Hauptstrom ist der Sangarios (Sakaria). Als Hauptprodukte werden Marmor, Schiffbauholz, Getreide, Hülsenfrüchte, Feigen, Wein und Käse ausgeführt. In B. waren thrakische Stämme unter eignen Fürsten angesiedelt, die Thyner und Bithyner; erstere auch auf europäischem Boden seßhaft, letztere wenig hervortretend, weil sie landeinwärts und abseits von den großen Verkehrsstraßen wohnten. Doch war es ihr Fürstenhaus, das die thrakischen Stämme zu dem Reiche B. zusammenfaßte. Unter den Städten sind zu nennen: Astakos (s.d.) am gleichnamigen Golf, Nikomedeia (s.d., jetzt Ismid), Nikäa (s.d.). Die von Europa her eingewanderten Thraker vermochten übrigens die vorgefundenen Urbewohner keineswegs zu verdrängen. So hielten sich namentlich im O. die Mariandyner, einst Untertanen der dorischen Kolonie Herakleia. – B. bildete einen Bestandteil des lydischen Reiches und wurde mit ihm von den Persern unterworfen, unter deren Herrschaft es …
in scheme: travel!digital Thesaurus
pref label: bithynisch

bithynisch
type: Label
in scheme: travel!digital Thesaurus

Charesmier
type: Concept
definition: bdk: iranisches Volk in Zentralasien | Meyers Großes Konversations-Lexikon 1906: Chiwa (Charesm, Choarizm, Chowarezm, Chorazin, »Land der Niederung«, auch Urgendsch, s. Karte »Zentralasien«), ein Chanat und seit 1872 russ. Vasallenstaat in Westturkistan, im S. des Aralsees, zwischen 41 und 433/4° nördl. Br., begrenzt im O. vom Amu Darja gegen die nach ihm benannte russische Provinz, im S. von der Sandwüste Karakum, im W. von der Transkaspischen Provinz, umfaßt 60,000 qkm und besteht hauptsächlich aus Sandwüste; nur im Delta-des Amu Darja zieht sich ein auf dem linken Ufer breiterer Streifen fruchtbaren Landes hin. Im ganzen ist höchstens ein Drittel ertragfähiges Land. Die Sommer sind heiß, die Winter streng, aber kurz, der Regenfall gering, Sandstürme herrschen im Herbst und Winter. Man baut Weizen, Gerste, Hirse, Reis, Früchte (berühmte Melonen), Flachs, Krapp, Baumwolle, Wein. Dromedare und Schafe werden allgemein gehalten; sehr geschätzt ist das Pferd, Esel sind selten, die Rinder klein. In der Steppe gibt es Wölfe, Schakale, Füchse, Hirsche, Antilopen, Adler, Sperber; die letztern werden zur Jagd abgerichtet. Die 800,000 Köpfe zählende Bevölkerung setzt sich aus nomadisierenden und angesessenen Stämmen zusammen. Zu den erstern gehören 10,000 Kirgisen, hauptsächlich um den Dankarasee, 50,000 Karakalpaken (s.d.) im N., in der Nähe des Aralsees, des Dankarasees, der Städte Kungrad, Chodscheili und Kiptschak, endlich 170,000 Turkmenen (s.d.), zum größten Teil Jomuden (Bairam Ali), dann Tschoudoren und einige tausend Goklanen, im ganzen etwa 400,000 Nomaden. Die angesessene Bevölkerung besteht aus je 200,000 Uzbeken (s.d.) und Sarten und einigen tausend Persern (frühere Sklaven). Die Uzbeken sind die herrschende Bevölkerung (ihnen gehört der Chan an), doch sind ihnen iranische Elemente beigemischt; sie wohnen hauptsächlich in der Stadt C., in Gurlen, Chasar Asp, Mangyt, Kiptschak und treiben Ackerbau, die türkisch sprechenden Sarten dagegen Handel. Die Industrie (Tö…
related match: Khwarezm
pref label: Charesmier
in scheme: travel!digital Thesaurus

Charesmier
type: Label
in scheme: travel!digital Thesaurus

Trere
type: Concept
alternative label: Trare
pref label: Trere
in scheme: travel!digital Thesaurus
alt label: Trare
definition: Meyers Großes Konversations-Lexikon 1907: Kimmērĭer (Cimmērii), Fabelvolk bei Homer, im äußersten Westen am Okeanos beim Eingang in die Unterwelt in ewiger Finsternis wohnend; daher kimmerische Finsternis. Die historischen K., ein nomadisches Reitervolk an der Nordküste des Schwarzen Meeres, fielen, von Skythen aus ihren Sitzen vertrieben, im 9. und 8. Jahrh. v. Chr. in Kleinasien ein, plünderten um 650 Sardes, belagerten Ephesos und zerstörten Magnesia, bis sie durch Alyattes IV von Lydien um 600 aufgerieben wurden. Tomaschek hält sie für identisch mit dem thrakischen Stamme der Treren, Kiepert für die Gimirri oder Kappadokier. | Quelle: Meyers Großes Konversations-Lexikon, Band 10. Leipzig 1907, S. 905. | Permalink: http://www.zeno.org/nid/2000689254X

Trere
type: Label
hasVariant: Trare
in scheme: travel!digital Thesaurus

Trare
type: Label
isVariantOf: Trere
in scheme: travel!digital Thesaurus

Römerin
type: Concept
in scheme: travel!digital Thesaurus
definition: Duden: weibliche Form zu Römer
pref label: Römerin
related: Römer

Römerin
type: Label
in scheme: travel!digital Thesaurus

Römer
type: Concept
definition: Duden: 1. Einwohnerbezeichnung zu Rom | 2. (Geschichte) Angehöriger, Bürger des antiken Staatswesens Rom | Meyers Großes Konversations-Lexikon 1909: Römisches Reich. Das römische Volk, d.h. die Bewohner des altrömischen Staates, ist der Überlieferung nach aus der Vereinigung von Angehörigen dreier verschiedener Völker entstanden, der Latiner, Sabiner und Etrusker, und enthielt diesem Ursprung gemäß drei Stämme (tribus), Ramnes, Tities und Luceres genannt, mit den Unterabteilungen der Kurien (30) und der Geschlechter (gentes). Ihre Angehörigen waren in der ältesten Zeit die einzigen Vollbürger (Patrizier, patricii, »Vaterssöhne«), der ursprüngliche populus Romanus Quirites (s. Quiriten); neben ihnen gab es damals nur noch Klienten, d.h. Hörige, die, obgleich nicht unfrei, doch in persönlicher Abhängigkeit von einzelnen Vollbürgern standen, die ihnen väterlichen Schutz zu gewähren hatten und daher ihre patroni hießen (s. Klientel). Zu diesem Kern der ältesten römischen Bürgerschaft kamen schon unter den Königen, hauptsächlich unter Tullus Hostilius und Ancus Marcius, zahlreiche Einwohner der eroberten Städte der Latiner und auch andrer benachbarter Stämme hinzu, die von vornherein privatrechtlich selbständig waren und unter Servius Tullius auch das Bürgerrecht erhielten, aber ohne das Stimm- und Ehrenrecht der Vollbürger. Sie hießen Plebejer, und ihr Kampf um Gleichstellung mit den Patriziern macht einen Hauptinhalt der innern Geschichte Roms bis zum Ende des 3. Jahrh. v. Chr. aus. Ein neuer Gegensatz bildete sich nach dem zweiten Punischen Krieg, der zwischen der Nobilität (auch Optimaten oder Senatspartei genannt), dem erblichen Amtsadel, der die Staatsämter und den Senat für sich beanspruchte, und der großen Masse des Volkes, und daneben seit C. Gracchus dem Ritterstand (ordo equester), d.h. Bürgern einer bestimmten höhern Vermögensklasse, die zwar nicht zum Senat gehörten, aber gewisse Ehrenrechte genossen und als Staatspächter im letzten Jahrhundert der Republik …
related match: Roman Empire
related match: Ancient Rome
in scheme: travel!digital Thesaurus
pref label: Römer
narrower: Oströmer

Römer
type: Label
in scheme: travel!digital Thesaurus

Oströmer
type: Concept
related match: Byzantine Empire
in scheme: travel!digital Thesaurus
pref label: Oströmer
related: Byzantiner
definition: Meyers Großes Konversations-Lexikon 1908: Oströmisches Reich (Byzantinisches Reich, Griech isch es Kaisertum), das eine der beiden Reiche, in die nach Theodosius d. Gr. Tode 395 n. Chr. das römische Weltreich geteilt wurde, umfaßte alle asiatischen Provinzen, in Afrika die Provinzen Libyen, Ägypten, in Europa Thrakien, Mösien, Dacien, Mazedonien, Epirus, Thessalien, Achaia, mit der Residenz Konstantinopel, während die westlich davon gelegenen Länder mit der Residenz Rom das weströmische Reich bildeten (s. Art. »Römisches Reich« mit Karte »Römisches Weltreich« und Nebenkarte: »Oströmisches Reich«). Die Provinz Illyrien ward zwischen beiden Reichen geteilt, geriet aber bald in den Besitz der Westgoten unter Alarich. Weil das oströmische Reich für den bessern und gesichertern Teil des großen römischen Reiches galt, so erhielt es der ältere der beiden Söhne des Theodosius, Arcadius, während die andre Hälfte an den jüngern, Honorius, fiel. Für den jungen und schwachen Arcadius (395–408) regierte zuerst der Minister Rufinus und nach dessen noch 395 erfolgten Ermordung der Oberkämmerer, der Eunuch Eutropius. Der byzantinische Staat nahm mehr und mehr die Formen des Orients an; mit der Zeit wurde die griechische Sprache, im Verkehr die herrschende, auch zur Amtssprache erhoben und damit das letzte Band zwischen beiden Reichen zerrissen. Statt vereint die Einbrüche der Barbaren abzuhalten, blickte jedes mit Schadenfreude auf die Unfälle des andern und reizte die Barbaren zu Einfällen in das Gebiet desselben auf. Eutropius erlag nach vierjähriger schmachvoller Regierung den von dem gotischen Feldherrn Gainas angezettelten Ränken (399), der indes selbst schon im nächsten Jahre die Hauptstadt verlassen mußte und Arcadius unter dem Einfluß seiner ränkevollen Gemahlin Eudoxia zurückließ. | Ihm folgte in der Regierung sein siebenjähriger Sohn Theodosius II. (408–450), bis 414 unter der Leitung des Präfekten Anthemius, dann unter der seiner bigotten Schwester Pulcheria. Ein Krieg m…

Oströmer
type: Label
in scheme: travel!digital Thesaurus

Byzantiner
type: Concept
in scheme: travel!digital Thesaurus
pref label: Byzantiner
related: Konstantinopolitaner
related match: Constantinople
related match: Byzantium
related match: Byzantine Empire
definition: Duden: Einwohnerbezeichnung | [Anm.: unvollständig: Einwohnerbezeichnung zu Byzanz] | Duden: Byzanz: alter Name von Istanbul | Meyers Großes Konversations-Lexikon 1907: Konstantinopel (hierzu der Stadtplan), türk. Istambol, Stambul oder Konstantanîe, griech. Konstantinupolis, levantisch-ital. Cospoli, von den Slawen Zarigrad (»Kaiserstadt«) genannt, das alte Byzanz, Haupt- und Residenzstadt des türkischen Reiches, liegt unvergleichlich schön, daher von den Türken Deri Seadet, d. h. Pforte der Glückseligkeit, genannt, unter 41° nördl. Br. und 28°58' östl. L. auf der europäischen Küste am Südausgang zum Bosporus. Es erhebt sich amphitheatralisch auf der dreieckigen Landzunge, die im N. von einer schmalen Bucht, dem Goldenen Horn, im O. vom Bosporus, im S. vom Marmarameer eingeschlossen ist und deren Westseite mit dem Festlande Rumeliens zusammenhängt. Auf ihrer östlichen Spitze trägt diese Halbinsel das Serai; das Ganze mag 18 km im Umfang haben. Nach NW. hin schließt sich längs des Goldenen Horns die Vorstadt Ejub an. Jenseit des Goldenen Horns liegen die Vorstädte Galata, Pera, Tophane, Fyndykly, St. Dimitri, Kassim Pascha, Hasköj, Südlüdsche; auf der asiatischen Küste jenseit des Bosporus befinden sich Skutari und Kadiköi (das alte Chalcedon), die ebenfalls als Vorstädte Konstantinopels betrachtet werden (s. unten). Im übrigen muß man alle die kleinen zwischen Wäldern, Gärten und Weinbergen versteckten Bosporusstädte, die auf einer 20 km langen Strecke auf der europäischen Seite bis Therapia und Böjükdere, auf der asiatischen bis Beikos reichen, zu K. rechnen (s. Bosporus). Das Goldene Horn (im Altertum Chrysun Keras), einer der größten und sichersten Ankerplätze der Erde, ist an der Mündung zwischen der Seraispitze und Tophane 800 m breit, bis 40 m tief, bis zur innersten, stark gekrümmten Spitze fast 7 km lang und infolge der reinigen den Strömung, die, bei der Seraispitze eindringend, den Golf umkreist, frei von Flußschlamm. Zwei eiserne Schiffbrücken verbinden …

Byzantiner
type: Label
in scheme: travel!digital Thesaurus

Konstantinopolitaner
type: Concept
related match: Constantinople
definition: Duden: Einwohnerbezeichnung | [Anm.: unvollständig: Einwohnerbezeichnung zu Konstantinopel] | Duden: Kostantinopel: früherer Name Istanbuls | Meyers Großes Konversations-Lexikon 1907: Konstantinopel (hierzu der Stadtplan), türk. Istambol, Stambul oder Konstantanîe, griech. Konstantinupolis, levantisch-ital. Cospoli, von den Slawen Zarigrad (»Kaiserstadt«) genannt, das alte Byzanz, Haupt- und Residenzstadt des türkischen Reiches, liegt unvergleichlich schön, daher von den Türken Deri Seadet, d. h. Pforte der Glückseligkeit, genannt, unter 41° nördl. Br. und 28°58' östl. L. auf der europäischen Küste am Südausgang zum Bosporus. Es erhebt sich amphitheatralisch auf der dreieckigen Landzunge, die im N. von einer schmalen Bucht, dem Goldenen Horn, im O. vom Bosporus, im S. vom Marmarameer eingeschlossen ist und deren Westseite mit dem Festlande Rumeliens zusammenhängt. Auf ihrer östlichen Spitze trägt diese Halbinsel das Serai; das Ganze mag 18 km im Umfang haben. Nach NW. hin schließt sich längs des Goldenen Horns die Vorstadt Ejub an. Jenseit des Goldenen Horns liegen die Vorstädte Galata, Pera, Tophane, Fyndykly, St. Dimitri, Kassim Pascha, Hasköj, Südlüdsche; auf der asiatischen Küste jenseit des Bosporus befinden sich Skutari und Kadiköi (das alte Chalcedon), die ebenfalls als Vorstädte Konstantinopels betrachtet werden (s. unten). Im übrigen muß man alle die kleinen zwischen Wäldern, Gärten und Weinbergen versteckten Bosporusstädte, die auf einer 20 km langen Strecke auf der europäischen Seite bis Therapia und Böjükdere, auf der asiatischen bis Beikos reichen, zu K. rechnen (s. Bosporus). Das Goldene Horn (im Altertum Chrysun Keras), einer der größten und sichersten Ankerplätze der Erde, ist an der Mündung zwischen der Seraispitze und Tophane 800 m breit, bis 40 m tief, bis zur innersten, stark gekrümmten Spitze fast 7 km lang und infolge der reinigen den Strömung, die, bei der Seraispitze eindringend, den Golf umkreist, frei von Flußschlamm. Zwei eiserne Schiffbrü…
in scheme: travel!digital Thesaurus
pref label: Konstantinopolitaner

Konstantinopolitaner
type: Label
in scheme: travel!digital Thesaurus

Andamaner
type: Concept
related match: Andaman Islands
definition: bdk: Einwohnerbezeichnung zu Andamanen | Duden: Andamanen: Inselkette im nordöstlichen Indischen Ozean | Meyers Großes Konversations-Lexikon 1905: Andamanen, Inselgruppe im Bengalischen Golf (s. Karte »Hinterindien«), zwischen 10°30´-13°45´ nördl. Br. und 92°15´-93°15´ östl. L., südlich vom Kap Negrais (Britisch-Birma), nördlich von den Nikobaren, umfaßt 6497 qkm in 4 größern und 50 kleinern Inseln mit (1901) 24,499 Einw. Nord-, Mittel- und Südandamanen (1513, 1961 und 1392 qkm) bilden die 250 km lange, 32 km breite Gruppe Großandamanen, durch die Duncanstraße von den südlichen Kleinandamanen (954 qkm) getrennt. Der Stewartsund scheidet Nord- und Mittelinsel, die schiffbare Andamanenstraße Mittel- und Südinsel, die schiffbare Macphersonstraße letztere von Rutland. Die Westküste ist von Korallenriffen begleitet. Die üppigen Urwälder von hinterindischem Charakter enthalten einen wertvollen Mahagonibaum (Pterocarpus dalbergioides), am Strand wächst Mangrove. Das Klima schwankt zwischen 19 und 27°, Wirbelstürme sind selten, der Regenfall ist sehr bedeutend (3000 mm jährlich). Die höchsten Punkte: Saddle Hill (730 m) auf Nord- und Mount Harriet auf Südandamanen, werden als Gesundheitsstationen benutzt. Fast die einzigen Säugetiere sind Wildschweine, Ratten, Rollmarder, Ichneumons und Fledermäuse; Vögel sind selten (eßbare Nester), Fische und Schildkröten in Fülle. Die aussterbenden Ureinwohner, 1901 nur noch 1882, die Minkopies, sind mit den Negrito und Papua verwandt, 140–150 cm groß, von tiefdunkler Haut und krausem Wollhaar. Die Männer gehen nackt, die Frauen mit einem Lendengürtel aus Blättern. Sie haben keine festen Wohnsitze und leben von den Erzeugnissen des Waldes und Meeres, sind geschickte Bogenschützen, Ruderer und Taucher, gegen andre Stämme unfriedlich und hinterlistig. Port Cornwallis auf Nord- und Port Blair auf Südandamanen sind vorzügliche Zufluchtshafen. In letzterm haben die Engländer eine Strafanstalt errichtet, die 1901: 16,307 meist lebenslänglich v…
pref label: Andamaner
in scheme: travel!digital Thesaurus

Andamaner
type: Label
in scheme: travel!digital Thesaurus

Homerite
type: Concept
related match: Himyarite Kingdom
definition: Meyers Großes Konversations-Lexikon 1907: Himjariten (bei den Griechen Homeriten), Name eines Volkes im südwestlichen Arabien (Jemen), das zum sabäischen Reich gehörte, vom 2. Jahrh. n. Chr. ab die Sabäer aber verdrängte. Ihr Reich bestand, obwohl durch die infolge der Zunahme der Schiffahrt auf dem Roten Meere bedingte Veränderung der Handelswege immer mehr verfallend, bis Anfang des 6. Jahrh., wo es von den Äthiopenkönigen zu Axum vernichtet wurde. Etwa 570 bemächtigten sich die Perser des Landes, die es beherrschten, bis es 630 dem Islam zufiel. Die früher himjaritisch genannten Denkmäler und Inschriften rühren in Wirklichkeit von den Minäern und Sabäern (s. d.) her. | Quelle: Meyers Großes Konversations-Lexikon, Band 9. Leipzig 1907, S. 343. | Permalink: http://www.zeno.org/nid/20006774601
pref label: Homerite
in scheme: travel!digital Thesaurus

Homerite
type: Label
in scheme: travel!digital Thesaurus

edomitisch
type: Concept
alternative label: idumäisch
alt label: idumäisch
related: Edomiter
pref label: edomitisch
in scheme: travel!digital Thesaurus
definition: bdk: Edom, die Edomiter betreffend; von den Edomitern stammend, zu ihnen gehörend; in Edom gelegen

idumäisch
type: Label
in scheme: travel!digital Thesaurus

Edomiter
type: Concept
alt label: Idumäer
definition: Duden: Einwohnerbezeichnung zu Edom | Duden: Edom: Land östlich und südöstlich des Toten Meeres im Alten Testament | Meyers Großes Konversations-Lexikon 1906: Edom (Idumäa), die südliche Fortsetzung Palästinas (s. Karte »Palästina«) von dem Südende des Toten Meeres bis zum Nordende des Älanitischen Meerbusens (Golfs von Akaba), ist vielfach von Felsenklüften und Gebirgen durchsetzt; im N. ist es durch das tiefe Felsental El Ahsi von dem Lande der Moabiter geschieden, während im W. und O. seine Grenzen unbestimmt und wechselnd waren. Im O. erhebt sich als Fortsetzung der moabitischen Berge das Gebirge Seïr; sein höchster Gipfel ist der 1329 m hohe, aus Buntsandstein bestehende Hor, an dessen Ostabhang die Felsenstadt Petra liegt. Die meist nackten, wilden Gebirge bergen manche fruchtbare Oase. – Schon früh waren die Edomiter, Abkömmlinge des E. oder Esau, den ihnen nächstverwandten Israeliten feindlich gesinnt; von Saul wurden sie besiegt und von David unterworfen; Salomo rüstete in den edomitischen Häfen eine Handelsflotte aus. Bei der Teilung des Reiches fielen die Edomiter an Juda, lösten sich unter Joram von demselben ab, bis sie von Amazia und Usia wieder unterjocht wurden; unter Ahas rissen sie sich abermals los und halfen sogar bei der Zerstörung Jerusalems durch Nebukadnezar (586 v. Chr.). Damals bemächtigten sie sich Südpalästinas mit Hebron, wurden jedoch später von Juda, dem Makkabäer, geschlagen und von Johann Hyrkan völlig unterworfen. Ihnen entstammten der Prokurator Antipater und sein Sohn Herodes d. Gr., König von Judäa. Seit etwa 300 v. Chr. waren in das Gebirge Seïr arabische Nabatäer eingedrungen, so daß der Name E. (latinisiert Idumaea) gegen W. rückte; doch verschwindet er seit der Zerstörung Jerusalems durch Titus für immer aus der Geschichte, das Land wurde fortan in dem Namen Arabien (Arabia Petraea) inbegriffen. Bedeutendere Städte waren: Sela (griech. Petra, s. d.) und die Häfen Elath (Älana, s. d.), Bozra (s. d.) und Ezjongeber, von wo Salo…
alternative label: Edom
alternative label: Idumäer
alt label: Edom
in scheme: travel!digital Thesaurus
pref label: Edomiter

Idumäer
type: Label
in scheme: travel!digital Thesaurus

Edom
type: Label
in scheme: travel!digital Thesaurus

Edomiter
type: Label
in scheme: travel!digital Thesaurus

edomitisch
type: Label
in scheme: travel!digital Thesaurus

Maoniter
type: Concept
definition: Pierer's Universal-Lexikon 1860: Maon, 1) (a. Geogr.), Stadt im Gebirg Juda unweit des Karmel; hier wohnte Nabal. In der Nähe lag die Wüste M., wo sich David eine Zeit lang aufhielt; j. Main; 2) arabischer Volksstamm, nebst Amalekitern u. Sidoniern Feinde u. Besieger der Israeliten; 3) kleine Insel im Adriatischen Meere, an der Küste von Dalmatien (Kreis Zara) u. westlich von der Insel Pago, mit guten Weiden; 4) so v.w. Mahon. | Quelle: Pierer's Universal-Lexikon, Band 10. Altenburg 1860, S. 848. | Permalink: http://www.zeno.org/nid/20010397329
alt label: Maʿoniter
pref label: Maoniter
alternative label: Maʿoniter
in scheme: travel!digital Thesaurus

Maʿoniter
type: Label
isVariantOf: Maoniter
in scheme: travel!digital Thesaurus

Maoniter
type: Label
hasVariant: Maʿoniter
in scheme: travel!digital Thesaurus

indogermanisch
type: Concept
related match: Proto-Indo-European language
related match: Indo-European languages
definition: Duden: die Indogermanen, das Indogermanische betreffend; Abkürzung: idg. | [Anm.: unvollständig: die Indogermanen betreffend; von den Indogermanen stammend, zu ihnen gehörend] | Duden: Indogermane: Angehöriger eines der Völker, die das Indogermanische als Grundsprache haben | Meyers Großes Konversations-Lexikon 1907: Indogermānen, Sammelname für die Völker, deren Sprachen dem indogermanischen Stamm angehören (s. die »Sprachenkarte«), nämlich in Südeuropa die Griechen, die italischen Stämme, Albanesen (Illyrier), in Nordeuropa die Kelten, Germanen und Slawo-Letten, in Asien die Armenier und die Arier (Indoiranier). Der Ausdruck I., der diesen Sprach- und Volksstamm durch die am weitesten östlich wohnende und die am weitesten nach W. vorgeschobene Sprachfamilie bezeichnen sollte, wurde angefochten, als man die Zugehörigkeit der Kelten zum indogermanischen Stamm erkannte, besteht aber immer noch zu Recht, da Island westlicher liegt als das keltische Irland. Einige, namentlich englische und französische Sprachforscher gebrauchen die Bezeichnung Indoeuropäer, andre den Ausdruck Arier (s. d.), der jedoch speziell die Inder und Perser bezeichnet,[808] oder Indokelten (s. d.). Die Zeit, in der die Vorfahren der indogermanischen Stämme ein Volk bildeten, liegt weit hinter ihren historischen oder Sagenüberlieferungen zurück; es lassen sich daher über ihre Urheimat und ihre allmähliche Zerstreuung nur Vermutungen aufstellen. Lange hielt man es für wahrscheinlicher, daß die uralte Völkerwanderung der I. von O. nach W., als daß sie von W. nach O. ging, und glaubte, daß die Urheimat der I. in Zentralasien, etwa im Quellengebiet des Oxus, an den Abhängen des Hindukusch, zu suchen sei. Von neuern Forschern wird jedoch die Urheimat der I. häufiger nach Europa oder in die Grenzgebiete zwischen Europa und Asien verlegt. Nur so viel ist heute klar, daß sie nicht in der vorderindischen, der apenninischen und der pyrenäischen Halbinsel zu suchen ist, daß die I. hierhin also erst später g…
pref label: indogermanisch
in scheme: travel!digital Thesaurus
related: indisch

indogermanisch
type: Label
in scheme: travel!digital Thesaurus

Ägypter
type: Concept
definition: Duden: Einwohnerbezeichnung | [Anm.: unvollständig: Einwohnerbezeichnung zu Ägypten] | Duden: Ägypten: arabischer Staat in Nordostafrika | Meyers Großes Konversations-Lexikon 1905: Ägypten (hierzu Karte »Ägypten, Dar Für und Abessinien«), ehemals ein großes selbständiges Reich, jetzt ein unter der Hoheit des türkischen Sultans und unter englischer Oberaufsicht von einem Vizekönig regierter Staat in Nordafrika. Der Name ist griechischen Ursprungs, aber von ungewisser Bedeutung; nach Brugsch wäre das griech. Aigyptos entstellt aus Heke-Ptah, »Haus des Geistes des Ptah«. Der einheimische Name war Kêmet (schwarzes Land); diese schwarze Erde, die, vom Nil angeschwemmt, den fruchtbaren Talboden bildete, stand im Gegensatze zu dem angrenzenden Te Tescher (das Rote), der Wüste. Bei den Hebräern hieß Ä. Masar (im Dual Misraïm), in persischen Keilinschriften Mudhraja. Der heutige arabische Name ist Masr, der türkische Gipt (der abgekürzte griechische, daher Gipti, die Kopten, die unzweifelhaften Nachkommen der alten Ägypter). [...] | Nach dem Zensus von 1897 beträgt die Zahl der Einwohner Ägyptens in seinem jetzigen Umfange 9,811,544 Seelen, die sich auf die einzelnen administrativen Bezirke wie folgt verteilen: | Nicht mit inbegriffen in obiger Berechnung ist die Insel Thasos, im Privatbesitz des Chedive und von einem ägyptischen Gouverneur verwaltet. | Die Einwohnerzahl des alten A. betrug nach priesterlichen Angaben unter den Pharaonen gegen 7 Mill., die in mehr als 18,000 Städten und größern Orten wohnten. Herodot gibt zur Zeit der größten Bevölkerung unter Amasis 20,000 Städte an. Nach Diodor wurden unter dem ersten Ptolemäer über 30,000 Orte gezählt und ebensoviel noch zur Zeit jenes Berichterstatters. Josephus zählt zu Neros Zeit 71/2 Mill. Einw., wobei er die Bevölkerung von Alexandria, die zu Diodors Zeit allein 300,000 betrug, nicht mitrechnet. Zur Zeit der französischen Okkupation (1800) soll A. 2,514,000 Einw. gehabt haben, in seinem größten Umfange hatte es 171/2…
related match: Ancient Egypt
related match: Egypt
pref label: Ägypter
in scheme: travel!digital Thesaurus

Ägypter
type: Label
in scheme: travel!digital Thesaurus

aramäisch
type: Concept
pref label: aramäisch
definition: Duden: Aramäa, die Aramäer betreffend | [Anm.: unvollständig: Aramäa, die Aramäer betreffend; von den Aramäern stammend, zu ihnen gehörend; in Aramäa gelegen]
in scheme: travel!digital Thesaurus
related: Aramäer
related: Nomade

aramäisch
type: Label
in scheme: travel!digital Thesaurus

Aramäer
type: Concept
definition: Duden: Angehöriger eines westsemitischen Nomadenvolkes | Duden: Aramäa: alter Name Syriens | Meyers Großes Konversations-Lexikon 1905: Aramäa (Aram), im Alten Testament das ganze Gebiet zwischen Phönikien, Palästina, Arabien, dem Tigris und Armenien, in welchem die aramäische (syrische) Sprache geredet ward, mithin Syrien und das Mesopotamien der Griechen. Vorzugsweise ist aber A. das eigentliche Syrien mit der Hauptstadt Damaskus (Aram Damasek), dem gegenüber das Land zwischen Euphrat und Chabur als Aram Naharaim (»Syrien der beiden Flüsse«) bezeichnet wird. Als der mächtigste der aramäischen Staaten erscheint unter Saul und David Aram Zoba, südlich von Damaskus, den David glücklich bekämpfte. | Quelle: Meyers Großes Konversations-Lexikon, Band 1. Leipzig 1905, S. 667. | Permalink: http://www.zeno.org/nid/20006245676
related match: Aram (biblical region)
pref label: Aramäer
in scheme: travel!digital Thesaurus

Aramäer
type: Label
in scheme: travel!digital Thesaurus

lateinisch
type: Concept
related: Lateiner
related: römisch-katholisch
definition: bdk: die Lateiner betreffend; von den Lateinern stammend, zu ihnen gehörend | Pierer's Universal-Lexikon 1860: Lateinisch, 1) (Latinisch), was sich auf Latium bezieht; bes. 2) das in Italien, was aus Latium (s.d.) stammte, so heißen z.B. Lateinische Coloniaren die Bewohner einer mit dem Titel einer Lateinischen Colonie beschenkten Stadt in Italien; insbes. 3) so v.w. Römisch, da Rom die vornehmste Stadt Latiums u. die Römer das mächtigste Volk Latiums waren; so Lateinische Sprache, s. Römische Sprache; während des Mittelalters stehen dem Lateinischen als Sprache der Kirche u. der Gelehrsamkeit die Romanischen u. die Germanischen Volkssprachen gegenüber (s. Romanische Sprachen, Mittellateinisch u. Neulateinisch); Lateinische Schule, früher so v.w. Gymnasium, weil da bes. Latein gelehrt wurde: Lateinische Säule, so v.w. Römische Säule, s.u. Säule; daher hieß später L. 4) so v.w. abendländisch, im Gegensatz von Byzantinisch (morgenländisch), daher wurde das 1204 von den welschen Kreuzfahrern an der Stelle des Byzantinischen Reichs in Constantinopel errichtete u. bis 1261 bestehende Kaiserthum das Lateinische Kaiserthum genannt, s.u. Byzantinisches Reich E). Auch auf die kirchlichen Verhältnisse angewendet, war L. 5) so v.w. Römisch. katholisch, daher Lateinische Kirche, Lateinische Geistlichkeit, im Gegensatz zur Morgenländischen od. Griechisch-katholischen Kirche. Lateinisches Kreuz, s.u. Kreuz. | Quelle: Pierer's Universal-Lexikon, Band 10. Altenburg 1860, S. 141. | Permalink: http://www.zeno.org/nid/20010316787
in scheme: travel!digital Thesaurus
pref label: lateinisch
pref label: latinus
preferred label: latinus @la

Lateiner
type: Concept
pref label: Lateiner
in scheme: travel!digital Thesaurus
definition: Meyers Großes Konversations-Lexikon 1908: Lateiner, Latein Redende oder Verstehende; die Bewohner des ehemaligen weströmischen Reiches im Gegensatz zu den Byzantinern; lateinisch, auf Latein bezüglich, insbes. soviel wie abendländisch, im Gegensatz zu byzantinisch; endlich im Volksmunde gebraucht für pedantisches, unpraktisches Wesen, wie es Gelehrte zeigen, z. B. lateinische Farmer (in Amerika); lateinische Jäger, soviel wie Sonntagsjäger etc. | Quelle: Meyers Großes Konversations-Lexikon, Band 12. Leipzig 1908, S. 215. | Permalink: http://www.zeno.org/nid/2000697855X
related: römisch-katholisch

Lateiner
type: Label
in scheme: travel!digital Thesaurus

römisch-katholisch
type: Concept
pref label: römisch-katholisch
pref label: roman catholic
definition: Duden: der katholischen Kirche, die den Papst in Rom als ihr Oberhaupt anerkennt, zugehörend, sie betreffend; Abkürzungen: r.-k., röm.-kath.
in scheme: travel!digital Thesaurus
alternative label: römisch katholisch
alt label: römisch katholisch
preferred label: roman catholic @en

römisch-katholisch
type: Label
hasVariant: römisch katholisch
in scheme: travel!digital Thesaurus
hasTranslation: roman catholic

römisch katholisch
type: Label
isVariantOf: römisch-katholisch
in scheme: travel!digital Thesaurus

roman catholic
type: Label
isTranslationOf: römisch-katholisch
in scheme: travel!digital Thesaurus

lateinisch
type: Label
in scheme: travel!digital Thesaurus
hasTranslation: latinus

latinus
type: Label
in scheme: travel!digital Thesaurus
isTranslationOf: lateinisch

tscherkessisch
type: Concept
related: Tscherkesse
pref label: tscherkessisch
in scheme: travel!digital Thesaurus
definition: Duden: die Tscherkessen betreffend, von ihnen stammend, zu ihnen gehörend

Tscherkesse
type: Concept
definition: Duden: Angehöriger einer Gruppe kaukasischer Volksstämme | Meyers Großes Konversations-Lexikon 1909: Tscherkessen (Adighe nach eigner, Zirkassier nach europäischer Benennung; s. Tafel »Asiatische Völker II«, Fig. 8), arischer Volksstamm, der zur westlichen Gruppe der Kaukasusvölker gehört, früher das Ostufer des Schwarzen Meeres, die Westhälfte des Kaukasus, die Ebenen am Kuban, zum großen Teil auch die Kabardinische Ebene bewohnte, jetzt aber zum großen Teil (seit 1858) auf türkisches Gebiet (Kleinasien, Syrien, Palästina, Europa) ausgewandert ist. Auf russischem Gebiet wohnen in Ziskaukasien in den Provinzen Kuban 69,000 (hier Abadsechen, Schapßugen, Natuchaier genannt) und Terek 82,000 (hier Kabardiner genannt), im Schwarzen Meer-Bezirk 1400, so daß die Gesamtzahl aller T. in Kaukasien auf über 152,400 geschätzt werden kann. Ein jetzt stark zusammengeschmolzener verwandter Stamm der T. sind die Abchasen (s. d.). Die T. sind ein schöner Menschenschlag von reichlich mittlerer Statur, schlank und kräftig, mit edlen, sein geformten Gesichtern und braunen, zuweilen blonden Haaren. Früher bekannten sie sich teils zum armenischen, teils zum orthodox-griechischen Christentum, haben aber später den Islam angenommen; doch sind nur die Häuptlinge und Vornehmen als Mohammedaner anzusehen, bei dem Volk haben sich sowohl christliche Gebräuche als zahlreiche Spuren des alten Heidentums erhalten. Die Sprache der T., selbständig für sich dastehend, ist kenntlich an vielen Gurgeltönen, reich, zur Poesie geeignet und zerfällt in einen nördlichen (Abesech) und südlichen (Ubuch) Dialekt (s. Kaukasische Sprachen). Sie haben Sänger (Kikoakoa), die in hohem Ansehen stehen. Vgl. L'Huilier, Russisch-tscherkessisches Wörterbuch und Grammatik (Odessa 1846); Löwe, Circassian dictionary (Lond. 1854). Seit der Einführung des Korans hat die arabische Sprache sich bedeutend ausgebreitet, und in ihr werden auch die Dokumente ausgestellt. Die Tracht der Männer, bestehend in langem Rock, Tscherkeßk…
in scheme: travel!digital Thesaurus
pref label: Tscherkesse

Tscherkesse
type: Label
in scheme: travel!digital Thesaurus

tscherkessisch
type: Label
in scheme: travel!digital Thesaurus

Gerisiter
type: Concept
definition: bdk: kanaanitischer Stamm
related: Kanaʿaniter
in scheme: travel!digital Thesaurus
pref label: Gerisiter

Gerisiter
type: Label
in scheme: travel!digital Thesaurus

Berytier
type: Concept
definition: bdk: Einwohnerbezeichnung zu Berytos (heute Beirut) | Duden: Beirut: Hauptstadt des Libanons | Brockhaus' Kleines Konversations-Lexikon 1911: Berȳtos, im Altertum Stadt in Phönizien, nördl. von Sidon, jetzt Beirut. | Quelle: Brockhaus' Kleines Konversations-Lexikon, fünfte Auflage, Band 1. Leipzig 1911., S. 193. | Permalink: http://www.zeno.org/nid/20000953423 | Meyers Großes Konversations-Lexikon 1905: Beirût (Berût), Hauptstadt des gleichnamigen türk. Wilajets (mit den Liwas Ladikîe, Tarabulus, B., Akka und Belka) in Syrien, am Mittelmeer unter 33°54´ nördl. Br. am Fuß des Libanon malerisch gelegen (s. den Plan). | Die Stadt hat enge, krumme Straßen, aber große Vorstädte, die ausgedehnte schöne Gärten umgeben, und gilt als der gesündeste Ort der ganzen Küste (trotz ihrer großen Sommerhitze). Dem Wassermangel hat seit 1875 eine Leitung vom Fluß Nahr el Kelb her abgeholfen. B. zählt 120,000 Einw., von denen ein Drittel Mohammedaner, zwei Drittel Christen (orthodoxe Griechen, Maroniten und unierte Griechen) sind. Dazu 2000 Europäer. Die Eingebornen betreiben Weinbau, Seidenraupenzucht, Seiden- und Baumwollweberei, verfertigen Gold- und Silberarbeiten, besonders aber beschäftigen sie sich mit Handel. B. ist der wichtigste Hafenplatz Syriens, namentlich für Damaskus, befindet sich aber im Rückgang. Eine Straße und daneben eine Eisenbahn führen über den Libanon nach Damaskus. Der Verkehr belief sich 1901 auf 774 Dampfer von 1,015,709 Ton. und 3535 Segelschiffe von 82,979 T. Der bedeutendste Ausfuhrgegenstand (im Jahresdurchschnitt für 10 Mill. Mk.) ist Rohseide. 1889 begann eine französische Gesellschaft den Bau eines neuen, guten Hafens, der 1893 dem Verkehr übergeben worden ist. B. ist Sitz eines griechisch-orthodoxen Bischofs, eines maronitischen Erzbischofs, eines griechisch-unierten Bischofs und eines päpstlichen Delegierten und der Mittelpunkt der amerikanischen Mission für die Evangelisierung Syriens, Sitz eines deutschen Generalkonsuls und zahlreicher Konsuln an…
pref label: Berytier
in scheme: travel!digital Thesaurus
related match: Beirut
related: Beirûter

Berytier
type: Label
in scheme: travel!digital Thesaurus

Beirûter
type: Concept
definition: Duden: Einwohnerbezeichnung | [Anm.: unvollständig: Einwohnerbezeichnung zu Beirut] | Meyers Großes Konversations-Lexikon 1905: Beirût (Berût), Hauptstadt des gleichnamigen türk. Wilajets (mit den Liwas Ladikîe, Tarabulus, B., Akka und Belka) in Syrien, am Mittelmeer unter 33°54´ nördl. Br. am Fuß des Libanon malerisch gelegen (s. den Plan). | Die Stadt hat enge, krumme Straßen, aber große Vorstädte, die ausgedehnte schöne Gärten umgeben, und gilt als der gesündeste Ort der ganzen Küste (trotz ihrer großen Sommerhitze). Dem Wassermangel hat seit 1875 eine Leitung vom Fluß Nahr el Kelb her abgeholfen. B. zählt 120,000 Einw., von denen ein Drittel Mohammedaner, zwei Drittel Christen (orthodoxe Griechen, Maroniten und unierte Griechen) sind. Dazu 2000 Europäer. Die Eingebornen betreiben Weinbau, Seidenraupenzucht, Seiden- und Baumwollweberei, verfertigen Gold- und Silberarbeiten, besonders aber beschäftigen sie sich mit Handel. B. ist der wichtigste Hafenplatz Syriens, namentlich für Damaskus, befindet sich aber im Rückgang. Eine Straße und daneben eine Eisenbahn führen über den Libanon nach Damaskus. Der Verkehr belief sich 1901 auf 774 Dampfer von 1,015,709 Ton. und 3535 Segelschiffe von 82,979 T. Der bedeutendste Ausfuhrgegenstand (im Jahresdurchschnitt für 10 Mill. Mk.) ist Rohseide. 1889 begann eine französische Gesellschaft den Bau eines neuen, guten Hafens, der 1893 dem Verkehr übergeben worden ist. B. ist Sitz eines griechisch-orthodoxen Bischofs, eines maronitischen Erzbischofs, eines griechisch-unierten Bischofs und eines päpstlichen Delegierten und der Mittelpunkt der amerikanischen Mission für die Evangelisierung Syriens, Sitz eines deutschen Generalkonsuls und zahlreicher Konsuln andrer Mächte; sie zählt 6 Hospitäler, 23 Moscheen, 36 Kirchen, 66 Knaben- und 36 Mädchenschulen, 13 Druckereien, 12 arabische Zeitungen. Außer den Amerikanern wirken dort durch Unterricht, Mission und Krankenpflege der preußische Johanniterorden, die Kaiserswerther [574] Diakonis…
related match: Beirut
pref label: Beirûter
in scheme: travel!digital Thesaurus

Beirûter
type: Label
in scheme: travel!digital Thesaurus

Pontier
type: Concept
related match: Kingdom of Pontus
pref label: Pontier
in scheme: travel!digital Thesaurus
definition: bdk: Einwohnerbezeichnung zu Pontos | Meyers Großes Konversations-Lexikon 1908: Pontos (lat. Pontus), Name der nordöstlichsten Landschaft von Kleinasien (s. Karte »Römisches Reich«), die ursprünglich teils zu Kappadokien gehörte, teils das Gebiet der unabhängigen Tibarener, Mosynösen, Makronen etc. gebildet hatte. Als eigentlicher Gründer gilt Mithradates II. (337–302), der die Grenzen des Reiches seiner beiden Vorgänger bedeutend erweiterte. Unter Mithradates VI. (120–63) wurde es bis zum Kimmerischen Bosporus ausgedehnt, umfaßte fast alle Küsten des Pontus Euxinus und soll davon seinen später eingeschränkten Namen P. erhalten haben. Damals erreichte es seine größte Blüte, aber auch zugleich sein Ende. Als Pompejus den Mithradates besiegt hatte, wurde der Küstenstrich zu Bithynien (seit 74 römische Provinz) geschlagen (Provincia Bithynia et Pontus), während der Rest an einheimische Fürsten verteilt wurde. So erhielt Dejotarus von Galatien das westliche Binnenland zwischen Iris und Halys, das den Namen Pontus Galaticus auch als römische Provinz fortführte, ebenso wie der P. Polemoniacus, das von Antonius an König Polemon verliehene Gebiet am Lykos. Der östliche Teil aber, den derselbe Polemon beherrscht hatte, kam mit der Hand seiner Witwe Pythodoris an Archelaos von Kappadokien und hieß seitdem P. Cappadocius. Im P. Polemoniacus aber folgte Polemon II., der sein Reich (63 n. Chr.) an Nero abtrat. In der diokletianischen Reichseinteilung war P. Name einer Diözese der Präfektur Oriens und umfaßte Bithynien, Paphlagonien, Galatien, Kappadokien, Kleinarmenien und den eigentlichen Pontus. Das Hauptgebirge von P. ist der Paryadres (Balchar Dagh), der den ganzen Osten des Landes erfüllt. Dort saßen rohe, kriegerische Bergvölker: Tibarener, Mosynöken, Chalyben (mit Eisengruben), Sannen, Kolchier, wahrscheinlich den Stämmen des Kaukasus verwandt. Der Westen dagegen war infolge der assyrischen Eroberungen an der Küste von semitischen Kolonien (Leukosyrer) besetzt; dazwischen…

Pontier
type: Label
in scheme: travel!digital Thesaurus

judäisch
type: Concept
definition: bdk: Judäa, die Judäer betreffend; von den Judäern stammend, zu ihnen gehörend; in Judäa gelegen
pref label: judäisch
in scheme: travel!digital Thesaurus
related: Judäer

judäisch
type: Label
in scheme: travel!digital Thesaurus

Judäer
type: Concept
alt label: Juda
in scheme: travel!digital Thesaurus
pref label: Judäer
related match: Judea
definition: Duden: Juda: Sitz des Stammes Juda in und um Jerusalem | Duden: Judäa: (in der griechisch-römischen Antike) [Süd]palästina | Meyers Großes Konversations-Lexikon 1907: Juda (ben Samuel) ha-Levi, mit dem arab. Namen Abu'l Hassan, geb. um 1085 in Kastilien, widmete sich anfänglich dem ärztlichen Beruf, dann aber, nachdem er mit Abraham und Moses ibn Esra, mit Juda und Salomo ibn Giat, mit Salomo Parchon u. a. bekannt geworden, der Dichtkunst und Philosophie. Nach 1140 befriedigte er seine Sehnsucht, nach Palästina zu pilgern, reiste über Ägypten und Arabien nach Damaskus, wie wir aus seinen Gedichten entnehmen. Der Sage nach ward er, sein Zionslied dichtend, vor den Toren Jerusalems von einem Araber getötet. Judas synagogale Dichtungen sind in den Gebetbüchern aller jüdischen Riten, besonders der orientalischen, zu finden. Seine Gedichtsammlung »Diwân« ward von Luzzato (Lyck 1864) und kritisch bearbeitet von Brody (Berl. 1901 ff.), größere Partien in Übersetzung und mit Biographie des Dichters von A. Geiger (Bresl. 1851), eine Auswahl in deutscher Übertragung von A. Geiger, S. Heller u. a. (Berl. 1893) herausgegeben. Sie gehört zu dem Edelsten und Formvollendetsten, was die Muse der spanischen Juden geschaffen. Als Religionsphilosoph zeichnete er sich aus durch den in arabischer Sprache geschriebenen »Al-Chazari« (Text von Hirschfeld, Leipz. 1886–87, 2 Tle.), ins Hebräische von Juda ibn Tibbon, ins Lateinische von Buxtorf, ins Deutsche übersetzt von D. Cassel (2. Aufl., Leipz. 1869) und Hirschfeld (das. 1885). | Quelle: Meyers Großes Konversations-Lexikon, Band 10. Leipzig 1907, S. 326. | Permalink: http://www.zeno.org/nid/20006846548 | Meyers Großes Konversations-Lexikon 1907: Judäa, zu Jesu Zeit Bezeichnung für den südlichsten Teil Palästinas diesseit des Jordans zwischen diesem, dem Toten Meer, Idumäa, dem Mittelländischen Meer und Samaria, somit das Gebiet der Stämme Juda und Simeon sowie einen Teil von Dan und Benjamin umfassend. Das Land war nur im W. eben, im üb…
alternative label: Juda
related match: Kingdom of Judah

Juda
type: Label
in scheme: travel!digital Thesaurus

Judäer
type: Label
in scheme: travel!digital Thesaurus

Pueblo-Indianer
type: Concept
definition: Duden: Puebloindianer | Meyers Großes Konversations-Lexikon 1908: Puēbloindianer, Bewohner der sogen. Pueblos in Arizona, d. h. großer, aus Steinen oder Luftziegeln (adobes) erbauter mehrstöckiger, festungsartiger Bauten. Die einzelnen Stockwerke dieser teils im Tal, teils auf steilen Felsenplateaus erbauten Pueblos steigen von dem viereckigen oder kreisförmigen Innenraum terrassenförmig auf, bilden dagegen nach außen eine senkrechte Wand. Leitern ermöglichen den Zugang zu den obern Terrassen. Ähnlichen Charakter zeigen die verlassenen Cave dwellings oder Cliffhouses, Höhlenbauten in den senkrechten Uferwänden der Canons des Colorado, Gila und Rio Grande. Eine berühmte Ruinenstätte sind die Casas grandes im Tal des San Miguel im nördlichen Arizona, deren Erbauer wahrscheinlich die Pima (s. d.) waren. Außer ihnen gehören noch die Moqui (s. d.) zum sonorischen Zweig des uto-aztekischen Sprachstammes. Die übrigen P. zerfallen in drei Sprachstämme, den Kera-Sprachstamm mit den Pueblos von Kera oder Querez, Cochiti, Acoma u. a., den Tehua-Sprachstamm mit den Jemes, Tanos und Tehuas und die Zuni (s. d.). Die P. trieben schon zur Zeit der Entdeckung Ackerbau, bewässerten die Felder, hielten Hunde und Hühner als Haustiere und verarbeiteten Metalle zu Schmuckgegenständen. Die Frauen verfertigten Tonwaren und aus Rindenfasern und Gräsern Matten und Kleider. S. die Tafeln »Amerikanische Völker I«, Fig. 16, und »Indianische Kultur I«, Fig. 13 u. 18. Vgl. Gust. Nordenskjöld, The cliff-dwellers of the [438] Mesa Verde (Stockh. 1893); Beltrany Rozpide, Los Pueblos hispano-americanosen el siglo XX (Madr. 1904). | Quelle: Meyers Großes Konversations-Lexikon, Band 16. Leipzig 1908, S. 438-439. | Permalink: http://www.zeno.org/nid/20007299990
pref label: Pueblo-Indianer
in scheme: travel!digital Thesaurus
related: Indianer

Pueblo-Indianer
type: Label
in scheme: travel!digital Thesaurus

Mexikaner
type: Concept
definition: Duden: Einwohnerbezeichnung zu Mexiko | Duden: Mexiko: Staat in Nord- bzw. Mittelamerika | Meyers Großes Konversations-Lexikon 1908: Mexiko (Estados unidos de Méjico, spr. mĕchiko: hierzu die Karte »Mexiko«), Bundesrepublik im südlichen Nordamerika, zwischen 14°56'–32°22' nördl. Br. und 86°49'–117°9' westl. L., zur Hälfte nördlich, zur Hälfte südlich vom Wendekreise des Krebses gelegen, grenzt gegen N. an die Vereinigten Staaten, gegen SO. an Guatemala und Britisch-Honduras, während es im O. auf 2580 km langer Strecke vom Golf von M. und vom Karibischen Meer, im S. und W. (6250 km) vom Stillen Ozean bespült wird, und hat einschließlich der Inseln (4042 qkm) ein Areal von 1,987,201 qkm. Die Grenze gegen die Union ist auf langer Linie (im NO.) durch den Rio Grande del Norte mit seinen wilden Canonschluchten bezeichnet, die Grenze gegen Guatemala auf kürzerer durch den Oberlauf des Rio Usumacinta, die Grenze gegen Britisch-Honduras durch den Rio Hondo. Der große Vorteil, geradeso wie die Union zugleich von zwei Weltmeeren bespült zu werden, wird durch die Beschaffenheit der Küsten und die Bodengestalt sehr vermindert. Das flache Gestade entlang dem Mexikanischen Golf und dem Karibischen Meer hatte von Natur bloß bei der Insel Carmen einen tiefen Zugang, während es bei Veracruz nur eine durch Korallenklippen und Inseln schlecht geschützte Reede, bei Matamoros, Soto la Marina, Tampico, Tuxpan, Alvarado, Coatzacoalcos nur seichte Lagunenöffnungen und Strommündungen bot, so daß bei Veracruz und Tampico große Kunsthafenanlagen nötig waren. Auch Yukatan hat bei Campeche, Sisal und Progreso nur offene Reeden. Die Küste des Stillen Ozeans besitzt bei Acapulco (s. d.) und Guaymas (s. d.) vorzügliche Naturhäfen, sie sind aber vom Innern her sehr schwer zu erreichen. Die Buchten von San Blas und Mazatlan lassen nur kleinere Schiffe zu, und die von Salina Cruz, Puerto Angeles, Sihuatanejo, Altata u. a. liegen dem Seegang aus W. und SW. zu offen, während bei Tonala und Tapachula nu…
in scheme: travel!digital Thesaurus
related match: Mexico
pref label: Mexikaner

Mexikaner
type: Label
in scheme: travel!digital Thesaurus

ägyptisch
type: Concept
definition: Duden: 1. Ägypten, die Ägypter betreffend; von den Ägyptern stammend, zu ihnen gehörend | [Anm.: unvollständig: Ägypten, die Ägyper betreffend; von den Ägyptern stammend, zu ihnen gehörend; in Ägypten gelegen]
narrower: oberägyptisch
narrower: syrisch-ägyptisch
narrower: ägyptisch-arabisch
narrower: äthiopisch-ägyptisch
pref label: egyptian
narrower: hellenisch-ägyptisch
narrower: ägyptisch-griechisch
narrower: halbägyptisch
pref label: égyptien
narrower: ostägyptisch
pref label: ägyptisch
preferred label: égyptien @fr
preferred label: egyptian @en
in scheme: travel!digital Thesaurus
narrower: englisch-ägyptisch
alt label: altägyptisch
related: Ägypter
alternative label: altägyptisch

oberägyptisch
type: Concept
in scheme: travel!digital Thesaurus
pref label: oberägyptisch
definition: bdk: siehe ägyptisch

oberägyptisch
type: Label
in scheme: travel!digital Thesaurus

syrisch-ägyptisch
type: Concept
in scheme: travel!digital Thesaurus
definition: bdk: siehe syrisch, ägyptisch
pref label: syrisch-ägyptisch

syrisch-ägyptisch
type: Label
in scheme: travel!digital Thesaurus

ägyptisch-arabisch
type: Concept
alternative label: ägypto-arabisch
alt label: ägypto-arabisch
in scheme: travel!digital Thesaurus
pref label: ägyptisch-arabisch
definition: bdk: siehe ägyptisch, arabisch

ägypto-arabisch
type: Label
isVariantOf: ägyptisch-arabisch
in scheme: travel!digital Thesaurus

ägyptisch-arabisch
type: Label
hasVariant: ägypto-arabisch
in scheme: travel!digital Thesaurus

egyptian
type: Label
isTranslationOf: ägyptisch
in scheme: travel!digital Thesaurus
hasTranslation: égyptien

ägyptisch
type: Label
hasTranslation: égyptien
hasTranslation: egyptian
in scheme: travel!digital Thesaurus

égyptien
type: Label
isTranslationOf: ägyptisch
hasTranslation: egyptian
in scheme: travel!digital Thesaurus

hellenisch-ägyptisch
type: Concept
definition: bdk: siehe hellenisch, ägyptisch
pref label: hellenisch-ägyptisch
in scheme: travel!digital Thesaurus
related: ägyptisch-griechisch

hellenisch-ägyptisch
type: Label
in scheme: travel!digital Thesaurus

ägyptisch-griechisch
type: Concept
pref label: ägyptisch-griechisch
definition: bdk: siehe ägyptisch, griechisch
in scheme: travel!digital Thesaurus

ägyptisch-griechisch
type: Label
in scheme: travel!digital Thesaurus

halbägyptisch
type: Concept
definition: bdk: siehe ägyptisch
in scheme: travel!digital Thesaurus
pref label: halbägyptisch

halbägyptisch
type: Label
in scheme: travel!digital Thesaurus

ostägyptisch
type: Concept
in scheme: travel!digital Thesaurus
pref label: ostägyptisch
definition: bdk: siehe ägyptisch

ostägyptisch
type: Label
in scheme: travel!digital Thesaurus

englisch-ägyptisch
type: Concept
preferred label: anglo-egyptian @en
in scheme: travel!digital Thesaurus
pref label: anglo-egyptian
definition: bdk: siehe englisch, ägyptisch
pref label: englisch-ägyptisch

anglo-egyptian
type: Label
isTranslationOf: englisch-ägyptisch
in scheme: travel!digital Thesaurus

englisch-ägyptisch
type: Label
hasTranslation: anglo-egyptian
in scheme: travel!digital Thesaurus

altägyptisch
type: Label
in scheme: travel!digital Thesaurus

birmanisch
type: Concept
definition: Duden: Birma, die Birmanen betreffend; aus Birma stammend | [Anm.: unvollständig: Birma, die Birmanen betreffend; von den Birmanen stammend, zu ihnen gehörend; in Birma gelegen]
in scheme: travel!digital Thesaurus
pref label: birmanisch
narrower: englisch-birmanisch
related: Birmane

birmanisch
type: Label
in scheme: travel!digital Thesaurus

englisch-birmanisch
type: Concept
in scheme: travel!digital Thesaurus
definition: bdk: siehe englisch, birmanisch
pref label: englisch-birmanisch

englisch-birmanisch
type: Label
in scheme: travel!digital Thesaurus

Birmane
type: Concept
in scheme: travel!digital Thesaurus
related match: Myanmar
pref label: Birmane
preferred label: burman @en
pref label: burman
definition: Duden: Einwohnerbezeichnung | [Anm.: unvollständig: Einwohnerbezeichnung zu Birma]| Duden: Birma: früherer Name von Myanmar | Meyers Großes Konversations-Lexikon 1905: Birma (Burma, Barma oder Reich der Mranma, einheimischer Name, früher auch Reich von Ava), Provinz des britisch-ind. Reiches in Hinterindien (s. Karte »Hinterindien«), begrenzt von Assam, Bengalen und der Bai von Bengalen im W., dem Meerbusen von Pegu und Siam im S., von Siam, Tongking und China (Jünnan) im O., von Tibet im N., zwischen 10–281/4° nördl. Br. und 92–1023/4° östl. L., besteht aus dem seit 1826 und 1852 britischen Niederbirma, 220,075 qkm mit (1901) 5,371,328 Einw., und dem 1886 eroberten Oberbirma, 318,275 qkm mit (1901) 3,849,833 Einw. Zu letzterm kommen noch Luschai- und Katschinland und die Schanstaaten, so daß sich das Gesamtareal der Provinz auf 686,350 qkm und die Bevölkerungsziffer auf 9,642,621 erhöht. Das Land wird von mehreren noch wenig erforschten Meridiangebirgen durchzogen; in den durch sie gebildeten Längstälern fließen ansehnliche Ströme südwärts zum Meer: zwischen Arakan-Joma- und Pegu-Jomagebirge der Irawadi, weiter östlich trennt den kleinern Sittang das Pungi-Lunggebirge vom Salwen und diesen das langgestreckte Tanen-Tung-Gjigebirge vom obern Mekhong, der das östliche Schangebiet durchzieht. Letzteres scheidet der scharfe Kamm des Tran-Ninh von Tongking. Im N. treten Ausläufer des östlichsten Himalaja (Patkoigebirge, Schuodung-Gjigebirge) ins Land ein. Für den Verkehr ist der von der Mündung bis nahe an die Nordgrenze schiffbare Irawadi von größter Wichtigkeit. Von den bedeutenden Seen des Innern weiß man noch sehr wenig. Geologisch lassen sich drei nordsüdlich verlaufende Zonen unterscheiden: 1) eine westliche von den Nagabergen aus südlich bis zum Kap Negraïs, ein Kettengebirge, aufgebaut aus Trias von alpinem Charakter, Kreidesedimenten, mächtigen versteinerungslosen, flyschähnlichen Schiefern und Sandsteinen, Nummulitenkalk und jüngerm Tertiär, 2) eine mittlere, d…

Birmane
type: Label
hasTranslation: burman
in scheme: travel!digital Thesaurus

burman
type: Label
isTranslationOf: Birmane
in scheme: travel!digital Thesaurus

Lenni Lennape
type: Concept
pref label: Lenni Lennape
alt label: Delaware
alternative label: Delaware
definition: Meyers Großes Konversations-Lexikon 1906: Delawaren (Lenni Lenape), Indianerstamm der Algonkin in Nordamerika, jetzt kaum 1000 Köpfe stark, bewohnte ehedem das Tal des Delaware und den Küstenstrich südlich bis Kap Hatteras und bildete mit seinen Unterabteilungen und den Mohikanern den mächtigen Fünfvölkerbund. Mit der steigenden Macht der Irokesen verloren die D. ihre Unabhängigkeit und gingen immer weiter nach Westen zurück, bis sie sich schließlich im Indianergebiet niederließen. Sie treiben etwas Ackerbau und Viehzucht, ihre Hauptbeschäftigung aber ist Jagen und Fischen. Ihrer Sprache verdankt die Länderkunde Namen wie Massachusetts, Alleghany, Connecticut, Mississippi. Eine Grammatik derselben lieferte Zeisberger (Philad. 1827), ein Wörterbuch Brinton (das. 1888). Vgl. Heckewelder, Narrative of the mission of the United Brethren among the Delaware and Mohegan Indians (Philad. 1820); Brinton, The Lenâpé and their legends (das. 1885). | Quelle: Meyers Großes Konversations-Lexikon, Band 4. Leipzig 1906, S. 606. | Permalink: http://www.zeno.org/nid/20006474403
in scheme: travel!digital Thesaurus
related: Indianer

Lenni Lennape
type: Label
in scheme: travel!digital Thesaurus

Delaware
type: Label
in scheme: travel!digital Thesaurus

Franzose
type: Concept
definition: Duden: 1. Einwohnerbezeichnung zu Frankreich | Duden: Frankreich: Staat in Westeuropa | siehe auch: Meyers Großes Konversations-Lexikon 1906: Frankreich | Quelle: Meyers Großes Konversations-Lexikon, Band 6. Leipzig 1906, S. 845-898. | Permalink: http://www.zeno.org/nid/20006630197
in scheme: travel!digital Thesaurus
pref label: Franzose
narrower: Südfranzose
related match: France

Franzose
type: Label
in scheme: travel!digital Thesaurus

Südfranzose
type: Concept
in scheme: travel!digital Thesaurus
pref label: Südfranzose
definition: bdk: siehe Franzose

Südfranzose
type: Label
in scheme: travel!digital Thesaurus

Stockbridge-Indianer
type: Concept
definition: bdk: Ethnie im Bundesstaat Massachusetts
pref label: Stockbridge-Indianer
in scheme: travel!digital Thesaurus
related: Indianer

Stockbridge-Indianer
type: Label
in scheme: travel!digital Thesaurus

Jebusiter
type: Concept
definition: Meyers Großes Konversations-Lexikon 1907: Jebusīter (Jebusäer), kanaanitische Völkerschaft in Palästina, auf dem Gebirge Juda ansässig, ward von Josua in einer Feldschlacht mit andern kanaanitischen Stämmen bekämpft, behauptete sich aber in der Feste Jebus (dem spätern Jerusalem) noch zur Richterzeit. Erst David vertreibt sie aus der Stadt und Burg (dem Zion), und die letzten Reste der J. macht Salomo tributpflichtig. | Quelle: Meyers Großes Konversations-Lexikon, Band 10. Leipzig 1907, S. 216. | Permalink: http://www.zeno.org/nid/2000683941X
in scheme: travel!digital Thesaurus
pref label: Jebusiter

Jebusiter
type: Label
in scheme: travel!digital Thesaurus

Zanzibarit
type: Concept
related match: Zanzibar
definition: bdk: Einwohnerbezeichnung zu Zanzibar | Duden: Sansibar: Insel an der Ostküste Afrikas | Meyers Großes Konversations-Lexikon 1909: Sansĭbar (Zanzibar, Sanguebar), mohammedanisches Reich in Ostafrika (s. Karte »Deutsch-Ostafrika«) unter einem Sultan, der jedoch unter englischem Protektorat steht. Außer den Inseln S. (s. unten) mit 250,000 Einw. und Pemba (s. d.) mit 50,000 Einw. umfaßt (seit 1895) sein Gebiet auf dem Festland den Küstenstrich von 16 km Breite (vom Hochwasserstand aus gerechnet) vom Umbafluß im Süden bis zum Kipini am Osi im N., eine Reihe von Küsteninseln zwischen dem Osi und Jub und die Stadt Kismaju und deren Gebiet im Umkreise von 16 km. Diese Küstengebiete werden, nominell der Souveränität des Sultans (oder Seyyid) von S. unterstehend, gegen eine jährliche Rente von 17,000 Pfd. Sterl. von der britischen Regierung verwaltet und sind der Provinz Seyyidieh (s. d.) des Britisch-Ostafrika-Protektorats (Hauptstadt Mombasa) einverleibt. Dem Sultan steht ein aus sieben Mitgliedern (Engländern) bestehendes Ministerium zur Seite, wie auch England tatsächlich die Verwaltung und die Justiz (Fremde und Sklaven betreffend) in der Hand hat; ebenso unterhält es dort eine Truppe von 900 Mann. Der Sultan hat eine Leibgarde von 150 Mann, ein Wacht- und Salutschiff und 2 Handelsdampfer. Seine Einkünfte bezieht er aus den Zöllen, doch müssen alle öffentlichen Ausgaben neben seiner Sanktion die Englands haben. Er läßt Münzen schlagen (auf Grundlage des Theresientalers), während im Handel nach indischen Rupien gerechnet wird. Der Silberdollar von 4 Rupa zu 25 Cents hat den festen Wert von 34 Anna zu 4 Pesa = 2,894 Mk., und die Rupie gilt 47 Cents. Alle nichtindischen Rupien sind seit 1903 im Verkehr verboten. Der Sultan hat eigne rote Flagge (s. Tafel »Flaggen I«), auch einen Orden vom Strahlenden Stern in mehreren Klassen, der ausschließlich an Europäer verliehen wird (s. Tafel »Orden III«, Fig. 6), aber seine Unabhängigkeit ist nur noch Schein. – Früh haben die Arabe…
pref label: Zanzibarit
in scheme: travel!digital Thesaurus

Zanzibarit
type: Label
in scheme: travel!digital Thesaurus

Huwêtât
type: Concept
definition: bdk: arabische Stammesgemeinschaft in Syrien
alternative label: Huwêtât-Beduine
alt label: Huwêtât-Beduine
pref label: Huwêtât
in scheme: travel!digital Thesaurus
related: Beduine

Huwêtât-Beduine
type: Label
in scheme: travel!digital Thesaurus

Huwêtât
type: Label
in scheme: travel!digital Thesaurus

portugiesisch
type: Concept
narrower: oldenburg-portugiesisch
pref label: portugêz
related: Portugiese
in scheme: travel!digital Thesaurus
narrower: franko-portugiesisch
narrower: spanisch-portugiesisch
definition: Duden: Portugal, die Portugiesen betreffend; von den Portugiesen stammend, zu ihnen gehörend | [Anm.: unvollständig: Portugal, die Portugiesen betreffend; von den Portugiesen stammend, zu ihnen gehörend; in Portugal gelegen]
pref label: portugiesisch
preferred label: portugêz @pt

oldenburg-portugiesisch
type: Concept
definition: bdk: siehe oldenburgisch, portugiesisch
pref label: oldenburg-portugiesisch
in scheme: travel!digital Thesaurus

oldenburg-portugiesisch
type: Label
in scheme: travel!digital Thesaurus

portugêz
type: Label
isTranslationOf: portugiesisch
in scheme: travel!digital Thesaurus

portugiesisch
type: Label
hasTranslation: portugêz
in scheme: travel!digital Thesaurus

franko-portugiesisch
type: Concept
pref label: franko-portugiesisch
preferred label: franco-portugais @fr
comment: Mittelmeer 1909: nur französisch
related: französisch
pref label: franco-portugais
in scheme: travel!digital Thesaurus
definition: bdk: siehe französisch, portugiesisch

franko-portugiesisch
type: Label
hasTranslation: franco-portugais
in scheme: travel!digital Thesaurus

franco-portugais
type: Label
isTranslationOf: franko-portugiesisch
in scheme: travel!digital Thesaurus

französisch
type: Concept
preferred label: french @en
narrower: französisch-gotisch
narrower: südfranzösisch
pref label: französisch
preferred label: francés @es
pref label: french
in scheme: travel!digital Thesaurus
narrower: französisch-indisch
pref label: français
related: Franzose
narrower: französisch-romanisch
preferred label: français @fr
narrower: englisch-französisch
preferred label: fransâwi @ar
narrower: französisch-englisch
pref label: fransâwi
definition: Duden: 1. die Franzosen, Frankreich betreffend | [Anm.: unvollständig: Frankreich, die Franzosen betreffend; von den Franzosen stammend, zu ihnen gehörend; in Frankreich gelegen]
narrower: französisch-evangelisch
narrower: französisch-amerikanisch
pref label: francés

französisch-gotisch
type: Concept
related match: Gothic art
in scheme: travel!digital Thesaurus
pref label: französisch-gotisch
definition: bdk: siehe französisch | Duden: gotisch: 2. a. die Gotik betreffend, zu ihr gehörend | b. für die Gotik typisch; an die Gotik erinnernd | Duden: Gotik: europäische Stilepoche (von der Mitte des 12. bis zum Ende des 15. Jahrhunderts) in [Sakral]architektur (mit Rippengewölben, Spitzbogen, Strebewerk, Maßwerk), [Architektur]plastik sowie Tafel- und Buchmalerei

französisch-gotisch
type: Label
in scheme: travel!digital Thesaurus

südfranzösisch
type: Concept
in scheme: travel!digital Thesaurus
related: Südfranzose
pref label: südfranzösisch
definition: bdk: siehe französisch

südfranzösisch
type: Label
in scheme: travel!digital Thesaurus

französisch
type: Label
hasTranslation: francés
in scheme: travel!digital Thesaurus
hasTranslation: français
hasTranslation: french
hasTranslation: fransâwi

francés
type: Label
isTranslationOf: französisch
hasTranslation: français
hasTranslation: french
in scheme: travel!digital Thesaurus
hasTranslation: fransâwi

français
type: Label
isTranslationOf: französisch
hasTranslation: francés
hasTranslation: french
in scheme: travel!digital Thesaurus
hasTranslation: fransâwi

french
type: Label
isTranslationOf: französisch
hasTranslation: français
in scheme: travel!digital Thesaurus
hasTranslation: francés
hasTranslation: fransâwi

fransâwi
type: Label
in scheme: travel!digital Thesaurus
isTranslationOf: französisch
hasTranslation: french
hasTranslation: francés
hasTranslation: français

französisch-romanisch
type: Concept
definition: bdk: siehe französisch | Duden: 2. romanisch: die [Kunst der] Romanik betreffend, zu ihr gehörend; für die Romanik typisch | Duden: Romanik: der Gotik vorangehende europäische Stilepoche des frühen Mittelalters, für die besonders in der sakralen Baukunst Rundbogen, Tonnengewölbe und die quaderartige, schwer wirkende Form charakteristisch sind
in scheme: travel!digital Thesaurus
pref label: französisch-romanisch

französisch-romanisch
type: Label
in scheme: travel!digital Thesaurus

englisch-französisch
type: Concept
in scheme: travel!digital Thesaurus
pref label: englisch-französisch
definition: bdk: siehe englisch, französisch

englisch-französisch
type: Label
in scheme: travel!digital Thesaurus

französisch-englisch
type: Concept
in scheme: travel!digital Thesaurus
definition: bdk: siehe französisch, englisch
pref label: französisch-englisch
related: englisch-französisch

französisch-englisch
type: Label
in scheme: travel!digital Thesaurus

französisch-evangelisch
type: Concept
definition: bdk: siehe französisch, evangelisch
in scheme: travel!digital Thesaurus
pref label: französisch-evangelisch

französisch-evangelisch
type: Label
in scheme: travel!digital Thesaurus

französisch-amerikanisch
type: Concept
definition: bdk: siehe französisch, amerikanisch
in scheme: travel!digital Thesaurus
pref label: französisch-amerikanisch

französisch-amerikanisch
type: Label
in scheme: travel!digital Thesaurus

Thraker
type: Concept
related match: Thrace
related match: List of ancient tribes in Thrace and Dacia
definition: Duden: Bewohner von Thrakien | Duden: Thrakien: Gebiet auf der Balkanhalbinsel | Meyers Großes Konversations-Lexikon 1909: Thrakĭen (Thrake, lat. Thracia), das Land östlich und nordöstlich von Mazedonien (s. Karte »Das römische Weltreich«, Bd. 17), zur Zeit der Römerherrschaft das im W. vom Nestos, im N. vom Hämos, im O. vom Pontos Euxeinos und im S. von der Propontis, dem Hellespont und dem Ägäischen Meer begrenzte Land. Hauptgebirge desselben ist der Hämos im N., im SW. die Rhodope und der Skombros (Witoscha). Die bedeutendsten Flüsse sind die an der, Südküste mündenden: Nestos und Hebros (jetzt Maritza) mit dem Ergines (jetzt Ergene) und dem Tonzus (Tundscha). Das Land lieferte Getreide in Menge und selbst Wein. Auch an edlen Metallen war es reich, und bei Philippi wurden Goldminen bearbeitet. Die unter dem allgemeinen Namen Thraker (Thrakes) begriffenen Einwohner arischen Stammes, von den Karpathen her eingewandert und in einzelnen Stämmen bis Kleinasien vorgedrungen, zerfielen in eine Menge Völkerschaften, z. B. die Odrysen und Besser nördlich vom Hebros, im S. die Mäder, Sapäer, Korpilen, im O. die Aster etc. Die Küstenbewohner waren früh zivilisiert, die Stämme des Innern blieben bis in späte Zeit roh. Die Sitten und Gebräuche der Thraker hatten viel Übereinstimmendes mit denen der germanischen Völker. Jagd und Krieg bildeten die Hauptbeschäftigung der Männer. Eine den Thrakern eigentümliche Sitte war das Tätowieren; die Adligen färbten ihr Haar stahlblau. Vielweiberei war üblich. Manche Stämme hatten Könige, denen ein Rat zur Seite stand. Die Religion war die polytheistische der Griechen. Die wichtigern Städte, fast durchweg griechische Siedelungen, waren, zwischen Nestos und Hebros an der Küste: Abdera, Maroneia, Änos; auf der Thrakischen Chersones: Sestos, Kallipolis, Lysimachia; an der Propontis: Rhaidestos, Perinthos, Selymbria; am Thrakischen Bosporus: Byzantion;[505] am Pontos: Apollonia; im Innern: Philippopolis, Hadrianopolis, Beroë, Serdica. – Darei…
in scheme: travel!digital Thesaurus
pref label: Thraker

Thraker
type: Label
in scheme: travel!digital Thesaurus

Puyallup Indianer
type: Concept
definition: bdk: Ethnie im Bundesstaat Washington
related: Indianer
in scheme: travel!digital Thesaurus
pref label: Puyallup Indianer

Puyallup Indianer
type: Label
in scheme: travel!digital Thesaurus

apuanisch
type: Concept
related match: Apuan Alps
definition: bdk: die Apuaner betreffend; von den Apuanern stammend, zu ihnen gehörend; in Apua gelegen | Pierer's Universal-Lexikon 1857: Apŭa (a. Geogr.), Stadt in Ligurien, jetzt Ponte Tremoli. Die Apuaner widerstanden den Römern lange u. schlugen den Q. Marcius, wurden aber endlich von dem Consul L. Flamininus besiegt u. nach neuer Empörung ins Samniterland versetzt. Nach A. benannt sind die Apuanischen Alpen, zwischen den Apenninen u. dem Mittelmeere im Herzogthum Modena, worin die Carrarischen Marmorbrüche. | Quelle: Pierer's Universal-Lexikon, Band 1. Altenburg 1857, S. 629. | Permalink: http://www.zeno.org/nid/20009390413
pref label: apuanisch
in scheme: travel!digital Thesaurus

apuanisch
type: Label
in scheme: travel!digital Thesaurus

Ute-Indianer
type: Concept
definition: Meyers Großes Konversations-Lexikon 1909: Ute (Utah), nordamerikan. Indianerstamm in Utah, Colorado und New Mexico, bildet mit den Schoschonen, Komantschen u. a. den Schoschonenzweig des Sprachstammes der Uto-Azteken (s. d.). Die U. stehen auf einer tiefen Kulturstufe, wohnen in Zweighütten oder Zelten aus Büffelhäuten und leben von Jagd und Fischfang. Auf Reservationen lebten 1890 in Colorado und Utah 1383 Seelen. | Quelle: Meyers Großes Konversations-Lexikon, Band 19. Leipzig 1909, S. 981. | Permalink: http://www.zeno.org/nid/20007632770
in scheme: travel!digital Thesaurus
related: Indianer
pref label: Ute-Indianer

Ute-Indianer
type: Label
in scheme: travel!digital Thesaurus

Cubaner
type: Concept
related match: Cuba
definition: Duden: Kubaner: Einwohnerbezeichnung | [Anm.: unvollständig: Einwohnerbezeichnung zu Kuba] | Duden: Kuba: Inselstaat im Karibischen Meer | Meyers Großes Konversations-Lexikon 1906: Cuba (hierzu die Karte »Cuba«), die größte der westind. Inseln (s. Karte »Westindien etc.«), von den Spaniern anfangs Juana, dann Fernandina und wegen ihrer Schönheit und Fruchtbarkeit Königin oder Perle der Antillen genannt, bildet seit 1902 einen besondern Freistaat. Zwischen 19°49' (Kap Cruz) und 23°13' nördl. Br. (Hicacosspitze), 74°10' (Kap San Antonio) und 84°55' westl. L. (Kap Maisi) erstreckt es sich 40–160 km breit, 1300 km lang und ist mit den zahlreichen Nebeninseln (Pinos [s. d.], Cayo Largo, Laberinto de Doce Leguas etc. im S., Colorados, Cayo Fragoso, C. Romano, C. del Sabinal etc. im N.) 118,833 qkm, ohne sie 112,191 qkm groß. Die Nebeninseln sind meist Korallenbauten, ebenso ist der Hauptküstensaum korallin, die zahlreichen schönen Hafenbuchten aber sind durch gehobene Korallendämme vor dem Seegange geschützt. Unter letztern sind die vorzüglichsten die von Havana, Matanzas, Nuevitas, Guantanamo, Santiago und Cienfuegos, bei den Buchten im NO. erschwert aber der Passatwind die Ausfahrt. Die Südküste ist durch die Golfe von Cortez, Matamano, Jucaro und Guacanayabo weiter gegliedert und annähernd 1700 km lang, die Nordküste (1500 km) verläuft geradliniger und wird hinter den Nebeninseln von einer kanalartigen ruhigen Seichtsee begleitet (Cayo Romano-Bai, Buenavista-Bai, Caibarien-Bai etc.). Das höchste Gebirge, die schroff in das Karibische Meer abstürzende Sierra Maestra, liegt im äußersten Südosten und ist am Ojo del Toro 1582 m, im Pico Turquino 2560 m und in der Gran Piedra 1588 m hoch. Auch die Sierra de Toar, de Cristal, de Nipe (600 m) etc. machen den Osten zu dem Hauptberglande Cubas. Im übrigen liegt in der Mitte der Südseite das hohe Gebirge von Guamuhaya oder Trinidad (Loma de Banao 1700 m, Pico de Potrerillo 944 m), im äußersten Nordwesten aber die Sierra de los O…
in scheme: travel!digital Thesaurus
pref label: Cubaner

Cubaner
type: Label
in scheme: travel!digital Thesaurus

aztekisch
type: Concept
alternative label: alt-aztekisch
alt label: alt-aztekisch
related: Azteke
in scheme: travel!digital Thesaurus
pref label: aztekisch
definition: Duden: die Azteken betreffend; von den Azteken stammend, zu ihnen gehörend

alt-aztekisch
type: Label
in scheme: travel!digital Thesaurus

Azteke
type: Concept
alternative label: Azteken-Rasse
alt label: Azteken-Rasse
in scheme: travel!digital Thesaurus
pref label: Azteke
definition: Duden: Angehöriger eines Indianerstammes in Mexiko | Meyers Großes Konversations-Lexikon 1905: Azteken (Azteka, spr. aßtēka, oder Méxica, spr. méschika oder méchika) nannte sich der Zweig des Nahua-Völkerstammes, der an einer flachen Stelle der Salzwasserlagune, welche die Mitte und zugleich die tiefste Stelle des Hochtals von Mexiko bezeichnet, sein Heim sich gründet:, die Stadt, die, nachmals als Mexiko oder Tenochtitlan (spr. tenotschtitlan) bekannt, dem ganzen Lande seinen Namen Mexiko gegeben hat. Der Name A. bedeutet »die aus dem Land Aztlan Stammenden«. Die Bedeutung dieses Wortes ist zweifelhaft. Noch zweifelhafter ist es, wo dieser Ort Aztlan zu suchen ist. In den Überlieferungen der A. erscheint der Ort als eine mythische Verklärung der Stadt Mexiko selbst, des Ortes, in dem in geschichtlicher Zeit der Stamm seinen Wohnsitz hatte. Anfangs hatte ein unbedeutender Stamm, vielleicht aus versprengten Banden erwachsen, von verschiedenen umliegenden Ortschaften her in dem Röhricht der Lagune Zuflucht gesucht. In alter Zeit war der Stamm der Stadt Azcapotzalco, die gegenüber auf dem Seeufer gelegen war, tributpflichtig. Inmitten der Lagune siedelnd, waren die A. für ihren Unterhalt auf den Fischfang, die Jagd auf Wasservögel und auf die Produkte angewiesen, die sie auf den Chinampa, mit Erdreich bedeckten Flößen, kultivierten. Daneben betrieben sie frühzeitig einen ausgedehnten Handel bis nach der atlantischen und pacifischen Küste. Die entscheidende Wendung in der Geschichte des Stammes bildet die Befreiung von der Herrschaft Azcapotzalcos und die Unterwerfung dieser Stadt in der ersten Hälfte des 15. Jahrh. unter dem König Itzcouatl. Unter seinem Nachfolger, dem ältern Motecuhzoma, wurde der Bund zwischen den drei Städten Mexiko, Tetzcoco und Tlacopan geschlossen, der der Stadt Mexiko, als dem Vororte des Bundes, die Führerschaft unter den Städten des Hochtales sicherte und eine schnelle Ausbreitung der aztekischen Herrschaft über weite Teile der südlich und ös…

Azteken-Rasse
type: Label
in scheme: travel!digital Thesaurus

Azteke
type: Label
in scheme: travel!digital Thesaurus

aztekisch
type: Label
in scheme: travel!digital Thesaurus

Emiter
type: Concept
definition: bdk: kanaanitischer Stamm | Pierer's Universal-Lexikon 1861: Phönikien (Phönīke, Phoenicia, Kanaan) [...] Den Namen Phönikien leiteten die Alten ab entweder von Phönix (s.d. 1), od. von dem griechischen φοίνιξ, d. i. der Palmbaum od. der Purpur, ab, also Palmen- od. Purpurland. Die eigentlichen Phöniker (Kananiter, Zidonier) waren Aramäer od. Semiten u. zwar Kananiter u. sollten von den Küsten des Erythräischen Meeres, u. zwar aus Arabien od. Ägypten, od. von den Küsten des Persischen Meerbusens, od. auch von den sumpfigen Ufern des Euphrat, u. zwar lange vor den Israeliten, hier eingewandert sein. Vor ihnen wohnten die Riesenvölker der Rephaiter, Emiter, Enakiter, Aviter u.a. hier. [...] | Quelle: Pierer's Universal-Lexikon, Band 13. Altenburg 1861, S. 83-84. | Permalink: http://www.zeno.org/nid/2001063326X
related: Kanaʿaniter
in scheme: travel!digital Thesaurus
pref label: Emiter

Emiter
type: Label
in scheme: travel!digital Thesaurus

Dalmatiner
type: Concept
related match: Dalmatia
definition: Duden: 1. Einwohnerbezeichnung zu Dalmatien | Duden: Dalmatien: Landschaft in Kroatien | Meyers Großes Konversations-Lexikon 1906: Dalmatĭen, Königreich, südlichstes Kronland Österreichs (s. Karte »Österreich-Ungarn« und Karte »Bosnien etc.«), umfaßt ein gegen SO. immer schmäler werdendes Küstengebiet (390 km lang, 2–70 km breit) an der Ostseite des Adriatischen Meeres, das zwischen 44°25'–42°6' nördl. Br. und zwischen 15°6' bis 19°5'östl. L. liegt, im N. von Kroatien, im O. von Bosnien, der Herzegowina und Montenegro, im S. und W. vom Meer begrenzt wird und durch die bis zur Meeeresküste reichenden herzegowinischen Landstriche Klek und Sutorina in drei Teile getrennt wird. Außerdem umfaßt D. 20 größere Inseln nebst zahlreichen kleinen Felseneilanden (Scoglien) und hat zusammen einen Flächeninhalt von 12,835 qkm (233 QM.). [...] | D. zählte 1890: 527,426,1900: 593,784 Einw., so daß die jährliche Zunahme der Bevölkerung 1891 bis 1900: 1,26 Proz. beträgt und auf 1 qkm 46 Einw. entfallen. Auf 1000 männliche kommen in D. 963 weibliche Einwohner. Der Nationalität nach sind 96,65 Proz. Serbokroaten und 2,61 Proz. Italiener, letztere vorzugsweise in den Hafenstädten und auf den Inseln ansässig. In religiöser Beziehung bekennen sich 83,7 Proz. der Bewohner zur katholischen und 16,2 Proz. zur orthodoxen griechischen Kirche. Die römisch-katholische Kirche untersteht einem Erzbischof (zu Zara) und fünf Bischöfen (zu Ragusa, Spalato, Sebenico, Lesina und Cattaro). Die orientalischen Griechen haben zwei Bistümer (zu Zara und Cattaro), die der Czernowitzer Metropolie unterstehen. An Bildungsanstalten bestehen 6 theologische Lehranstalten, 5 Gymnasien, 2 Realschulen, eine Lehrer-[428] und eine Lehrerinnenbildungsanstalt, eine Ackerbau- und 2 nautische Schulen, endlich 367 öffentliche und 20 private Volksschulen. Auf 100 schulpflichtige Kinder kamen 1900: 90 schulbesuchende. [...] | Quelle: Meyers Großes Konversations-Lexikon, Band 4. Leipzig 1906, S. 428-430. | Permalink: http://w…
pref label: Dalmatiner
in scheme: travel!digital Thesaurus

Dalmatiner
type: Label
in scheme: travel!digital Thesaurus

mösisch
type: Concept
related: Myser
in scheme: travel!digital Thesaurus
definition: bdk: Mösien, die Einwohner von Mösien betreffend; von den Einwohnern von Mösien stammend, zu ihnen gehörend; in Mösien gelegen
pref label: mösisch

Myser
type: Concept
related match: List of ancient tribes in Thrace and Dacia
related match: Moesia
definition: bdk: Einwohnerbezeichnung zu Mösien | Meyers Großes Konversations-Lexikon 1908: Mösĭen (lat. Moesia, bei den Griechen auch Mysia), röm. Provinz an der untern Donau (s. Karte »Römisches Reich«), erstreckte sich von der Mündung des Savus (Save) bis an das Schwarze Meer und entsprach ungefähr dem heutigen Serbien und Bulgarien. In den ältesten Zeiten saßen dort die thrakischen Stämme der Triballer, Krobyzen, Myser und Geten, neben denen 277 v. Chr. der keltische Stamm der Skordisker sich niederließ. Die Römer kamen zuerst 75 v. Chr. mit ihnen in feindliche Berührung und eroberten es 29. Unter Tiberius hatte M., seit 6 n. Chr. eigne Provinz, viel von den nördlicher wohnenden Daciern und Sarmaten zu leiden. Domitian teilte M. in Moesia superior (Ober-) und inferior (Unter-M.); die Grenze bildete der Fluß Almus (Lom). Zu Untermösien wurde 57 n. Chr. der Küstenstrich am Schwarzen Meer bis über den Tyras hinaus und durch Trajan das heutige Rumänien östlich des Alutus (Oltu), zu Obermösien, das im S. bis auf Diokletian auch Dardanien umfaßte, das westliche Dacien zwischen Donau und Maros geschlagen. Kaiser Valens wies 375 den von den Hunnen bedrängten Westgoten Sitze in M. an. Dann kamen im 5.–7. Jahrh. die Slawen und setzten sich vorzüglich in Obermösien fest, und endlich nahmen das Land die Bulgaren ein. Unter den Städten sind in Obermösien Viminacium (Kostolatz), Singidunum (Belgrad), Naissus (Nisch) und Ratiaria (Artscher), in Niedermösien Tomi (Küstendsche), Öscus (Gigen), [176] Durostorum (Silistria) an der Donau, Nicopolis ad Hämum (Ruinen bei Nikup), Marcianopolis (Dewna) im Innern zu nennen. | Quelle: Meyers Großes Konversations-Lexikon, Band 14. Leipzig 1908, S. 176-177. | Permalink: http://www.zeno.org/nid/20007114664
pref label: Myser
in scheme: travel!digital Thesaurus

Myser
type: Label
in scheme: travel!digital Thesaurus

mösisch
type: Label
in scheme: travel!digital Thesaurus

Elsaß-Lothringer
type: Concept
definition: bdk: Einwohnerbezeichnung zu Elsaß-Lothringen | Duden: Elsass-Lothringen: amtliche Benennung für das das Elsass und das nordöstliche Drittel Lothringens umfassende Gebiet, das von 1871 bis 1918 zum Deutschen Reich gehörte | siehe auch: Meyers Großes Konversations-Lexikon 1906: Elsaß-Lothringen | Quelle: Meyers Großes Konversations-Lexikon, Band 5. Leipzig 1906, S. 725-736. | Permalink: http://www.zeno.org/nid/20006549012
related match: Alsace-Lorraine
pref label: Elsaß-Lothringer
in scheme: travel!digital Thesaurus

Elsaß-Lothringer
type: Label
in scheme: travel!digital Thesaurus

Grieche
type: Concept
alt label: Neugrieche
related match: Greece
alt label: Griechentum
definition: Duden: Einwohnerbezeichnung | [Anm.: unvollständig: Einwohnerbezeichnung zu Griechenland] | Duden: Griechenland: Staat im Süden der Balkanhalbinsel | siehe auch: Meyers Großes Konversations-Lexikon 1907: Griechenland [1] | Quelle: Meyers Großes Konversations-Lexikon, Band 8. Leipzig 1907, S. 287-303. | Permalink: http://www.zeno.org/nid/20006710611 | siehe auch: Meyers Großes Konversations-Lexikon 1907: Griechenland [2] | Quelle: Meyers Großes Konversations-Lexikon, Band 8. Leipzig 1907, S. 303-320. | Permalink: http://www.zeno.org/nid/2000671062X
alternative label: Neugrieche
related match: Ancient Greece
pref label: Grieche
in scheme: travel!digital Thesaurus
alternative label: Griechentum

Neugrieche
type: Label
in scheme: travel!digital Thesaurus

Griechentum
type: Label
in scheme: travel!digital Thesaurus

Grieche
type: Label
in scheme: travel!digital Thesaurus

Punier
type: Concept
definition: bdk: siehe Phönizier, Karthager | Duden: Einwohner des antiken Karthago | Meyers Großes Konversations-Lexikon 1908: Punĭer (Poeni, d. h. Phöniker), soviel wie Karthager. | Quelle: Meyers Großes Konversations-Lexikon, Band 16. Leipzig 1908, S. 456. | Permalink: http://www.zeno.org/nid/20007301871
pref label: Punier
in scheme: travel!digital Thesaurus
related: Phönizier
related: Karthager

Punier
type: Label
in scheme: travel!digital Thesaurus

Phönizier
type: Concept
alternative label: Phönicier
narrower: Libyphönizier
alt label: Phönicier
pref label: Phönizier
related match: Phoenicia
in scheme: travel!digital Thesaurus
definition: Duden: Einwohnerbezeichnung | [Anm.: unvollständig: Einwohnerbezeichnung zu Phönizien] | Duden: Phönizien: (im Altertum) Küstenland an der Ostküste des Mittelmeeres | Meyers Großes Konversations-Lexikon 1908: Phönikĭen (griechische Bezeichnung Phoenike, der Einwohner Phoenix, wohl zusammenhängend mit Punier), der schmale Küstenstrich Syriens am Fuße des Libanon, der sich von dem Vorgebirge Karmel im S. bis gegenüber der Insel Kypros erstreckte, fruchtbar, reich an Waldungen und erzreichen Bergwerken im Altertum. Die phönikische Bevölkerung bildet einen Teil der sogen. semitischen Völkergruppe, der etwa seit dem Beginn des 3. Jahrtausends in sein Land eingewandert ist. Die älteste geschichtliche Nachricht ist die eines altbabylonischen Königs (wohl Sargon von Agade um 2800 v. Chr.), der 31 Städte dieses Küstenlandes eroberte und von hier aus einen drei Jahre dauernden Kriegszug über das Mittelmeer unternahm. Das Land hat meist unter dem Einfluß der Großmächte des Euphrat-Tigristals (Babylonien und Assyrien) und des Niltals (Ägypten) gestanden. Um 2000 gehörte es (unter der ersten Dynastie von Babylon, Hammurabi) zu Babylonien, um dann bis etwa 1300 unter ägyptische Oberhoheit zu kommen. In dieser Zeit liegen die ersten einigermaßen zusammenhängenden Nachrichten vor. Danach zerfällt das Volk in zwei größere (durch leichte dialektische Unterschiede zu unterscheidende) Gruppen: Nord- und Südphöniker, die aber in keinem festen politischen Verbande miteinander stehen, sondern in verschiedene »Königreiche« zerfallen, die mit den verschiedenen Hafenstädten von Bedeutung identisch sind. Die nordphönikischen sind Arvad, Gebal (griech. Byblos), die südphönikischen Sidon und Tyros. Die natürliche Grenze bildete wohl der Hundsfluß wenig nördlich von Beirut. Auch dieses (Beerot, Beirut, d.h. die Brunnenstadt) ist zeitweilig ein eignes Königtum gewesen, ebenso Akka weiter im S. und einige andre im Binnenlande, namentlich des Nordens (Arka, Sianna, Simyrra). Die meisten davon ersch…

Libyphönizier
type: Concept
in scheme: travel!digital Thesaurus
pref label: Libyphönizier
definition: bdk: siehe Libyer, Phönizier
related: Libyer

Libyphönizier
type: Label
in scheme: travel!digital Thesaurus

Phönicier
type: Label
isVariantOf: Phönizier
in scheme: travel!digital Thesaurus

Phönizier
type: Label
hasVariant: Phönicier
in scheme: travel!digital Thesaurus

Karthager
type: Concept
related: Phönizier
pref label: Karthager
in scheme: travel!digital Thesaurus
definition: Duden: Einwohnerbezeichnung zu Karthago | Duden: Karthago: phönizische Stadt in Nordafrika | Meyers Großes Konversations-Lexikon 1907: Karthāgo (bei den Griechen Karchēdon, phönikisch Kartha-hadatha oder abgekürzt Karthada, »Neustadt«), im Altertum berühmte Stadt in Zeugitana auf der Nordküste von Afrika, im Innern eines Meerbusens, war zum größten Teil von dem Tunesischen See und dem Meer umflossen und hing mit dem Festland nur durch einen 4 km breiten Isthmus zusammen. Ihr ältester Teil war die 60 m hohe Burg, Byrsa genannt, um die herum die Stadt allmählich erwuchs. Gegen die Seeseite hin, wo das Ufer steil abfiel, ward K. durch eine einfache, gegen die Landseite hin aber durch zwei vorliegende Befestigungslinien und eine 14 m hohe und 9 m breite Mauer geschützt, die mehrstöckig war und in ihrem Erdgeschoß Stallungen für 300 Kriegselefanten, im obern für 4000 Pferde und Unterkunft für 24,000 Mann enthielt. Nach neuern Berechnungen betrug der Umfang der Stadt etwa 24 km. Auf dem höchsten Punkte der Byrsa befand sich der vornehmste Tempel Karthagos, der des Esmun (Asklepios). Die Stadt hatte zwei Seehäfen, die im SO. lagen und durch einen 70 Fuß breiten Kanal miteinander verbunden waren. Der äußere war für Kauffahrteischiffe bestimmt. Der innere oder der Kriegshafen hieß nach einer inmitten desselben sich erhebenden Insel Kothon. Auf letzterer lagen die Zeughäuser, und rings um sie her war Platz für 220 Kriegsschiffe. In der Nähe des letztern Hafens befand sich der Marktplatz. Nordwestlich von der Byrsa auf einer flachen Höhe lag ein besonderer, neuerer Stadtteil, Magalia (»Höhe«) genannt, von der Altstadt durch eine Zwischenmauer getrennt und durch eine 75 km lange Leitung mit Wasser versehen. [...] | Die Bevölkerung der Stadt soll sich beim Anfang des dritten Punischen Krieges auf 700,000 (?) Menschen belaufen haben. Nach ihrer Zerstörung 146 v. Chr. (s. unten) von Augustus wieder aufgebaut, wurde sie bald wieder so bedeutend, daß sie bis zu ihrer Eroberung durch…
related match: Carthage

Karthager
type: Label
in scheme: travel!digital Thesaurus

vorarisch
type: Concept
in scheme: travel!digital Thesaurus
related: arisch
pref label: vorarisch
definition: bdk: siehe arisch

vorarisch
type: Label
in scheme: travel!digital Thesaurus

byzantinisch
type: Concept
alt label: früh-byzantinisch
alternative label: altbyzantinisch
alt label: frühbyzantinisch
related: Byzantiner
pref label: byzantinisch
narrower: byzantinisch-maurisch
alternative label: frühbyzantinisch
narrower: byzantinisch-arabisch
alternative label: byzantiner
narrower: maurisch-byzantinisch
alt label: altbyzantinisch
alt label: spätbyzantinisch
narrower: byzantinisch-romanisch
in scheme: travel!digital Thesaurus
alt label: byzantiner
related: konstantinopler
preferred label: byzantin @fr
definition: Duden: 1. Byzanz betreffend, aus Byzanz stammend | 2. die Epoche betreffend, in der Byzanz seine Glanzzeit erlebte | [Anm.: unvollständig: Byzanz, die Byzantiner betreffend; von den Byzantinern stammend, zu ihnen gehörend; in Byzanz gelegen]
alternative label: früh-byzantinisch
alternative label: spätbyzantinisch
pref label: byzantine
pref label: byzantin
preferred label: byzantine @en

früh-byzantinisch
type: Label
in scheme: travel!digital Thesaurus
isVariantOf: frühbyzantinisch

frühbyzantinisch
type: Label
in scheme: travel!digital Thesaurus
hasVariant: früh-byzantinisch

byzantinisch
type: Label
hasTranslation: byzantin
hasVariant: byzantiner
hasTranslation: byzantine
in scheme: travel!digital Thesaurus

byzantin
type: Label
hasTranslation: byzantine
isTranslationOf: byzantinisch
in scheme: travel!digital Thesaurus

byzantine
type: Label
hasTranslation: byzantin
isTranslationOf: byzantinisch
in scheme: travel!digital Thesaurus

byzantiner
type: Label
isVariantOf: byzantinisch
in scheme: travel!digital Thesaurus

byzantinisch-maurisch
type: Concept
definition: bdk: siehe byzantinisch, maurisch
pref label: byzantinisch-maurisch
related: maurisch-byzantinisch
in scheme: travel!digital Thesaurus

byzantinisch-maurisch
type: Label
in scheme: travel!digital Thesaurus

maurisch-byzantinisch
type: Concept
pref label: maurisch-byzantinisch
in scheme: travel!digital Thesaurus
definition: bdk: siehe maurisch, byzantinisch

maurisch-byzantinisch
type: Label
in scheme: travel!digital Thesaurus

byzantinisch-arabisch
type: Concept
definition: bdk: siehe byzantinisch, arabisch
in scheme: travel!digital Thesaurus
pref label: byzantinisch-arabisch

byzantinisch-arabisch
type: Label
in scheme: travel!digital Thesaurus

altbyzantinisch
type: Label
in scheme: travel!digital Thesaurus

spätbyzantinisch
type: Label
in scheme: travel!digital Thesaurus

byzantinisch-romanisch
type: Concept
related match: Romanesque art
in scheme: travel!digital Thesaurus
pref label: byzantinisch-romanisch
definition: bdk: siehe byzantinisch | Duden: 2. romanisch: die [Kunst der] Romanik betreffend, zu ihr gehörend; für die Romanik typisch | Duden: Romanik: der Gotik vorangehende europäische Stilepoche des frühen Mittelalters, für die besonders in der sakralen Baukunst Rundbogen, Tonnengewölbe und die quaderartige, schwer wirkende Form charakteristisch sind

byzantinisch-romanisch
type: Label
in scheme: travel!digital Thesaurus

konstantinopler
type: Concept
alternative label: konstantinopeler
definition: bdk: Konstantinopel, die Konstantinopolitaner betreffend; von den Konstantinopolitanern stammend, zu ihnen gehörend; in Konstantinopel gelegen
alt label: konstantinopeler
pref label: konstantinopler
in scheme: travel!digital Thesaurus
related: Konstantinopolitaner

konstantinopeler
type: Label
isVariantOf: konstantinopler
in scheme: travel!digital Thesaurus

konstantinopler
type: Label
hasVariant: konstantinopeler
in scheme: travel!digital Thesaurus

griechisch
type: Concept
narrower: griechisch-baktrisch
narrower: christlich-griechisch
narrower: türkisch-griechisch
narrower: ägyptisch-griechisch
alternative label: frühgriechisch
pref label: rûmi
pref label: griechisch
alt label: frühgriechisch
narrower: griechisch-uniirt
related: Grieche
narrower: griechisch-orthodox
alt label: neugriechisch
narrower: griechisch-orientalisch
preferred label: rûmi @ar
alternative label: spätgriechisch
alt label: altgriechisch
definition: Duden: 1. Griechenland, die Griechen betreffend | [Anm.: unvollständig: Griechenland, die Griechen betreffend; von den Griechen stammend, zu ihnen gehörend; in Griechenland gelegen]
narrower: griechisch-römisch-jüdisch
narrower: griechisch-römisch
narrower: illyrisch-griechisch
preferred label: grecque @fr
alt label: spätgriechisch
narrower: russisch-griechisch
narrower: griechisch-punisch
narrower: assyrisch-griechisch
in scheme: travel!digital Thesaurus
narrower: römisch-griechisch
narrower: orthodox-griechisch
narrower: griechisch-katholisch
pref label: grecque
alternative label: altgriechisch
narrower: griechisch-fränkisch
alternative label: neugriechisch

griechisch-baktrisch
type: Concept
definition: bdk: siehe griechisch, baktrisch
pref label: griechisch-baktrisch
in scheme: travel!digital Thesaurus

griechisch-baktrisch
type: Label
in scheme: travel!digital Thesaurus

christlich-griechisch
type: Concept
pref label: christlich-griechisch
in scheme: travel!digital Thesaurus
definition: bdk: siehe christlich, griechisch

christlich-griechisch
type: Label
in scheme: travel!digital Thesaurus

rûmi
type: Label
in scheme: travel!digital Thesaurus
isTranslationOf: griechisch
hasTranslation: grecque

griechisch
type: Label
hasTranslation: grecque
in scheme: travel!digital Thesaurus
hasTranslation: rûmi

grecque
type: Label
isTranslationOf: griechisch
in scheme: travel!digital Thesaurus
hasTranslation: rûmi

frühgriechisch
type: Label
in scheme: travel!digital Thesaurus

griechisch-uniirt
type: Concept
pref label: griechisch-uniirt
in scheme: travel!digital Thesaurus
related: griechisch-katholisch
definition: Duden: griechisch-katholisch | Meyers Großes Konversations-Lexikon 1909: Unieren (lat.), vereinigen; uniert, vereinigt, besonders von früher getrennten Religionsgenossenschaften (s. Union). | Quelle: Meyers Großes Konversations-Lexikon, Band 19. Leipzig 1909, S. 918. | Permalink: http://www.zeno.org/nid/20007625650

griechisch-uniirt
type: Label
in scheme: travel!digital Thesaurus

griechisch-katholisch
type: Concept
preferred label: grecque catholique @fr
in scheme: travel!digital Thesaurus
definition: Duden: einer mit Rom vereinigten, in Lehre und Verfassung den Papst anerkennenden orthodoxen Nationalkirche angehörend; Abkürzung: gr.-kath.
pref label: griechisch-katholisch
preferred label: rûm kâtûlîk @ar
pref label: rûm kâtûlîk
related match: Greek Byzantine Catholic Church
pref label: grecque catholique

griechisch-katholisch
type: Label
hasTranslation: grecque catholique
in scheme: travel!digital Thesaurus

grecque catholique
type: Label
isTranslationOf: griechisch-katholisch
in scheme: travel!digital Thesaurus
hasTranslation: griechisch-katholisch

rûm kâtûlîk
type: Label
in scheme: travel!digital Thesaurus
isTranslationOf: griechisch-katholisch
hasTranslation: grecque catholique

griechisch-orthodox
type: Concept
related match: Eastern Orthodox Church
definition: Duden: der von Rom getrennten Ostkirche oder einer ihrer unabhängigen Nationalkirchen angehörend
in scheme: travel!digital Thesaurus
pref label: griechisch-orthodox
pref label: rûm kadîm
preferred label: rûm kadîm @ar

griechisch-orthodox
type: Label
in scheme: travel!digital Thesaurus
hasTranslation: rûm kadîm

rûm kadîm
type: Label
in scheme: travel!digital Thesaurus
isTranslationOf: griechisch-orthodox

neugriechisch
type: Label
in scheme: travel!digital Thesaurus

griechisch-orientalisch
type: Concept
alternative label: griechisch orientalisch
alt label: griechisch orientalisch
in scheme: travel!digital Thesaurus
pref label: griechisch-orientalisch
definition: bdk: siehe griechisch, orientalisch

griechisch orientalisch
type: Label
isVariantOf: griechisch-orientalisch
in scheme: travel!digital Thesaurus

griechisch-orientalisch
type: Label
hasVariant: griechisch orientalisch
in scheme: travel!digital Thesaurus

altgriechisch
type: Label
in scheme: travel!digital Thesaurus

griechisch-römisch-jüdisch
type: Concept
definition: bdk: siehe griechisch, römisch, jüdisch
in scheme: travel!digital Thesaurus
pref label: griechisch-römisch-jüdisch

griechisch-römisch-jüdisch
type: Label
in scheme: travel!digital Thesaurus

griechisch-römisch
type: Concept
definition: bdk: siehe griechisch, römisch | Duden: 3. die zunächst griechisch, dann römisch geprägte Epoche des Altertums betreffend
in scheme: travel!digital Thesaurus
pref label: griechisch-römisch

griechisch-römisch
type: Label
in scheme: travel!digital Thesaurus

spätgriechisch
type: Label
in scheme: travel!digital Thesaurus

griechisch-punisch
type: Concept
in scheme: travel!digital Thesaurus
pref label: griechisch-punisch
definition: bdk: siehe griechisch, phönizisch, karthagisch

griechisch-punisch
type: Label
in scheme: travel!digital Thesaurus

assyrisch-griechisch
type: Concept
definition: bdk: siehe assyrisch, griechisch
in scheme: travel!digital Thesaurus
pref label: assyrisch-griechisch

assyrisch-griechisch
type: Label
in scheme: travel!digital Thesaurus

römisch-griechisch
type: Concept
definition: bdk: siehe römisch, griechisch
in scheme: travel!digital Thesaurus
pref label: römisch-griechisch

römisch-griechisch
type: Label
in scheme: travel!digital Thesaurus

orthodox-griechisch
type: Concept
definition: bdk: siehe orthodox, griechisch
in scheme: travel!digital Thesaurus
pref label: orthodox-griechisch
related: griechisch-orthodox

orthodox-griechisch
type: Label
in scheme: travel!digital Thesaurus

griechisch-fränkisch
type: Concept
in scheme: travel!digital Thesaurus
pref label: griechisch-fränkisch
definition: bdk: siehe griechisch, fränkisch

griechisch-fränkisch
type: Label
in scheme: travel!digital Thesaurus

Sundanese
type: Concept
related match: Sunda Islands
pref label: Sundanese
in scheme: travel!digital Thesaurus
definition: bdk: Einwohnerbezeichnung zu den Sundainseln | Duden: Sundainseln: südostasiatische Inselgruppe | Meyers Großes Konversations-Lexikon 1909: Sundainseln, ostind. Archipel zwischen dem Chinesischen Meer und dem Indischen Ozean (s. Karte »Hinterindien«), erstreckt sich vom Südwesten der Halbinsel Malakka bis zu den Molukken und dem Nordwesten Australiens, umfaßt die Großen S.: Sumatra, Java, Borneo und Celebes, und die Kleinen S.: Bali, Lombok, Sumbawa, Flores, Sumba, Timor u. a. Doch ist diese Zusammenfassung weder geographisch noch ethnographisch voll berechtigt und eher auf die von der Makassar- und der Sapistraße (zwischen Sumbawa und Komodo) westlich gelegenen Inseln zu beschränken. Der Name kommt von dem Volke der Sunda oder Sundanesen, die im westlichen Java die Hauptmasse, im südlichsten Sumatra einen wesentlichen Bestandteil der Bevölkerung bilden.[206] Außer dem nordöstlichen Timor (portugiesisch) gehören die S. den Niederländern. | Quelle: Meyers Großes Konversations-Lexikon, Band 19. Leipzig 1909, S. 206-207. | Permalink: http://www.zeno.org/nid/2000754815X

Sundanese
type: Label
in scheme: travel!digital Thesaurus

Beni Sacher
type: Concept
pref label: Beni Sacher
definition: bdk: arabische Stammesgemeinschaft in Jordanien
alt label: Beni Sachr-Beduine
alt label: Beni Sachr
in scheme: travel!digital Thesaurus
alternative label: Beni Sachr
alternative label: Beni Sachr-Beduine
related: Beduine

Beni Sacher
type: Label
hasVariant: Beni Sachr
in scheme: travel!digital Thesaurus

Beni Sachr
type: Label
isVariantOf: Beni Sacher
in scheme: travel!digital Thesaurus

Beni Sachr-Beduine
type: Label
in scheme: travel!digital Thesaurus

ʿAdwân
type: Concept
alternative label: ʿAdwân-Beduine
related match: Adwan, Syria
definition: bdk: arabische Stammesgemeinschaft in Syrien
related: Beduine
pref label: ʿAdwân
in scheme: travel!digital Thesaurus
alt label: ʿAdwânbeduine
alt label: ʿAdwân-Beduine
alternative label: ʿAdwânbeduine

ʿAdwân
type: Label
in scheme: travel!digital Thesaurus

ʿAdwânbeduine
type: Label
in scheme: travel!digital Thesaurus
isVariantOf: ʿAdwân-Beduine

ʿAdwân-Beduine
type: Label
in scheme: travel!digital Thesaurus
hasVariant: ʿAdwânbeduine

Hamama
type: Concept
related: Nomade
definition: bdk: Nomadenstamm in Tunesien
in scheme: travel!digital Thesaurus
pref label: Hamama

Hamama
type: Label
in scheme: travel!digital Thesaurus

Veneter
type: Concept
definition: Duden: Bewohner von Venetien | Duden: Venetien: italienische Region | Meyers Großes Konversations-Lexikon 1909: Venĕter (Veneti), bei den Alten fünf Völker verschiedener Abstammung: 1) Die V. an der Nordküste Kleinasiens, schon in der Ilias erwähnt. – 2) Die V. auf der Balkanhalbinsel. – 3) Die V., Eneti (s. Eneter) oder Heneti, im nordöstlichsten Teil Italiens, zwischen der Athesis (Etsch) und dem Meere, den Alpen und der Mündung des Padus (Po), werden am wahrscheinlichsten zu dem illyrischen Volksstamm gezählt, während sie im Altertum vielfach mit dem ersten zusammengebracht wurden. Die Reste ihrer Sprache in Steininschriften sind noch nicht entziffert. Die V. zeichneten sich aus durch alte Kultur; sie trieben frühzeitig Handel. An die Römer haben sie sich schon in deren Kämpfen gegen die Gallier (225) angeschlossen und sind ihnen stets treu geblieben, auch im zweiten Punischen Kriege; nach Erteilung des Bürgerrechts im Bundesgenossenkrieg nahmen sie bald römisches Wesen an. Ihr Land, Venetia (s. Karte bei Artikel »Italia«), wurde bisweilen noch zu Gallia cisalpina im weitern Sinne gerechnet, gewöhnlich aber davon unterschieden. Die bedeutendsten Städte waren: Patavium (die alte Hauptstadt, jetzt Padua), Vicetia (Vicenza), Altinum (Altino), Tarvisium (Treviso), Opitergium (Oderzo), Concordia und Feltria (Feltre), erst von den Römern gegründet ist Aquileja. Vgl. Czoernig, Die alten Völker Oberitaliens (Wien 1885); Pauli, Die V. und ihre Schriftdenkmäler (Leipz. 1891). – 4) Die V. (Venetes) an der Westküste von Gallia Lugdunensis in der heutigen Bretagne, die unter allen Galliern des Seewesens am meisten kundig waren und eine Art von Herrschaft auf dem Atlantischen Ozean ausübten, von Cäsar 56 v. Chr. unterworfen. Ihre Hauptstadt Dariorigum, später Veneti, heißt jetzt Vannes. – 5) Die zuerst von Plinius und Tacitus als östliche Nachbarn der Germanen genannten, im mittlern Weichselgebiet ansässigen slawischen V. (richtiger Veneden), deren Name sich in dem der Wenden …
in scheme: travel!digital Thesaurus
pref label: Veneter
related match: Veneto

Veneter
type: Label
in scheme: travel!digital Thesaurus

Ojibway-Indianer
type: Concept
pref label: Ojibway-Indianer
alt label: Chippeway-Indianer
related: Indianer
in scheme: travel!digital Thesaurus
alternative label: Chippeway-Indianer
definition: Meyers Großes Konversations-Lexikon 1908: Odschibwä (Ojibway, auch Chippeway, Tschippewä), nordamerikan. Indianerstamm der Algonkin (s. Tafel »Amerikanische Völker I«, Fig. 8), der ehemals zwischen dem Michigan- und Huronensee wohnte, später an den Obern See zog. Die O. leben größtenteils von Fischerei und Jagd, bauen hübsche Birkenrindenkanns und gewinnen große Mengen von Ahornzucker. Sie haben drei Klassen von Schamanen; sehr einflußreich ist der Orden der Medewiwin. Die Gesamtzahl der O. beträgt gegen 15,000 Seelen, von denen (1890) 6263 in Minnesota, 1458 in Dakota, 4778 in Wisconsin auf verschiedenen Reservationen, die übrigen im westlichen Kanada leben. Eine Grammatik und Wörterbuch ihrer Sprache gab Baraga heraus (2. Aufl., Montreal 1878–82). | Quelle: Meyers Großes Konversations-Lexikon, Band 14. Leipzig 1908, S. 909. | Permalink: http://www.zeno.org/nid/20007176309

Ojibway-Indianer
type: Label
in scheme: travel!digital Thesaurus

Chippeway-Indianer
type: Label
in scheme: travel!digital Thesaurus

Selihide
type: Concept
definition: bdk: arabische Stammesgemeinschaft in Syrien
in scheme: travel!digital Thesaurus
related: Kudaʿide
pref label: Selihide

Kudaʿide
type: Concept
definition: bdk: arabische Stammesgemeinschaft in Syrien
in scheme: travel!digital Thesaurus
pref label: Kudaʿide

Kudaʿide
type: Label
in scheme: travel!digital Thesaurus

Selihide
type: Label
in scheme: travel!digital Thesaurus

Tsaliba
type: Concept
definition: bdk: arabische Stammesgemeinschaft in Algerien
pref label: Tsaliba
in scheme: travel!digital Thesaurus
related: Araber

Tsaliba
type: Label
in scheme: travel!digital Thesaurus

Araber
type: Concept
narrower: Indo-Araber
pref label: Araber
alt label: Araberstamm
narrower: Centralaraber
narrower: Südaraber
definition: Duden: 1. Einwohnerbezeichnung zu Arabien | Duden: Arabien: das Gebiet der Arabischen Halbinsel | Meyers Großes Konversations-Lexikon 1905: Arabien, die große Halbinsel des südwestlichen Asien, zwischen 12°40´ und etwa 34° nördl. Br., zwischen 32°30´ und 59°48´ östl. L., hat mit Sinai einen Flächenraum von 3,094,700 qkm (die einzelnen Gebiete s. unten, S. 654). Die Ostgrenze bilden der Persische Golf und das Euphratland; den Südrand bespült der Indische Ozean (Arabisches Meer), den Westrand das Rote Meer, während im NW. die Landenge von Suez A. mit Afrika verbindet. Gegen N. ist die Grenze weder natürlich noch politisch bestimmbar. A. gehört zu den unbekanntesten Ländern (s. Asien [Entdeckungsgesch.]). A. ist nach Lage und Naturbeschaffenheit das Übergangs- und Bindeglied zwischen Asien und Afrika. Als Hochplateau mit wüstenartigem Innern und meist steil abfallenden Randgebirgen teilt es am Ufersaum und im O. die trockne Wüstennatur Afrikas, während das nördliche Innere sich mehr dem Charakter der westasiatischen Hochebenen zu nähern scheint. Diese Beschaffenheit, verbunden mit der Umgebung von Wüsten und gefahrvollen Meeren, verlieh A. von jeher die größte Abgeschlossenheit. Es lag dem kriegerischen und friedlichen Verkehr fern und blieb vor aller Vermischung mit Fremden (abgesehen von Negern im W.) und vor deren Herrschaft bewahrt. Trotz seiner Lage zwischen den ältesten Kulturvölkern in Ägypten, Syrien, Mesopotamien, Persien und Indien verhielt es sich stets ab weisend gegen jeden von dorther kommenden Einfluß. Auch die Herrschaft der Römer hat sich nicht weit über das Peträische A. hinaus erstreckt. Dagegen ist A. die Wiege wandernder und erobernder Völker gewesen, die nach allen Weltgegenden ihre Herrschaft ausbreiteten. Aber auch sie haben nirgends ihre Nationalität. Sprache und Religion aufgegeben, sondern dem Fremden überall sich ebenso unzugänglich gezeigt wie ihre Wüstenheimat, wo sich die alte Geteiltheit in kleine Gebiete und das patriarchalische Hirten …
related match: Saudi Arabia
in scheme: travel!digital Thesaurus
related match: Arab world
alt label: Arabertum
alternative label: Araberstamm
alternative label: Arabertum
narrower: Nordaraber
related match: Arabian Peninsula

Indo-Araber
type: Concept
in scheme: travel!digital Thesaurus
definition: bdk: in Indien geborene(r) oder lebende(r) Araber(in)
pref label: Indo-Araber
related: Inder

Indo-Araber
type: Label
in scheme: travel!digital Thesaurus

Araber
type: Label
in scheme: travel!digital Thesaurus

Araberstamm
type: Label
in scheme: travel!digital Thesaurus

Centralaraber
type: Concept
definition: bdk: siehe Araber
pref label: Centralaraber
in scheme: travel!digital Thesaurus

Centralaraber
type: Label
in scheme: travel!digital Thesaurus

Südaraber
type: Concept
definition: bdk: siehe Araber
pref label: Südaraber
in scheme: travel!digital Thesaurus

Südaraber
type: Label
in scheme: travel!digital Thesaurus

Arabertum
type: Label
in scheme: travel!digital Thesaurus

Nordaraber
type: Concept
definition: bdk: siehe Araber
pref label: Nordaraber
in scheme: travel!digital Thesaurus

Nordaraber
type: Label
in scheme: travel!digital Thesaurus

sarmatisch
type: Concept
related match: Sarmatians
related: skythisch
pref label: sarmatisch
in scheme: travel!digital Thesaurus
definition: Duden: Sarmatien, die Sarmaten betreffend | [Anm.: unvollständig: Sarmatien, die Sarmaten betreffend; von den Sarmaten stammend, zu ihnen gehörend; in Sarmatien gelegen] | Duden: Sarmatien: alter Name des Landes zwischen Weichsel und Wolga | Meyers Großes Konversations-Lexikon 1909: Sarmatien (Sarmatia), im Altertum alles Land zwischen Weichsel und Wolga, das noch heute in der Wissenschaft den Namen »Sarmatische Tiefebene« führt, ward nach griechischer Annahme (seit Alexander) durch den Tanais in eine europäische und eine asiatische Hälfte geschieden. Flüsse waren: der Borysthenes (Dnjepr), Hypanis (Bug), Tyras (Dnjestr) und Tanais (Don) mit Gerrhos (Donez?). Nach N., in das Suevische Meer (Ostsee), strömen: Vistula (Weichsel), Guttalos (Pregel), Rudon (Memel) und Chesynos (Düna). Mit Ausnahme der südlichen Striche war das Land rauh und winterlich, von Natur, vom Süden abgesehen, wenig zum Ackerbau, aber zur Viehzucht geeignet. Die bedeutendsten Städte waren: Tanais (an der Mündung des Tanais), Olbia (an der Hypanismündung) und Tyras (an der Mündung des Tyras), alle an der Küste des Schwarzen Meeres gelegen und von Griechen gegründet. Die Bewohner, Sauromaten oder Sarmaten, kommen schon bei Herodot vor und umfassen nach Ptolemäos vier große Völkerschaften: die Ästier, vom Frischen Haff bis zum Finnischen Meerbusen; die Veneden, südlicher, von der Weichsel bis zur Düna; die Bastarner, zwischen Weichsel und Karpathen, und die Jazygen, am Nordufer des Palus Maeotis (Asowsches Meer), späterhin weiter westlich. Doch ist diese Einteilung rein geographisch, nicht ethnographisch, da in den Ästiern Vorfahren der Litauer, in den Veneden Slawen erkannt wurden und die Bastarner germanischen Ursprungs sind. Stämme der eigentlichen Sarmaten sind die Maïten (Mäoten), Alanen, Roxolanen und Jazygen, alle im N. und O. des Asowschen Meeres und im N. des Kaukasus. Am wahrscheinlichsten gehörten sie der turanischen Völkerfamilie an. Sie werden als von gelber Hautfarbe und von wildem Aus…

skythisch
type: Concept
related: Skythe
pref label: skythisch
in scheme: travel!digital Thesaurus
definition: Duden: die Skythen betreffend; von den Skythen stammend, zu ihnen gehörend
narrower: indoskythisch

Skythe
type: Concept
related: Nomade
definition: Duden: Angehöriger eines alten iranischen Nomadenvolkes | Meyers Großes Konversations-Lexikon 1908: Skythen, altes Volk, mit dessen Namen die Griechen die Völker des Nordens, d. h. nördlich vom Parapanisos, Kaukasus und Schwarzen Meer, bezeichneten: die Massageten, Saken, Sarmaten und die Skoloten. Diese letztern, von Herodot als die eigentlichen S. bezeichnet, wohnten an der Küste der Mäotis und des Pontos Euxeinos vom Tanais (Don), der ihr Gebiet von dem der Sauromaten (Sarmaten) im N. des Kaukasus trennte, bis an den Istros (Donau) auf 20 Tagereisen (100 Meilen) in das Binnenland hinein. Ihr Gebiet, aus dem sie die Kimmerier verdrängt hatten, war vom Borysthenes (Dnjepr), Hypanis (Bug) und Tyras (Dnjestr) durchflossen und eine baumlose Steppe. Deshalb trieben sie meist Viehzucht und führten ein Nomadenleben. Ihre mit Ochsen bespannten und mit einer Filzdecke versehenen Wagen dienten zugleich als Haus. Die Männer lebten viel zu Pferde. An der Spitze der einzelnen Stämme standen Vorsteher oder Stammesfürsten; aus einem Stamm in der Landschaft Gerrhos am Borysthenes wurde der König erwählt. Die ehrenvollste Beschäftigung war der Krieg; sie kämpften als Bogenschützen zu Pferd. Als höchste Gottheit verehrten sie den Himmelsgott (Papäos), das Herdfeuer und den Kriegsgott, und zwar ohne Götterbilder und Altäre, aber mit blutigen, auch Menschenopfern. Sie waren tapfer, gutartig, sorglos und gesellig, neigten aber zu Unmäßigkeit und wüstem Genuß und lebten in größter Unreinlichkeit. Daß die S. und Sarmaten arischen (iranischen) Stammes waren, behaupten Šafařík (»Slawische Altertümer«, 1837), Zeuß (»Die Deutschen und ihre Nachbarstämme«, Münch. 1837), Müllenhoff, Cuno (»Die S.«, Berl. 1871) und Brandis (im 4. Bande von Helmolts »Weltgeschichte«, Leipz. 1900). Mit den Griechen, die an ihrer Küste zahlreiche Kolonien anlegten, standen sie in lebhaftem Verkehr und einigem Kulturaustausch (vgl. Anacharsis). 513 v. Chr. setzte der persische König Dareios I. mit 700,000 Mann übe…
in scheme: travel!digital Thesaurus
alt label: Scythe
pref label: Skythe
alternative label: Scythe

Scythe
type: Label
isVariantOf: Skythe
in scheme: travel!digital Thesaurus

Skythe
type: Label
hasVariant: Scythe
in scheme: travel!digital Thesaurus

skythisch
type: Label
in scheme: travel!digital Thesaurus

indoskythisch
type: Concept
definition: bdk: siehe indisch, skythisch
in scheme: travel!digital Thesaurus
pref label: indoskythisch
related: indisch
related: Nomade

indoskythisch
type: Label
in scheme: travel!digital Thesaurus

sarmatisch
type: Label
in scheme: travel!digital Thesaurus

canadisch
type: Concept
alternative label: kanadisch
in scheme: travel!digital Thesaurus
narrower: canadisch-amerikanisch
alt label: kanadisch
pref label: canadisch
related: Canadier
narrower: britisch-canadisch
pref label: canadian
narrower: englisch-canadisch
definition: Duden: kanadisch: Kanada, die Kanadier betreffend; aus Kanada stammend | [Anm.: unvollständig: Kanada, die Kanadier betreffend; von den Kanadiern stammend, zu ihnen gehörend; in Kanada gelegen]
preferred label: canadian @en

canadisch-amerikanisch
type: Concept
definition: bdk: siehe canadisch, amerikanisch
in scheme: travel!digital Thesaurus
pref label: canadisch-amerikanisch

canadisch-amerikanisch
type: Label
in scheme: travel!digital Thesaurus

kanadisch
type: Label
isVariantOf: canadisch
in scheme: travel!digital Thesaurus
isTranslationOf: canadian

canadisch
type: Label
hasVariant: kanadisch
in scheme: travel!digital Thesaurus
hasTranslation: canadian

canadian
type: Label
isTranslationOf: canadisch
in scheme: travel!digital Thesaurus
isTranslationOf: kanadisch

Canadier
type: Concept
pref label: Canadier
in scheme: travel!digital Thesaurus
definition: Duden: Kanadier: 1. Einwohnerbezeichnung zu Kanada | Duden: Kanada: Staat in Nordamerika | Meyers Großes Konversations-Lexikon 1907: Kanada (Dominion of Canada; hierzu Karte »Britisch-Nordamerika«), brit. Kolonie in Nordamerika, zwischen 41°42'–83° nördl. Br. und 57–141° westl. L., umfaßt den ganzen nördlich von den Vereinigten Staaten liegenden Teil dieses Erd teils, mit Ausnahme von Alaska, Grönland und der britischen Kolonie Neufundland, und hat 9,4 Mill. qkm Fläche (einschließlich der Arktischen Inseln und 365,000 qkm Wasserfläche). | [Bodengestaltung.] Die Küsten haben 18,000 km Länge (kleinere Krümmungen ungerechnet), aber nur der außerhalb des Lorenzgolfs gelegene Teil der atlantischen Küste und die pazifische Küste sind das ganze Jahr eisfrei, während der Lorenzgolf fünf Monate lang und die Hudsonbai (s. d.) acht Monate durch Küsten- und Treibeis gesperrt sind. An vorzüglichen Häfen ist kein Mangel, und nach der künstlichen Vertiefung des St. Petersees (oberhalb Quebec) können selbst große Seeschiffe den St. Lorenzstrom bis Montreal hinausfahren. [...] | Die Bevölkerung betrug 1871; 3,635,024,1881: 4,324,810 und 1901: 5,373,314 Seelen, wuchs also im letzten Jahrzehnt nur langsam (um 11,13 Proz.). Die Einwanderung betrug 1901: 49,149,1903 aber 128,364 Köpfe und war im letztern Jahre besonders stark aus Dakota und Minnesota. Der Nationalität nach waren 1901: 1,649,352 französischen, 1,263,575 englischen, 989,858 irischen, 798,986 schottischen und 309,741 deutschen, 33,839 holländischen, 31,104 skandinavischen und 23,586 russischen Ursprungs. Indianer zählte man 1901 nur noch 93,310, Neger 17,427, Chinesen 17,299, Japaner 4738. Von den Franzosen wohnten 1,322,154 in der Provinz Quebec, 158,698 in Ontario, 79,988 in Neubraunschweig und 45,067 in Neuschottland, von den Deutschen 203,964 in Ontario, 38,854 in Neuschottland und 27,346 in Manitoba. Die Franzosen (Habitants), vorwiegend Nachkommen von Einwanderern aus der Normandie, haben trotz der langen Zeit und vi…
related match: Canada

Canadier
type: Label
in scheme: travel!digital Thesaurus

britisch-canadisch
type: Concept
definition: bdk: siehe britisch, canadisch
in scheme: travel!digital Thesaurus
pref label: britisch-canadisch

britisch-canadisch
type: Label
in scheme: travel!digital Thesaurus

englisch-canadisch
type: Concept
definition: bdk: siehe englisch, canadisch
pref label: englisch-canadisch
in scheme: travel!digital Thesaurus
related: britisch-canadisch

englisch-canadisch
type: Label
in scheme: travel!digital Thesaurus

kaschmirisch
type: Concept
related match: Kashmir
pref label: kaschmîri
in scheme: travel!digital Thesaurus
comment: Indien 1914: nur englisch
definition: Duden: zu Kaschmir gehörend, Kaschmir, die Kaschmirer betreffend | [Anm.: unvollständig: Kaschmir, die Kaschmirer betreffend; von den Kaschmirern stammend, zu ihnen gehörend; in Kaschmir gelegen] | Duden: Kaschmir: zwischen Indien und Pakistan geteiltes Gebiet im Himalaja | Meyers Großes Konversations-Lexikon 1907: Kaschmir (amtlich K. und Dschamu, engl. Cashmere [Kashmir] and Jammu oder Jummoo), Vasallenstaat an der Nordwestgrenze des britisch-ind. Reiches (s. die Karten »Ostindien« und »Zentralasien«), dem Vizekönig direkt unterstellt, zwischen 32°17'–36°58' nördl. Br. und 73°26'–80°30' östl. L., grenzt im N. und O. an das Chinesische Reich (Ostturkistan und Tibet), im S. und W. an Pandschab[707] und Kasiristan und ist 209,500 qkm groß mit (1901) 2,905,578 Einw. Nach dem Zensus von 1891 verteilte sich die Bevölkerung folgendermaßen: [...] | Die Bevölkerung bestand 1901 aus 2,154,695 Mohammedanern, 689,073 Hindu, 442 Dschaina, 25,828 Sikh und 422 Christen. Die Bewohner von K. sind meist groß und stark, mit regelmäßigen, bei den Mohammedanern jüdischen Gesichtszügen und olivenfarbiger Haut; heiter und witzig, aber auch falsch und ausschweifend. Die Mehrzahl stammt von arischen Einwanderern, die das Tal von K. von Westen über Baramula schon im 2. Jahrtausend v. Chr. besiedelten; im äußern Himalaja sitzen noch Reste der vorarischen wie der später in das indische Pandschab eingedrungenen türkischen Völker (vgl. A. Cunningham, Archaeological Survey of India, Bd. 2, Kalk. 1871). Die Sprache ist im Tal von K. Kaschmiri, im äußern Himalaja Dogra, Tochtersprachen des Sanskrits, letzteres dem modernen Hindi verwandter (vgl. Grierson, Essays on Kaçmiri grammar, Lond. 1899; weitere Literatur s. unten). Die Kleidung besteht in Beinkleidern und einem wollenen Umhang. Die Auswanderung nach Indien ist stets beträchtlich gewesen, auch in den letzten Jahren. Volksschulen gibt es längst überall, auch für höhere Schulen wird jetzt gesorgt; eine Summe von 3000 Pfd. Sterl. jährlich ist …
pref label: kaschmirisch
related match: Kashmiris
preferred label: kaschmîri @en

kaschmîri
type: Label
isTranslationOf: kaschmirisch
in scheme: travel!digital Thesaurus

kaschmirisch
type: Label
hasTranslation: kaschmîri
in scheme: travel!digital Thesaurus

Etrusker
type: Concept
definition: Duden: Einwohnerbezeichnung | [Anm.: unvollständig: Einwohnerbezeichnung zu Etrurien]| Duden: Etrurien: altitalienische Landschaft | Meyers Großes Konversations-Lexikon 1906: Etrurĭen (Tuscia, von den Griechen Tyrrhenia genannt, s. Karte beim Art. »Italia«), Landschaft auf der westlichen Seite von Mittelitalien, vom etruskischen Apennin bis zum Tibertal; im Altertum stark bevölkert, blühend und fruchtbar, hafenreich, im Besitz einer alten und eigentümlichen Kultur und von politischer Bedeutung. Die Hauptflüsse von E. waren der Arnus (Arno), der Clanis (Chiana), ein Nebenfluß des Tiber, und die Küstenflüsse Umbro (Ombrone), Albinia (Albegna), Armenta (Fiora) und Marta (Ausfluß des Volsinischen Sees). Die östlichen, am Fuß des Apennin gelegenen Teile sind ausgezeichnet durch mildes Klima, fruchtbaren Boden und reiche Bewässerung, aber auch der Westen, die jetzt sogen. Maremme, war im Altertum reich bebaut. Der ganze südliche Teil Etruriens ist vulkanischer Natur und wird nur von einzelnen Kalkbergen, so dem 740 m hohen Soracte, durchbrochen. Die zahlreichen, kesselartig eingeschlossenen Seen jener Gegend, der Trasimenus (Lago di Perugia) und der Volsiniensis (Lago di Bolsena), die beiden größten, ferner der Ciminius (Lago di Vico), der Sabatinus (Lago di Bracciano) und der Vadimonis (Lago di Bassano), füllen erloschene und eingestürzte Krater. An andern Stellen hatte die tuskische Wasserbaukunst die Seen durch Emissarien, die durch die Seiten der Berge gebrochen wurden, abgelassen, um dadurch Land für die Kultur zu gewinnen. Unter den Bodenerzeugnissen Etruriens sind besonders zu nennen: der clusinische Spelt (far), aus dem das einheimische Nationalgericht, der djcke Mehlbrei (puls), bereitet wurde, Flachs, Wein und Öl. Der Apennin lieferte herrliche Tannenstämme als Bauholz zu Wohnungen und Schiffen, so daß Rom einen großen Teil seines Bedarfs aus E. bezog. Auch Viehzucht, Fischfang und Jagd waren Nahrungszweige. Von Mineralien wurden Eisen auf dem benachbarten Ilva …
related match: Etruria
related match: Etruscan civilization
in scheme: travel!digital Thesaurus
pref label: Etrusker

Etrusker
type: Label
in scheme: travel!digital Thesaurus

Gad
type: Concept
pref label: Gad
in scheme: travel!digital Thesaurus
definition: Meyers Großes Konversations-Lexikon 1907: Gad (hebr., »Glück«), 1) Sohn Jakobs und der Silpa, Ahnherr des gleichnamigen Stammes, der beim Auszug aus Ägypten 45,650 Mann zählte und beim Einzug in Kanaan den Vortrab bildete. Sein Gebiet lag im N., wurde westlich vom Jordan, südlich vom See Genezareth begrenzt. – 2) Prophetischer Berater Davids, hat nach der Chronik geschichtliche Aufzeichnungen über dessen Regierung und Anordnungen über die Tempelmusik hinterlassen. | Quelle: Meyers Großes Konversations-Lexikon, Band 7. Leipzig 1907, S. 251. | Permalink: http://www.zeno.org/nid/20006646670

Gad
type: Label
in scheme: travel!digital Thesaurus

dänisch
type: Concept
related: Däne
in scheme: travel!digital Thesaurus
definition: Duden: die Dänen, Dänemark betreffend, zu Dänemark gehörend, aus Dänemark stammend | [Anm.: unvollständig: Dänemark, die Dänen betreffend; von den Dänen stammend, zu ihnen gehörend; in Dänemark gelegen]
pref label: dänisch

dänisch
type: Label
in scheme: travel!digital Thesaurus

Wedda
type: Concept
definition: Meyers Großes Konversations-Lexikon 1909: Wedda (Vedda, Beda), Reste der negroiden Urbevölkerung von Ceylon, die in den Waldregionen des sogen. Weddaratta, im O. Ceylons, östlich von der Mahavili Ganga, namentlich aber in den Distrikten Batticaloa, Badulla, Nilgala und in den Wäldern von Bintenna wohnen und zum größten Teil bald mit ihren kultivierten Nachbarn verschmelzen werden. Die Zahl der »wilden« W. beträgt höchstens 300 (s. Tafel »Asiatische Völker II«, Fig. 12). Vgl. P. und F. Sarasin, Ergebnisse naturwissenschaftlicher Forschungen auf Ceylon, Bd. 3 (Wiesbad. 1893); L. Rütimeyer im »Globus«, Bd. 83. | Quelle: Meyers Großes Konversations-Lexikon, Band 20. Leipzig 1909, S. 454. | Permalink: http://www.zeno.org/nid/20007680031
narrower: Wedda-Weib
pref label: Wedda
narrower: Wedda-Mann
narrower: Felsenwedda
in scheme: travel!digital Thesaurus
narrower: Dorfwedda

Wedda-Weib
type: Concept
definition: bdk: weibliche Angehörige der Wedda, einer Ethnie in Ceylon
in scheme: travel!digital Thesaurus
pref label: Wedda-Weib
label: Wedda-Frau
related: Wedda-Mann

Wedda-Weib
type: Label
in scheme: travel!digital Thesaurus

Wedda-Mann
type: Concept
in scheme: travel!digital Thesaurus
pref label: Wedda-Mann
definition: bdk: männlicher Angehöriger der Wedda, einer Ethnie in Ceylon

Wedda-Mann
type: Label
in scheme: travel!digital Thesaurus

Wedda
type: Label
in scheme: travel!digital Thesaurus

Felsenwedda
type: Concept
in scheme: travel!digital Thesaurus
definition: bdk: siehe Wedda
pref label: Felsenwedda

Felsenwedda
type: Label
in scheme: travel!digital Thesaurus

Dorfwedda
type: Concept
in scheme: travel!digital Thesaurus
pref label: Dorfwedda
definition: bdk: siehe Wedda

Dorfwedda
type: Label
in scheme: travel!digital Thesaurus

Arkiter
type: Concept
in scheme: travel!digital Thesaurus
pref label: Arkiter
definition: Pierer's Universal-Lexikon 1857: Arke (a. Geogr.), 1) Stadt am Libanon in Phönicien; später Caesarea Libani, Geburtsort des Kaisers Alexander Severus; 2) Stadt in der Nähe von Sidon, soll von Kanaans Sohn Arki, Stammvater der Arkiter, gebaut sein, kam bei der Theilung Palästinas an den Stamm Asser. | Quelle: Pierer's Universal-Lexikon, Band 1. Altenburg 1857, S. 718. | Permalink: http://www.zeno.org/nid/20009402632

Arkiter
type: Label
in scheme: travel!digital Thesaurus

isländisch
type: Concept
pref label: isländisch
in scheme: travel!digital Thesaurus
related match: Iceland
definition: Duden: 1. Island, die Isländer betreffend; zu Island gehörend, von Island stammend | [Anm.: unvollständig: Island, die Isländer betreffend; von den Isländern stammend, zu ihnen gehörend; in Island gelegen] | Duden: Island: Insel und Staat im Europäischen Nordmeer | Meyers Großes Konversations-Lexikon 1907: Island, eine zu Dänemark gehörige Insel im nördlichen Atlantischen Ozean, liegt zwischen 63°23'–66°32' nördl. Br. und 13°31'–24°29' westl. L., ist 965 km von Norwegen und 360 km von Grönland entfernt. Ihre Ausdehnung beträgt von N. nach S 356 km, von W. nach O. 490 km, mit einem Flächeninhalt von 104,785 qkm (1903 QM.). Vgl. die Karte auf S. 52. [...] | Die Zahl der Bewohner Islands betrug 1703: 50,444,1769: 46,201,1786 nur 38,142,1801: 47,240 und 1901: 78,489 Seelen, so daß gegenwärtig, wenn man nur den bewohnbaren Teil der Insel (42,068 qkm) rechnet, noch nicht zwei Menschen auf dem Quadratkilometer wohnen. Die Ursachen dieser geringen Dichtigkeit der Bevölkerung sind hauptsächlich in den natürlichen Verhältnissen zu suchen. Die Isländer sind germanischen Stammes, gehören zur skandinavischen Familie und haben noch ihre eigentümliche Nationalität in völliger Reinheit bewahrt. Ihre Sprache ist noch heute die eingeführte alte norwegische, die man die isländische nennt, und besitzt eine alte, reiche und eigenartig bedeutende Literatur sowie eine Fülle von Sagen (s. Nordische Sprache und Literatur). Landschulen gibt es nicht, aber die Eltern unterrichten selbst ihre Kinder. Eine gelehrte Schule besteht in Reykjavik und eine Realschule in Akreyri. In Reykjavik befindet sich außerdem eine theologische und eine medizinische Lehranstalt. Auch erscheinen mehrere Zeitungen. Von Holz erbaute und wohnlicher eingerichtete Häuser findet man nur in Reykjavík und in den Städten und Handelsplätzen. Auf dem Lande dagegen sind die Häuser durchgängig von Erde und Steinen gebaut. Alle Häuser sind mit Grastorf gedeckt. | Die Industrie Islands ist natürlich gering. Der Hausfleiß liefer…

isländisch
type: Label
in scheme: travel!digital Thesaurus

Galater
type: Concept
in scheme: travel!digital Thesaurus
pref label: Galater
definition: Duden: keltisches Volk in Kleinasien | Meyers Großes Konversations-Lexikon 1907: Galăter, griech. Form des Namens der Kelten oder Gallier, bezeichnet besonders den keltischen Volksstamm, der das nach ihm benannte Galatien in Kleinasien bewohnte. Als die Scharen der Kelten, die um 280 v. Chr. unter Anführung des Belgius und später des Brennos von N. her in Makedonien und Griechenland eingedrungen waren (s. Kelten), sich 279 vor Delphi zum Rückzug genötigt sahen, kehrte nur ein kleiner Teil heim; ein andrer durchstreifte Thrakien und gelangte unter Anführung des Lutarios und Leonnorios an den Hellespont. Hier folgten sie 277 der Einladung des bithynischen Königs Nikomedes I., der mit seinen Brüdern um die Krone kämpfte, verhalfen jenem zum Besitz und durchzogen nun, 20,000 Mann stark, jahrelang plündernd den Westen Kleinasiens bis an den Halys. Sie teilten sich in drei Stämme, die Tolistobojer, Trokmer und Tektosagen, die sich in Lydien, Mysien und Phrygien festsetzten. Antiochos I. von Syrien besiegte sie zwar und erhielt davon den Namen Soter (»Retter«), fiel aber bald darauf in einer zweiten Schlacht. Endlich 235 durch Attalos I. von Pergamon besiegt, mußten sie feste Wohnsitze einnehmen. Es wurde ihnen der Teil von Großphrygien eingeräumt, der sich von Pessinus an der Grenze Phrygiens bis an die kappadokische Landschaft Sargarausene erstreckte und von nun an den Namen Galatia erhielt. Das Land ist gebirgig, vorzüglich im N., wo es durch den Olympos oder Orminios (jetzt Ala Dagh) begrenzt ward. Unter den Flüssen sind der Sangarios (Sakaria) im W. des Landes und der Halys im O. die bedeutendsten. Unter den Orten der G. waren die wichtigsten: Ankyra (jetzt Angora), die Hauptstadt der Tektosagen, später von ganz Galatien; Tavia jenseit des Halys, der Hauptort der Trokmer; Pessinus, die Hauptstadt der Tolistobojer; ferner das aus der Geschichte Alexanders bekannte Gordion. Der Steppencharakter des Binnenlandes sagte diesen Hirtenstämmen zu. Sie nahmen griechische Sprac…

Galater
type: Label
in scheme: travel!digital Thesaurus

Burgher
type: Concept
in scheme: travel!digital Thesaurus
pref label: Burgher
related: Eurasier
definition: bdk: euroasiatische ethnische Gruppe in Ceylon (heute Sri Lanka) | Pierer's Universal-Lexikon 1865: Burghers, heißen auf Ceylon die Abkömmlinge von Europäern u. Eingeborenen; sie werden gewöhnlich zu Clerks in den Bureaux u. zu niederen Magistraten verwendet. | Quelle: Pierer's Universal-Lexikon, Band 19. Altenburg 1865, S. 819. | Permalink: http://www.zeno.org/nid/20011371439

Burgher
type: Label
in scheme: travel!digital Thesaurus

Eurasier
type: Concept
related: Asiat
related: Europäer
in scheme: travel!digital Thesaurus
related match: Eurasia
definition: Duden: 1. Einwohnerbezeichnung | 2. jemand, der als Kind eines europäischen und eines asiatischen Elternteils geboren wurde | [Anm.: unvollständig: Einwohnerbezeichnung zu Eurasien] | Duden: Eurasien: Asien und Europa umfassende Landmasse | Meyers Großes Konversations-Lexikon 1906: Eurasĭer, die aus der Kreuzung von Europäern und eingebornen Asiaten (Indier) hervorgegangene Mischrasse (half-caste oder half-breed). Die Hautfarbe der E. durchläuft die ganze Farbenskala vom tiefsten Schwarz durch die verschiedenen Abtönungen von Braun und Gelb bis zum blassen Weiß. Nach dem Zensus von 1891 betrug ihre Zahl in der Regentschaft Madras 26,643 Köpfe, auf Ceylon 21,231 (unter 3 Mill. Einwohnern). Vgl. Thurston im Bulletin des Madras Government Museum II, 2 (1898). | Quelle: Meyers Großes Konversations-Lexikon, Band 6. Leipzig 1906, S. 169. | Permalink: http://www.zeno.org/nid/20006576079
related: Mischling
pref label: Eurasier

Asiat
type: Concept
narrower: Ostasiat
definition: Duden: Einwohnerbezeichnung | [Anm.: unvollständig: Einwohnerbezeichnung zu Asien] | Duden: Asien: größter Erdteil | Meyers Großes Konversations-Lexikon 1905: Asien (hierzu zwei Karten: »Asien, Fluß- und Gebirgssysteme« und »Politische Übersicht«), der größte, höchste und nach seiner geschichtlichen Entwickelung älteste Erdteil. Der Name stammt von dem assyrischen »Aszu« = Aufgang (der Sonne), im Gegensatze zu Ereb (dem Dunkel oder Sonnenuntergang), wovon Europa (vgl. Erdteil). [...] | (Hierzu die »Asiatische Völker I u. II«, mit Erklärungsblatt, und »Asiatische Kultur I, mit Erklärungsbl., u. II, III«.) | Für die Bevölkerung Asiens ist man meist nur auf Schätzungen angewiesen. Zählungen liegen außer für die europäischen Kolonien nur für Japan und China (zuletzt 1894, aber nicht zuverlässig) vor. Wagner und Supan veranschlagen Asiens Volkszahl auf 813,589,000 Seelen, d.h. weit über die Hälfte sämtlicher Bewohner der Erde (1479,7 Mill.). Die Dichtigkeit der Bevölkerung ist in den einzelnen Gebieten sehr verschieden. Neben riesigen Strecken fast unbewohnten Landes finden sich die größten Gebiete dichtester Besiedelung auf der Erde überhaupt. Eine am Süd- und Ostrande Hochasiens entlang laufende Linie scheidet die dichtbevölkerten von den schwachbevölkerten Ländern. Auf 1 qkm wohnen in Nord-, Zentral- und Westasien nur 2, in Südasien dagegen 60 Einw., genauer: im nördlichen Waldgebiet 0,5, in den Steppen und Wüsten der zentral-asiatischen Hochländer 1,4, des Aralokaspischen Beckens 2,2 und Vorderasiens 5, im Monsungebiete der tropischen Waldlandschaft (Hinterindien und Ostindischer Archipel) 14, in dem Kulturland Vorderindiens 67 und China-Japan 95 Einw. durchschnittlich. Die Bevölkerungsdichte des Erdteils beträgt nur 18 auf 1 qkm. Vgl. Karte »Bevölkerungsdichtigkeit der Erde« mit Nebenkärtchen von Südostasien und Tabelle. Nach der politischen Einteilung ergibt sich folgende Übersicht: | Ethnographisch gehört die Bevölkerung Asiens drei verschiedenen Rassen an: 1) Kau…
narrower: Kleinasiat
related match: Asia
narrower: Mittelasiat
in scheme: travel!digital Thesaurus
pref label: Asiat
narrower: Südasiat

Ostasiat
type: Concept
related match: East Asia
in scheme: travel!digital Thesaurus
definition: Duden: Einwohnerbezeichnung | [Anm.: unvollständig: Einwohnerbezeichnung zu Ostasien]
pref label: Ostasiat

Ostasiat
type: Label
in scheme: travel!digital Thesaurus

Kleinasiat
type: Concept
in scheme: travel!digital Thesaurus
pref label: Kleinasiat
definition: bdk: Einwohnerbezeichnung zu Kleinasien | Duden: Kleinasien: Halbinsel zwischen Schwarzem Meer und Mittelmeer | Meyers Großes Konversations-Lexikon 1907: Kleinasien (hierzu Karte »Kleinasien«), die große westasiat. Halbinsel, die zwischen 36 und 42° nördl. Br. und zwischen 26 und 42° östl. L. sich westwärts vom Euphrat zwischen dem Schwarzen und Mittelländischen Meer bis an das Ägäische und Marmarameer ausdehnt und den Kern des türkischen Reiches bildet. Gegen Osten hat K. keine natürliche Grenze; eine Linie, von Trapezunt zur Spitze des Issischen Meerbusens gezogen, ist als östliche Begrenzung rein willkürlich. Ebenso hatte das Altertum keinen eignen Namen für das weder politisch noch ethnisch ein Ganzes bildende Land; er findet sich erst im 4. Jahrh. n. Chr., gleichsam im Gegensatz zum übrigen Asien, ist aber auch in anderm Sinne zutreffend, da die Halbinsel in großen Zügen die Bodengestalt des großen Asien wiederholt: Tafelland in der Mitte, Randgebirge und Terrassenländer an den Seiten. Vom armenischen Hochland ziehen die Ketten nach W., die das Tafelland der Mitte umschließen. Den Nordrand bildet eine durch die Pontuszuflüsse häufig durchbrochene Reihe von Parallelketten, die nach W. bis zum Ida und zum Kap Baba ziehen und in Lazistan mit 3700 m gipfeln. Den Südrand bilden die Faltenzüge des Taurus. Vom armenischen Berglande zieht ein mächtiger Zug, bei Malatia vom Euphrat durchbrochen, nach SW. und trägt im N. der Bucht von Alexandrette Gipfel von über 3000 m. Er begleitet nach W. die Küste des Mittelmeers, erreicht im Bulgar Dagh 3500 m Höhe, steigt im Lykischen Taurus noch einmal über 3000 m an und läuft schließlich in langen, schmalen Halbinseln ins Ägäische Meer aus. An der Nord- und Südseite lassen die schroff abstürzenden Gebirge nur einen schmalen Küstensaum frei; dagegen senkt sich gegen W. das Bergland sanfter in mehreren Terrassen zum Meer. Die Küsten selbst sind fast überall steil und namentlich an der Westseite tief gebuchtet. Nach dem Innern dache…

Kleinasiat
type: Label
in scheme: travel!digital Thesaurus

Mittelasiat
type: Concept
related match: Central Asia
definition: Duden: Zentralsien: Bereich der großen (zumeist zu China und der Mongolei gehörenden) Hochländer im Innern Asiens | Meyers Großes Konversations-Lexikon 1909: Zentralasien (hierzu die Karte »Zentralasien«), die zuerst von Ritter gebrauchte Bezeichnung für den Rumpf des Kontinents Asien im Gegensatz zu den Gliedern, während A. v. Humboldt das Gebiet so nannte, das vom Kaukasus im W., Sibirien im N., China im O. und Indien im S. begrenzt wird. Indes hat F. v. Richthofen diese Begrenzung als unhaltbar nachgewiesen und Z. auf das größtenteils abflußlose Land zwischen dem Altai im N., dem Pamir im W., der Wasserscheide von Indus und Brahmaputra im Hochland von Tibet im S., der Wasserscheide der Riesenströme von China (Yangtsekiang und Hwangho) und dem Chingangebirge im O. beschränkt; diesem Kern sind die »peripherischen Gebiete«, wie Russisch-Turkistan und das Hochland Iran, angeschlossen. Somit ist Z. das zusammenhängende festländische Gebiet der, geologisch betrachtet, alten abflußlosen Wasserbecken, ein Land, wo die durch den Charakter der Abflußlosigkeit bedingten Erscheinungen zu vollem Ausdruck gekommen sind. Zwischen dem eigentlichen Z. und den peripherischen Ländern liegt eine Übergangszone, nämlich Teile der abflußlosen Gebiete, die in den jüngsten Perioden Abfluß erhalten haben (oberes Indusbecken im Hochtibet, Kuku Nor-Becken scheint nachzufolgen), oder Gebiete, in denen das Umgekehrte stattgefunden hat (Pangkongsee in Westtibet). Die Oberflächengestalt von Z. ist durch viele große und kleine, äußerst flache, mit Steppenboden erfüllte Senkungen ausgezeichnet, in denen das niederfallende Wasser von den Rändern zur Mitte fließt und entweder schon vorher versiegt oder dort in einem Salzsee oder Salzsumpf endet oder endlich zu einem benachbarten tiefern Becken weiterfließt. Zwischen den Senken erstrecken sich meist nur einförmige, flach gerundete Rücken; unmerklich steigt man dann vom Salzsee auf dem Steppenboden nach dem Scheiderücken auf und ebenso nach einem vie…
in scheme: travel!digital Thesaurus
pref label: Mittelasiat

Mittelasiat
type: Label
in scheme: travel!digital Thesaurus

Asiat
type: Label
in scheme: travel!digital Thesaurus

Südasiat
type: Concept
in scheme: travel!digital Thesaurus
pref label: Südasiat
definition: bdk: Einwohnerbezeichnung zu Südasien
related match: South Asia

Südasiat
type: Label
in scheme: travel!digital Thesaurus

Europäer
type: Concept
narrower: Mitteleuropäer
narrower: Nordeuropäer
pref label: européen
related match: Europe
in scheme: travel!digital Thesaurus
pref label: Europäer
preferred label: européen @fr
definition: Duden: 1. Einwohnerbezeichnung zu Europa | Duden: Europa: 1. als Erdteil angesehener westlicher Teil Eurasiens | 2. Staatenkomplex, der durch einen Zusammenschluss der europäischen Staaten entstehen soll | Meyers Großes Konversations-Lexikon 1906: Eurōpa (hierzu die Karten: »Europa. Fluß- und Gebirgssysteme« und »Politische Übersicht«), einer der fünf Erdteile, der kleinste der drei, welche die Alte Welt bilden. [...] E. ist seiner Gliederung wie seiner kulturhistorischen und politischen Bedeutung nach unbedingt der wichtigste unter den fünf Erdteilen. Der Name ist wahrscheinlich assyrischen oder phönikischen Ursprungs (hier ereb = Dunkel, d. h. Sonnenuntergang). Seiner Größe nach stellt sich E. mehr als die größte der Halbinseln des mächtigen Asien dar, mit dem es seiner ganzen Breite nach im O. zusammenhängt; aber die selbständige Entwickelung, die das menschliche Geschlecht auf seinem Boden genommen, Europas Stellung in der Weltgeschichte berechtigen vollständig, dasselbe als besondern Erdteil anzunehmen. Daß der kleine Erdteil seinen überwältigenden Einfluß auf die größern ausüben kann, hat seinen Grund in der Weltstellung desselben. E. liegt nämlich gerade in der Mitte der Landanhäufung auf der Erdkugel, umlagert von drei Erdteilen in größerer oder geringerer Entfernung, von Asien, Afrika und Nordamerika, und wenn es auch nur mit einem unmittelbar zusammenhängt, so ist es von den übrigen doch bloß durch verhältnismäßig schmale und leicht zu passierende Meeresteile gesondert. | Die nordwestlichen Grenzen Europas berührt der Atlantische Ozean. Das Mittelländische und Schwarze Meer im S., das Baltische im N. des Erdteils, Binnenmeere von einer Bedeutung, wie sie kein andrer Kontinent aufzuweisen hat, dringen mit ihren Armen vielfältig und tief in denselben ein und bringen die entferntesten Erdteile in innigere Berührung mit E., als sie das kontinentale Asien trotz der Landverbindung hat. Der größte Teil der Nord- und Nordwestgrenzen Europas ist ozeanisch; die Südg…

Mitteleuropäer
type: Concept
definition: Duden: Einwohnerbezeichnung | [Anm.: unvollständig: Einwohnerbezeichnung zu Mitteleuropa] | Duden: Mitteleuropa: mittlerer Teil Europas
related match: Central Europe
pref label: Mitteleuropäer
in scheme: travel!digital Thesaurus

Mitteleuropäer
type: Label
in scheme: travel!digital Thesaurus

Nordeuropäer
type: Concept
definition: Duden: Einwohnerbezeichnung | [Anm.: unvollständig: Einwohnerbezeichnung zu Nordeuropa] | Duden: Nordeuropa: nördlicher Teil Europas
related match: Northern Europe
in scheme: travel!digital Thesaurus
pref label: Nordeuropäer

Nordeuropäer
type: Label
in scheme: travel!digital Thesaurus

européen
type: Label
isTranslationOf: Europäer
in scheme: travel!digital Thesaurus

Europäer
type: Label
hasTranslation: européen
in scheme: travel!digital Thesaurus

Mischling
type: Concept
preferred label: half-caste @en
definition: Duden: 1. Person, deren Elternteile verschiedenen Bevölkerungsgruppen angehören | Meyers Großes Konversations-Lexikon 1908: Mischlinge, soviel wie Farbige; auch soviel wie Bastardpflanzen. | Quelle: Meyers Großes Konversations-Lexikon, Band 13. Leipzig 1908, S. 894. | Permalink: http://www.zeno.org/nid/20007095171
pref label: Mischling
related: Mischrasse
in scheme: travel!digital Thesaurus
related: Kaste
pref label: half-caste

Mischling
type: Label
hasTranslation: half-caste
in scheme: travel!digital Thesaurus

half-caste
type: Label
isTranslationOf: Mischling
in scheme: travel!digital Thesaurus

Mischrasse
type: Concept
definition: bdk: siehe Rasse
pref label: Mischrasse
in scheme: travel!digital Thesaurus

Mischrasse
type: Label
in scheme: travel!digital Thesaurus

Kaste
type: Concept
narrower: Schûdra
narrower: Priesterkaste
narrower: Paria
narrower: Dolmetscherkaste
narrower: Brahmanenkaste
pref label: Kaste
narrower: Rodiya
in scheme: travel!digital Thesaurus
narrower: Vaischya
definition: Duden: 1. (besonders innerhalb der hinduistischen Gesellschaftsordnung) sich streng abschließende Schicht mit besonderen Sitten und Heiratsverbot außerhalb ihrer selbst | 2. sich streng absondernde Gruppe, Gesellschaftsschicht [deren Angehörige ein übertriebenes Standesbewusstsein pflegen] | Meyers Großes Konversations-Lexikon 1907: Kaste (v. portug. casta, »Rasse, Stamm«, Übersetzung des ind. dschâti, »Stand«), von den Portugiesen nach der Erreichung Indiens zuerst gebrauchte Bezeichnung für die dortige gesellschaftliche Gliederung; auf europäische Verhältnisse übertragen dann zur Bezeichnung von Gesellschaftsschichten und Berufen verwendet, die sich streng durch Sitte und Gesetz von jeder andern abschließen, ohne daß eine nähere Berührung, Vermischung oder ein Aufsteigen aus den niedern in die höhern gestattet wäre. Da nach dieser Gesellschaftsordnung die Kinder unabänderlich in der mütterlichen K. verbleiben, so ist der individuellen Entwickelung hierbei schon durch die Geburt eine unübersteigliche Schranke gezogen. Zur Herausbildung von Kasten ist es bei den verschiedensten Völkern und in den verschiedensten Kulturkreisen gekommen; am bekanntesten ist das Kastenwesen in Indien geworden, wo es bei den Hindu wie auch auf Ceylon noch heute im höchsten Maße blüht; auch im alten Ägypten war es sehr streng ausgebildet. Erbliche Kasten gibt es dann bei den Japanern und Chinesen, im Osthorn Afrikas und in Oberguinea, in Polynesien etc. Auch die strenge Sonderung der Berufe in reine und unreine, die bei uns zum Teil bis ins 18. Jahrh. gedauert hat, gemahnt an das Kastenwesen. | Für die Entstehung der Kasten können sehr verschiedenartige Umstände und Sachlagen maßgebend sein. In den meisten Fällen wird man an kriegerische Umwälzungen in den betreffenden Ländern zu denken haben, indem sich dort die siegreiche Partei zur herrschenden K. aufwarf und die bisherigen Bewohner des Landes zu Unterworfenen, Besitzlosen und Leibeignen machte. Einen solchen Verlauf haben wir im alte…
narrower: Kschatriya

Schûdra
type: Concept
alternative label: Knecht
in scheme: travel!digital Thesaurus
pref label: Schûdra
alt label: Knecht
definition: Duden: Schudra: Angehöriger der untersten der vier Kasten im alten Indien | Meyers Großes Konversations-Lexikon 1906: Çudra (spr. ßūdra, auch schūdra), die vierte und unterste der altindischen Kasten, umfaßt ursprünglich die bis auf einen gewissen Grad an die Lebensgemeinschaft der arischen Eroberer angeschlossenen Nichtarier, Handwerker, Tagelöhner, Diener etc. Während diese nach der orthodoxen Lehre als Diener der andern Kasten galten, waren sie tatsächlich oft reich; der mächtige König Tschandragupta soll ihnen angehört haben. Schon in buddhistischer Zeit hatte der Begriff der C. viel von seiner alten Bedeutung eingebüßt; gegenwärtig ist er nur gelehrte Antiquität. | Quelle: Meyers Großes Konversations-Lexikon, Band 4. Leipzig 1906, S. 367. | Permalink: http://www.zeno.org/nid/20006454534

Schûdra
type: Label
in scheme: travel!digital Thesaurus

Knecht
type: Label
in scheme: travel!digital Thesaurus

Priesterkaste
type: Concept
definition: bdk: siehe Priester, Kaste
related: Priester
pref label: Priesterkaste
in scheme: travel!digital Thesaurus
related: Priestergelehrte

Priesterkaste
type: Label
in scheme: travel!digital Thesaurus

Priestergelehrte
type: Concept
in scheme: travel!digital Thesaurus
related: Priester
pref label: Priestergelehrte
definition: bdk: siehe Priester, Gelehrte

Priestergelehrte
type: Label
in scheme: travel!digital Thesaurus

Paria
type: Concept
related: Schûdra
preferred label: outcast @en
pref label: outcast
definition: Duden: 1. der niedersten oder gar keiner Kaste angehörender Inder | Meyers Großes Konversations-Lexikon 1908: Parĭas (Pariar, von dem tamulischen Paraiyan oder Paraiyar), ein im südlichen Indien, namentlich in Madras und Travankor wohnendes autochthones Volk (1901: 2,258,611), das von den vier Hindukasten als außerhalb stehend angesehen wird, keineswegs aber zu den niedrigsten Klassen der indischen Bevölkerung gehört. Bei den Tamulen gibt es zehn Kasten, die niedriger stehen als die P. Sie bilden ein altes, von allen andern Volkselementen wohl unterschiedenes Volk, das eifersüchtig den Eingriff jeder Kaste zurückweist. Der Name soll von dem tamulischen parai (»Trommel«) hergeleitet sein, da die P. häufig die Dorfmusikanten sind. Früher Leibeigne, sind sie jetzt freie Handarbeiter: die meisten Diener der Europäer in Südindien gehören zu den P. Die Portugiesen fanden an der Küste von Madras diesen Namen den niedrigsten Kasten gegeben, daher seine irrtümliche allgemeine Anwendung (s. Pariavölker). | Quelle: Meyers Großes Konversations-Lexikon, Band 15. Leipzig 1908, S. 437. | Permalink: http://www.zeno.org/nid/20007215185 | Meyers Großes Konversations-Lexikon 1908: Parĭavölker, verachtete, auf der sozialen Stufenleiter zu unterst stehende Bevölkerungsteile, die dem eignen Volkstum angehören oder stammfremd sind. Häufig entstehen aus den vielerorts vorhandenen verachteten Berufen erbliche Kasten, die dann den Eindruck fremden Stammestums erwecken; in andern Fällen werden Kriegsgefangene, unterworfene Landeseinwohner oder eingewanderte Völker niedrigerer Kulturstufe in die Rolle der verachteten Berufe hineingedrängt. Die bekanntesten derartigen P. sind unsre Zigeuner, die Heloten im alten Sparta, die zahlreichen Pariakasten im südlichen Indien (Pulayer, Vedar etc.), die Yeta und Hinin in Japan, die Tumalod, Yiber und Midgan im Somallande, die Wata, Wandorobbo und Waboni in Äquatorial-Ostafrika, die Laobés und Griots in Senegambien, die Rodias auf Ceylon, die Achdam, Schu…
in scheme: travel!digital Thesaurus
pref label: Paria

outcast
type: Label
isTranslationOf: Paria
in scheme: travel!digital Thesaurus

Paria
type: Label
hasTranslation: outcast
in scheme: travel!digital Thesaurus

Dolmetscherkaste
type: Concept
related: Dolmetscher
pref label: Dolmetscherkaste
in scheme: travel!digital Thesaurus
definition: bdk: siehe Dolmetscher, Kaste

Dolmetscher
type: Concept
alternative label: Dolmetsch
pref label: mutardschim
pref label: Dolmetscher
alt label: Dolmetsch
related match: Translation
preferred label: mutardschim @hi
definition: Duden: jemand, der Äußerungen in einer fremden Sprache übersetzt (Berufsbezeichnung) | Meyers Großes Konversations-Lexikon 1906: Dolmetsch (Dolmetscher, v. türk. dilmetschi, »Sprecher«), in der Levante Dragoman (v. arab. Terguman), auch Terdschuman (»Übersetzer«) genannt, ist jeder, der aus einer fremden Sprache in eine andre, ihm gleichfalls geläufige übersetzt, besonders ein zu diesem Zwecke vereidigter Beamter bei Konsulaten und Gesandtschaften in fremden Ländern. Er kann ohne Erlaubnis des Konsuls oder Gesandten seine Vermittelung niemand leihen und darf selbst weder Handel noch Geldgeschäfte treiben etc.; dagegen versehen die Dolmetschen oft Maklergeschäfte. Auch im Gerichtswesen müssen öfters Dolmetschen zugezogen werden, sei es, daß in Zivilprozessen eine Partei, in Strafsachen der Angeschuldigte oder in beiderlei Rechtssachen ein Zeuge oder Sachverständiger der Gerichtssprache nicht kundig ist. Nach dem deutschen Gerichtsverfassungsgesetz (§ 187, 188, 191–193) und der österreichischen Strafprozeßordnung kann die Zuziehung eines Dolmetschen unterbleiben, wenn die beteiligten Personen sämtlich der fremden Sprache mächtig sind. Zur Verhandlung mit Tauben oder Stummen ist, sofern nicht eine schriftliche Verständigung erfolgt, eine geeignete Person als D. zuzuziehen. Der D., dessen Dienst übrigens auch von dem Gerichtsschreiber wahrgenommen werden kann, hat einen Eid dahin abzuleisten, daß er treu und gewissenhaft übertragen werde. Nach § 2244 des Bürgerlichen Gesetzbuches ist bei Errichtung eines öffentlichen Testaments (s. d.) ein vereidigter D. zuzuziehen, falls auch nur eine der mitwirkenden Personen der Sprache nicht mächtig ist, in welcher der Erblasser sich erklärt. Einige weitere Bestimmungen über die Zuziehung eines D. hat das Reichsgesetz über die Angelegenheiten der freiwilligen Gerichtsbarkeit in seinen § 9, 178 mit 180 getroffen. – Frankreich bildet seine offiziellen Dolmetschen an der École des jeunes de langue in Paris, Österreich in der Orientalis…
in scheme: travel!digital Thesaurus

mutardschim
type: Label
isTranslationOf: Dolmetscher
in scheme: travel!digital Thesaurus

Dolmetscher
type: Label
hasVariant: Dolmetsch
in scheme: travel!digital Thesaurus
hasTranslation: mutardschim

Dolmetsch
type: Label
isVariantOf: Dolmetscher
in scheme: travel!digital Thesaurus

Dolmetscherkaste
type: Label
in scheme: travel!digital Thesaurus

Brahmanenkaste
type: Concept
related: Brahmanismus
in scheme: travel!digital Thesaurus
pref label: Brahmanenkaste
related: Brahmane
definition: bdk: siehe Brahmane, Kaste
related: Adel

Brahmanismus
type: Concept
alternative label: Brahmanentum
definition: Duden: 1. eine der Hauptreligionen Indiens (aus dem Vedismus hervorgegangen) | 2. (selten) Hinduismus | Meyers Großes Konversations-Lexikon 1905: Brahma, im Veda (s.d.) als Neutrum ursprünglich die Potenz der Heiligkeit oder zauberhaften Geweihtheit, dem heiligen Wort und dem priesterlichen Menschen, dem Brahmanen, innewohnend. In der Spekulation der Upanischaden (s. Veda) die Weltseele, das Absolute, als identisch mit dem Âtman, dem Ich, gedacht. Als Maskulinum (Brahmâ) hat B. die Bedeutung eines Brahmanen, dann des Schöpfers der Welt, einer konkreten Personifikation jenes abstrakten B., eines obersten Gottes im indischen Pantheon, der allem Leben einhaucht und mit Vischnu, dem Erhalter, und Çiva, dem Zerstörer (s. Trimûrti), an der Spitze des Universums steht. Übrigens tritt B., seinem abstrakten Wesen entsprechend, an Popularität hinter [304] Vischnu und Çiva weit zurück. B. ist viergesichtig; seine Gattin ist Sarasvatî (s.d.). Vgl. Roth, B. und die Brahmanen (in der »Zeitschrift der Deutschen Morgenländischen Gesellschaft«, Bd. 1, Leipz. 1846); A. Holtzmann, B. im Mahâbhârata (das., Bd. 38); J. Muir, Original Sanskrit texts, Bd. 5 (Lond. 1872); Griswold, Brahman (New York 1900). | Quelle: Meyers Großes Konversations-Lexikon, Band 3. Leipzig 1905, S. 304-305. | Permalink: http://www.zeno.org/nid/2000636103X
related: Hinduismus
related: vedische Religion
pref label: Brahmanismus
alt label: Brahmanentum
in scheme: travel!digital Thesaurus

Hinduismus
type: Concept
narrower: Râmaismus
pref label: Hinduismus
narrower: Krischnaismus
alt label: Hindutum
alternative label: Hindutum
definition: Duden: indische Volksreligion | Brockhaus' Kleines Konversations-Lexikon 1911: Hinduismus oder Neobrahmanismus, die ind. Religion, die aus dem Brahmanismus (s.d.) in engerm Sinne weiter gebildet ist. Charakterisiert wird der H. durch das hervortreten der Götter Çiva und Vishnu, die mit Brahma (s.d.) zu einer Dreieinigkeit (Sanskrit Trimūrti) zusammengefaßt werden. Çiva und Vishnu werden auch allein als ein Gott verehrt unter dem Namen Harihara, dessen Kultus seit dem 14. Jahrh. bes. im Dekhan verbreitet ist. Gewöhnlich aber wird ein Gott, sehr selten Brahma, als der höchste verehrt, und ganz Indien teilt sich heute in die Sekten der Çaivās (Anhänger des Çiva) mit vielen Unterabteilungen, wie die der Çāktās, die die Göttinnen in den Vordergrund der Verehrung stellen, und die Vaishnavās (Anhänger des Vishnu), ebenfalls mit zahlreichen Unterabteilungen, je nachdem Vishnu in seiner Verkörperung als Rāma (s.d.) oder als Krishna (s.d.) verehrt wird. Alle Çaivās verehren das Lingam (s.d.). [Karte: Bevölkerung II, 4.] | Quelle: Brockhaus' Kleines Konversations-Lexikon, fünfte Auflage, Band 1. Leipzig 1911., S. 806. | Permalink: http://www.zeno.org/nid/20001190512
narrower: Brâhmasamâdsch
narrower: Schivaismus
narrower: Vischnuismus
in scheme: travel!digital Thesaurus
related: vedische Religion
narrower: Âryasamâdsch

Râmaismus
type: Concept
alternative label: Ramaismus
alt label: Ramaismus
pref label: Râmaismus
in scheme: travel!digital Thesaurus
definition: bdk: Hinduismus: Ramaverehrung | Meyers Großes Konversations-Lexikon 1908: Râma, Name des Vischnu (s. d.) während seiner siebenten Inkarnation; seine Taten bilden den Inhalt des Râmâjana (s. d.). Ursprünglich war er wohl, wie Krischna (s. d.), ein menschlicher Heros. | Quelle: Meyers Großes Konversations-Lexikon, Band 16. Leipzig 1908, S. 583. | Permalink: http://www.zeno.org/nid/20007317050
related match: Rama

Ramaismus
type: Label
isVariantOf: Râmaismus
in scheme: travel!digital Thesaurus

Râmaismus
type: Label
hasVariant: Ramaismus
in scheme: travel!digital Thesaurus

Hinduismus
type: Label
in scheme: travel!digital Thesaurus

Krischnaismus
type: Concept
in scheme: travel!digital Thesaurus
pref label: Krischnaismus
definition: bdk: Hinduismus: Krischnaverehrung | Meyers Großes Konversations-Lexikon 1907: Krischna (»der Schwarze«), in seiner ältern Gestalt, die im »Mahâbhârata« noch durchscheint, der Nationalheld des indischen Volkes der Jâdava, die im Epos als Verbündete der Pândava auftreten. Er war Pflegesohn eines Kuhhirten und heißt als solcher Govinda; das Hirtenleben Krischnas wird in späterer Zeit mit erotischen Erlebnissen ausgefüllt, wie sie z. B. in dem »Gîtagovinda« des Dschajadeva (s. d.) vorgeführt werden. Die ältere Sage erzählt dagegen von zahlreichen Heldentaten Krischnas. Als die Brahmanen den Kultus des Vischnu (s. d.) verbreiteten, wurde K. zu einer Inkarnation desselben. – K. ist auch ein andrer Name des Flusses Kistna (s. d.) in Vorderindien. | Quelle: Meyers Großes Konversations-Lexikon, Band 11. Leipzig 1907, S. 700. | Permalink: http://www.zeno.org/nid/20006945988
related match: Krishna

Krischnaismus
type: Label
in scheme: travel!digital Thesaurus

Hindutum
type: Label
in scheme: travel!digital Thesaurus

Brâhmasamâdsch
type: Concept
in scheme: travel!digital Thesaurus
definition: bdk: hinduistische Reformorganisation in Indien
related: vedische Religion
pref label: Brâhmasamâdsch

vedische Religion
type: Concept
definition: bdk: älteste Religion in Indien | Duden: Vedismus, Wedismus: vedische Religion | Meyers Großes Konversations-Lexikon 1909: Veda, der älteste Teil der indischen Literatur, der sich sowohl durch den Inhalt als auch durch die Sprache nicht unwesentlich von der spätern Sanskritliteratur unterscheidet. Der V. (»heiliges Wissen«) liegt in den drei Stufen: Mantra (heil. Sprüche), Brâhmana (Theologie) und Sûtra (eigentlich Faden, Band) vor, die den vier Veden: Rik, Sâman, Jadschus, Atharvan in etwa gleicher Weise gemeinsam sind. Mantra, auch Samhitâ (»Sammlung«), der älteste Teil, sind Hymnen und Sprüche, meist mit Beziehung auf rituelle Vorgänge, zum Teil in sehr alte Zeiten hinausreichend. Die Brâhmana behandeln die Verbindung der Opferlieder und -Sprüche mit der Opferhandlung und erklären deren geheimen Sinn, bei welcher Gelegenheit sie zahlreiche Legenden erzählen. Überwiegend philosophischer Inhalt (Spekulationen über das Brahma, das Allwesen) kommt den Teilen der Brâhmana zu, die den speziellen Namen Upanischad führen. Die Sûtra endlich stellen die Opferriten und verwandte Gegenstände systematisch dar; sie streben im Ausdruck nach äußerster, oft bis zur Dunkelheit gehender Knappheit. Man unterscheidet: Kalpa-Sûtra oder Çrauta-Sûtra, die das Ritual der größern Opfer behandeln, und Smârta-Sûtra, die das häusliche und bürgerliche Leben regeln; letztere zerfallen in Grihja-Sûtra (Hausregeln), welche die häuslichen Zeremonien bei Geburt, Hochzeit, Tod etc. zum Gegenstand haben, und Dharma-Sûtra, welche die Anfänge indischer Rechtsliteratur enthalten. An sie schließen sich noch andre Erklärungsschriften an, die Aussprache, Metrum, Grammatik, Etymologie und Astronomie behandeln; wichtig sind besonders die Nighantavas, Glossensammlungen, mit dem alten Kommentar (niruktam) des Jâska (hrsg. von Roth, Götting. 1852) und die Prâtiçâkhja mit Angaben über Aussprache, Betonung u. dgl. der heiligen Texte. | Die Samhitâ des Rigveda enthält den Liederschatz, den die Inder in ihren Stam…
in scheme: travel!digital Thesaurus
pref label: vedische Religion

vedische Religion
type: Label
in scheme: travel!digital Thesaurus

Brâhmasamâdsch
type: Label
in scheme: travel!digital Thesaurus

Schivaismus
type: Concept
related match: Shiva
in scheme: travel!digital Thesaurus
pref label: Schivaismus
definition: bdk: Hinduismus: Schivaverehrung | Meyers Großes Konversations-Lexikon 1906: Çiva (spr. ßiwa, auch schiwa), auch Mahâdêva, »großer Gott«, einer der volkstümlichsten Götter der Inder, dem im Süden von Indien die große Mehrzahl, im Norden wenigstens ein bedeutender Teil der Bevölkerung anhängt. Er ist der Patron der Büßer (vgl. Jôgin), der aber selbst nicht durch Askese überwunden und zur Gewährung von Bitten gezwungen werden kann, und der mächtige, hoch oben auf dem Himalaja thronende Herr der Berge, der zerstörend, aber zugleich reinigend und befruchtend wirkt. Als Symbol seiner Gewalt führt er den Dreizack und ein Jagdnetz, das Abzeichen seiner Herrschaft über das Getier; als Gott der [167] Vernichtung trägt er eine Kette von Schädeln um den Hals; auf dem Haupte trägt er den Mond; eine besondere Eigentümlichkeit seines Gesichts ist das dritte Auge auf der Stirn. Seine Gattin ist Pârvatî (s.d.), auch Durgâ und Kâlî genannt. Die Verehrung Çivas unter dem Symbol des Phallus (s. Lingaïten) ist besonders bei den südlichen Çivaiten sehr verbreitet. C. scheint aus dem vedischen Rudra (s.d.), als dessen Beiname çiva (»gütig«) schon im Jadschurveda vorkommt, sich herausgebildet zu haben; doch sind auch andre Elemente, allem Anscheine nach auch solche, die dem religiösen Wesen der Urbewohner Indiens entstammen, beigemischt. Vgl. Weber, Indische Studien (Bd. 2, S. 19ff.); Muir, Original Sanskrit texts (Bd. 4, S. 299–437); v. Schroeder, Indiens Literatur und Kultur, S. 341–353 (Leipz. 1887). | Quelle: Meyers Großes Konversations-Lexikon, Band 4. Leipzig 1906, S. 167-168. | Permalink: http://www.zeno.org/nid/20006430619

Schivaismus
type: Label
in scheme: travel!digital Thesaurus

Vischnuismus
type: Concept
related match: Vishnu
in scheme: travel!digital Thesaurus
pref label: Vischnuismus
definition: bdk: Hinduismus: Vischnuverehrung | Meyers Großes Konversations-Lexikon 1909: Vischnu (Wishnu), neben Çiva der volkstümlichste aller indischen Götter. In den vedischen Liedern spielt er keine bedeutende Rolle; V. ist hier ein Gott von nicht sicher bestimmbarer Bedeutung, von dem gepriesen wird, daß er die ganze Welt in drei Schritten (d. h. Ausgang, höchster Stand, Untergang der Sonne?) durchmessen habe. In der epischen Zeit tritt er stark hervor. Seinen Haupteinfluß auf die Erhaltung der Welt übt er durch seine Avatâras (Herabsteigungen, Inkarnationen), eine Lehre, die ihren Ursprung dem Bedürfnis nach einem persönlichen Erlöser verdankt. In diesen Herabsteigungen nimmt der Gott bald tierische, bald menschliche, bald übermenschliche Form an. Die Inder zählen meist zehn Herabsteigungen; neun haben sich bereits ereignet, die zehnte steht noch aus. Die zehn Verkörperungen sind: 1) Als Fisch rettet V. den Mann aus der großen Flut. 2) Als Schildkröte begibt er sich auf den Meeresgrund und dient dem Berg Mandara zum Stützpunkte, den die Götter und Dämonen mit der Spitze auf seinen Rücken stellen, um damit das Weltmeer zu quirlen, worauf neben andern unschätzbaren Gütern der Unsterblichkeitstrank (amrita) als Butter auf die Oberfläche kommt. 3) Als Eber holt V. die ins Meer versunkene Erde heraus und trägt sie auf seinen Hauern an den alten Ort. 4) Als Mann-Löwe (halb Mensch, halb Löwe) tötet er einen Dämon. 5) Als Zwerg überlistet er mit drei Riesenschritten den Beherrscher der Dämonen Bali. 6) Als Paraçu-Râma (d. h. Râma mit der Streitaxt) rottet V. das ganze Geschlecht der Kschatrijas aus und begründet so das Übergewicht der Brahmanen. 7) Als Râma ist V. der Held des Epos Râmâjana (s. d.), dessen Hauptinhalt die Taten des inkarnierten Gottes bilden. 8) Über die Krischna-Verkörperung, die unter den Avatâras wohl die älteste ist, s. Krischna. 9) Als Buddha verleitet V. die Schlechten, durch Unglauben sich selbst zu vernichten. 10) Die erst in der Zukunft stattfindende Ka…

Vischnuismus
type: Label
in scheme: travel!digital Thesaurus

Âryasamâdsch
type: Concept
in scheme: travel!digital Thesaurus
related: vedische Religion
related: Arier
definition: bdk: hinduistische Reformbewegung in Indien
pref label: Âryasamâdsch

Âryasamâdsch
type: Label
in scheme: travel!digital Thesaurus

Brahmanismus
type: Label
in scheme: travel!digital Thesaurus

Brahmanentum
type: Label
in scheme: travel!digital Thesaurus

Brahmanenkaste
type: Label
in scheme: travel!digital Thesaurus

Brahmane
type: Concept
related: Adel
in scheme: travel!digital Thesaurus
related: Brahmanismus
related: vedische Religion
definition: Duden: Angehöriger der indischen Priesterkaste | Meyers Großes Konversations-Lexikon 1905: Brahmanen (Braminen, im Sanskrit Brâhmana), die oberste, priesterliche Kaste Indiens. Schon der Rigveda (s. Veda) betrachtet eine Anzahl von Familien als brahmanisch (vgl. Indische Religion). Nach der ursprünglichen Auffassung liegt es offenbar nicht eigentlich im Wesen des B., Priester zu sein, sondern vielmehr Priester sein kann nur der Brahmane, da er allein die nur durch die Geburt erlangbaren mystischen Eigenschaften besitzt, die zum Verkehr mit Göttern und Geistern, insonderheit zum Genuß des heiligen Soma befähigen. Wenn auch das theoretische Idealbild der sozialen Ordnung, wie es in der jüngern Vedaliteratur und im Manugesetz entworfen wird, für die normale Beschäftigung des B. die priesterliche erklärt, hat die Wirklichkeit offenbar zu allen Zeiten einen andern Zustand ausgewiesen. Wie sich in jüngerer vedischer Zeit im Geiste der B. selbst das Bild der Rechte und Pflichten ihrer Kaste darstellte, zeigen A. Webers »Collectanea über die Kastenverhältnisse in den Brahmana und Sûtra« (in den »Indischen Studien«, Bd. 10, Leipz. 1868). Die B. betrachten sich als neben den himmlischen Göttern stehende »menschliche Götter«; ihre vier Vorrechte sind: der Anspruch an einen jeden auf Ehrerbietung, der Anspruch auf Geschenke, ihre Unbedrückbarkeit, ihre Untötbarkeit; ihre vier Pflichten sind: brahmanische Abkunft, demgemäßer Wandel, Ruhm des Vedastudiums etc., Belehrung (eigentlich Reifmachung) der Leute. Gegenüber solchen Idealkonstruktionen zeigt die altbuddhistische Literatur (vgl. Rich. Fick, Die soziale Gliederung im nordöstlichen Indien zu Buddhas Zeit, Kiel 1897) das Bild der Wirklichkeit. Neben den B., die ihren geistlichen Pflichten leben, die als Hofgeistliche (Purohita) fungieren oder auch die niedern geistlichen Funktionen, wie Vorhersagen der Zukunft, Traumdeutung, allerlei Zauberei u. dgl., ausüben, treten in Masse B. auf, die sich mit Handel abgeben, die Viehzucht…
pref label: Brahmane
related: Hindu

Adel
type: Concept
alternative label: Landesadel
narrower: Feudaladel
alt label: Landesadel
definition: Duden: 1. a. Klasse, Gesamtheit von Familien, die [durch Geburt] einem in früherer Zeit mit bestimmten Vorrechten ausgestatteten Stand angehören | b. adlige Familie[n] | 2. adlige Herkunft, adliges Geschlecht | 3. Adelstitel | 4. (gehoben) vornehme, edle Gesinnung; Würde, Vornehmheit | Meyers Großes Konversations-Lexikon 1905: Adel (von adhal, das Geschlecht, die Herkunft, zusammenhängend mit êthel, Erbgut), bevorzugter Stand, der sich in allen europäischen Ländern, mit Ausnahme von Norwegen und der Türkei, vorfindet. Der deutsche A. war in der germanischen Urzeit ein Geburtsstand, vor den Freien durch höheres Wergeld (s. d.) ausgezeichnet. Er setzte sich zusammen aus den Mitgliedern derjenigen Geschlechter, aus denen man die Könige, die Fürsten, die Priester zu nehmen pflegte. Im fränkischen Reiche war neben dem altgermanischen, durch die Geburt begründeten Geschlechtsadel der fränkische, auf der Ehre des Kriegsdienstes beruhende Dienstadel, der sich aus den königlichen Beamten, den Bischöfen und Großgrundbesitzern bildete. Im Laufe des Mittelalters verschmolzen Geschlechts- und Dienstadel zu einem Stande, dem freien Ritterstande. Die Zugehörigkeit zu diesem Stande setzte außer der edlen Abstammung den Besitz einer adligen Grundherrschaft sowie ritterliche Heeresfolge voraus. Eine bevorzugte Stellung innerhalb des Standes nahmen die Fürsten und Grafen ein. Aus dem freien Ritterstand entwickelte sich der später sogen. hohe A. (s. Reichsritterschaft). Dagegen ging der sogen. niedere A. aus dem Stande der unfreien Ritter, der Ministerialen oder Dienstmannen hervor. Die Ministerialen waren Dienstleute des Königs und der Großen, die ausschließlich im Hofdienst, als Reisige oder als höhere Aufsichtsbeamte Verwendung fanden. Jeder Ministeriale, der ein gewisses Alter erreicht hatte[99] konnte die Belehnung mit einem Benefizium verlangen. Hierdurch wurde die Annäherung des unfreien Ritterstandes an den freien Ritterstand gefördert. In ihrer Eigenschaft als Ritter traten di…
in scheme: travel!digital Thesaurus
pref label: Adel

Feudaladel
type: Concept
related match: Nobility
related match: Feudalism
in scheme: travel!digital Thesaurus
definition: Duden: herrschende Oberschicht in einem feudalen Staat
pref label: Feudaladel

Feudaladel
type: Label
in scheme: travel!digital Thesaurus

Landesadel
type: Label
in scheme: travel!digital Thesaurus

Adel
type: Label
in scheme: travel!digital Thesaurus

Brahmane
type: Label
in scheme: travel!digital Thesaurus

Hindu
type: Concept
narrower: Râmait
definition: Duden: Anhänger des Hinduismus
narrower: Schivait
in scheme: travel!digital Thesaurus
alternative label: Hinduist
alt label: Hindubevölkerung
alt label: Hinduist
narrower: Krischnait
pref label: Hindu
related: Hinduismus
narrower: Vischnuit
alternative label: Hindubevölkerung

Râmait
type: Concept
in scheme: travel!digital Thesaurus
pref label: Râmait
related: Râmaismus
definition: bdk: Anhänger des Râmaismus
related match: Rama

Râmait
type: Label
in scheme: travel!digital Thesaurus

Schivait
type: Concept
alt label: Schaiva
definition: bdk: Anhänger des Schivaismus
related match: Shaivism
alternative label: Schaiva
related: Schivaismus
in scheme: travel!digital Thesaurus
alt label: Schivaverehrer
related match: Shiva
pref label: Schivait
alternative label: Schivaverehrer

Schaiva
type: Label
in scheme: travel!digital Thesaurus

Schivaverehrer
type: Label
in scheme: travel!digital Thesaurus

Schivait
type: Label
in scheme: travel!digital Thesaurus

Hindubevölkerung
type: Label
in scheme: travel!digital Thesaurus

Hinduist
type: Label
in scheme: travel!digital Thesaurus

Krischnait
type: Concept
in scheme: travel!digital Thesaurus
related: Krischnaismus
pref label: Krischnait
definition: bdk: Anhänger des Krischnaismus
related match: Krishna

Krischnait
type: Label
in scheme: travel!digital Thesaurus

Hindu
type: Label
in scheme: travel!digital Thesaurus

Vischnuit
type: Concept
related match: Vaishnavism
related match: Vishnu
pref label: Vischnuit
alternative label: Vaischnava
alt label: Vaischnava
related: Vischnuismus
in scheme: travel!digital Thesaurus
definition: bdk: Anhänger des Vischnuismus

Vischnuit
type: Label
in scheme: travel!digital Thesaurus

Vaischnava
type: Label
in scheme: travel!digital Thesaurus

Kaste
type: Label
in scheme: travel!digital Thesaurus

Rodiya
type: Concept
definition: bdk: Unberührbare Gruppe in Ceylon (heute Sri Lanka)
in scheme: travel!digital Thesaurus
pref label: Rodiya

Rodiya
type: Label
in scheme: travel!digital Thesaurus

Vaischya
type: Concept
in scheme: travel!digital Thesaurus
pref label: Vaischya
definition: Meyers Großes Konversations-Lexikon 1909: Waisya, dritter Stand in der alten Kastenordnung der Inder, Bürger und Bauern umfassend, ist jetzt außer Gebrauch gekommen. | Quelle: Meyers Großes Konversations-Lexikon, Band 20. Leipzig 1909, S. 318. | Permalink: http://www.zeno.org/nid/20007667450

Vaischya
type: Label
in scheme: travel!digital Thesaurus

Kschatriya
type: Concept
related: Krieger
alt label: Kriegerkaste
alternative label: Kriegerkaste
related: Adel
related: Râjpute
in scheme: travel!digital Thesaurus
definition: Duden: Kschatrija: Angehöriger der adligen Kriegerkaste in Indien | Meyers Großes Konversations-Lexikon 1907: Kschatria (Kschatriya), nach der brahmanischen Kastenordnung der zweite erbliche Stand im altindischen Staate, die Könige, Fürsten, Adligen umfassend. Sie stehen nur den Brahmanen nach, mit denen sie lange um den Vorrang stritten. Jetzt sind die K. aus den Kastenlisten verschwunden und ersetzt durch die Radschputen (s. d.), deren es nach Hunter (»Imperial Gazetteer of India«, 2. Aufl., Bd. 6, S. 703; Lond. 1886) gegen 5,800,000 geben soll. Vgl. Weberin den »Indischen Studien«, Bd. 10, S. 17 ff.; Hopkins, The social and military position of the ruling caste of ancient India (Newhaven 1889); R. Fick, Die soziale Gliederung im nordöstlichen Indien zu Buddhas Zeit, S. 51 ff. (Kiel 1897). | Quelle: Meyers Großes Konversations-Lexikon, Band 11. Leipzig 1907, S. 759. | Permalink: http://www.zeno.org/nid/20006950345
pref label: Kschatriya

Krieger
type: Concept
in scheme: travel!digital Thesaurus
pref label: Krieger
definition: Duden: 1. (veraltet) Soldat, Angehöriger eines Heeres, einer Truppe

Krieger
type: Label
in scheme: travel!digital Thesaurus

Kriegerkaste
type: Label
in scheme: travel!digital Thesaurus

Râjpute
type: Concept
alternative label: Râdschpute
definition: bdk: Angeöriger einer Kriegerkaste in Indien; heute: eine Volksgruppe in Rajasthan | Meyers Großes Konversations-Lexikon 1908: Radschputen (engl. Rajpoots, im Sanskrit Radschaputra, »Königssohn«), große Hindukaste im nördlichen Indien, die ihren Ursprung auf die alte Kriegerkaste, die Kschatria, zurückführt, aber später auch andre tapfere Stämme, selbst Aboriginer (Bhil, Mina, Dschat, Mhair u. a.), in sich aufnahm. Da die R. nie aus ihrer Kaste heiraten, kam es zu ihrer großen örtlichen Verbreitung, die nur im S. und O. geringer ist. In dem Gebirgsland westlich vom Dschelam kommen sie gleich den Dschat nicht vor. Das Zentrum ihrer Macht liegt in den Staaten von Radschputana (s. d.), wo jedoch die Dschat den größern Teil der Bevölkerung ausmachen. Nach dem Zensus von 1901 betrug ihre Zahl 9,712,156. Infolge ihrer Mischung mit andern Stämmen sind sie weniger strenge Beobachter der Kastengesetze als andre Hindu, auch müssen die Brahmanen ihren Einfluß mit den als Annalisten, Genealogen und Zeichendeutern gesuchten Bhat (Tscháran) teilen. Ursprünglich die feudalen Eroberer des Westens von Hindostan, sind die R. jetzt zum kleinern Teil Großgrundbesitzer, zum größern gewöhnliche Ackerbauer; eine Abteilung, der Osvalstamm, betreibt auch Geldgeschäfte in großem Stil in den Städten Indiens. Immer sind sie von Stolz auf ihre Abstammung erfüllt und von sicherm und würdevollem Auftreten. | Quelle: Meyers Großes Konversations-Lexikon, Band 16. Leipzig 1908, S. 563. | Permalink: http://www.zeno.org/nid/20007315120
in scheme: travel!digital Thesaurus
alt label: Râdschpute
pref label: Râjpute

Râdschpute
type: Label
isVariantOf: Râjpute
in scheme: travel!digital Thesaurus

Râjpute
type: Label
hasVariant: Râdschpute
in scheme: travel!digital Thesaurus

Kschatriya
type: Label
in scheme: travel!digital Thesaurus

Eurasier
type: Label
in scheme: travel!digital Thesaurus

Aleuten
type: Concept
pref label: Aleuten
in scheme: travel!digital Thesaurus
definition: Meyers Großes Konversations-Lexikon 1905: Alëuten, eine zum Territorium Alaska (s. d.) der Vereinigten Staaten gehörige Inselkette, die sich in einem 1750 km langen Bogen von der Halbinsel Alaska zwischen 163–187° östl. L. und 51–55° nördl. Br. nach W. erstreckt, mit den russischen Kommodoreinseln das Beringmeer vom Stillen Ozean scheidet, Nordamerika aber mit Asien brückenartig verbindet. Es sind ohne die kleinen Klippen 150 Inseln, deren Flächeninhalt 37,840 qkm beträgt, und die 1890 von 967 Alëuten, 734 Mischlingen und 520 Weißen bewohnt wurden. Eingeteilt werden die A. in die Fuchsinseln im O. mit Unimak, der größten derselben (3610 qkm), Unalaska (3090 qkm) und Umnak, ferner in die Vier-Berginseln, die Andrejanowski-Inseln mit Atka, die Ratten- und die Naheinseln mit Attu. Der Hauptort ist Unalaska auf der gleichnamigen Insel mit (1900) 428 Einw. Sämtliche Inseln sind vulkanischen Ursprungs; noch tätig sind die Vulkane Schischaldin (2720 m) auf Unimak und Makuschin (1700 m) auf Umnak. Nördlich von Umnak ist die Bogoslowinsel 1796 aus dem Meer emporgetaucht. Sämtliche Inseln haben bis auf niedrige Weiden und Erlen keinen Baumwuchs. Das Klima ist rauh und feucht (Unalaska: Jahr 3,3°, Extreme -18° und 25°; 1050 mm Regen). – Die Ureinwohner (ebenfalls Alëuten genannt; s. Tafel »Amerikanische Völker I«, Fig. 1) sind ein Zweig der Eskimo (s. d.). Auf ihren Charakter hat der russische Einfluß umgestaltend eingewirkt; ehedem lebhaft und tapfer, sind sie jetzt sanft und neigen zur Trägheit. Kleidung, Wohnung und Zubereitung der Nahrung sind ebenfalls den Russen entlehnt, die sie auch zum griechischen Glaubensbekenntnis bekehrt haben. Ihrem Apostel Wenjaminow verdanken sie die Einführung von Schulen. Hauptbeschäftigung ist die Jagd auf Seetiere, die sie in kleinen, ungemein schnellen Booten (Baidarken) geschickt zu erlegen wissen. Ihre Zahl ist seit dem 18. Jahrh. sehr zurückgegangen, ihre materielle Lage hat sich aber seit Erwerbung der Inseln durch die Vereinigten Staa…
related match: Aleutian Islands

Aleuten
type: Label
in scheme: travel!digital Thesaurus

Hellene
type: Concept
related match: Greeks
definition: Duden: Grieche | Meyers Großes Konversations-Lexikon 1907: Hellēnen, ursprünglich der Name der Bewohner der Landschaft Hellas im südlichen Thessalien, seit dem Emporkommen der Dorier und Jonier der alten Griechen überhaupt und jetzt auch der Neugriechen. | Quelle: Meyers Großes Konversations-Lexikon, Band 9. Leipzig 1907, S. 148. | Permalink: http://www.zeno.org/nid/20006760023
related: Grieche
pref label: Hellene
in scheme: travel!digital Thesaurus

Hellene
type: Label
in scheme: travel!digital Thesaurus

cubanisch
type: Concept
related match: Cubans
related: Cubaner
related match: Cuba
in scheme: travel!digital Thesaurus
definition: Duden: kubanisch: Kuba, die Kubaner betreffend; von den Kubanern stammend, zu ihnen gehörend | [Anm.: unvollständig: Kuba, die Kubaner betreffend; von den Kubanern stammend, zu ihnen gehörend; in Kuba gelegen]
pref label: cubanisch

cubanisch
type: Label
in scheme: travel!digital Thesaurus

tunesisch
type: Concept
definition: Duden: Tunesien, die Tunesier betreffend; von den Tunesiern stammend, zu ihnen gehörend | [Anm.: unvollständig: Tunesien, die Tunesier betreffend; von den Tunesiern stammend, zu ihnen gehörend; in Tunesien gelegen] | Duden: Tunesien: Staat in Nordafrika | Meyers Großes Konversations-Lexikon 1909: Tunis (Tunesien, bei den Arabern Ifrikija), einst Vasallenstaat des türk. Reiches in Nordafrika (s. Karte »Algerien etc.«), seit 1881 (nähere Bestimmungen 1883) Schutzstaat Frankreichs, zwischen Mittelländischem Meer, Tripolis und Algerien, 167,400 qkm mit 1,5–1,8 Mill. Einw. Von dem 651 km langen Küstensaum ist der Osten flach, sandig und unfruchtbar, der Norden hoch, steil und felsig, mit zahlreichen Vorgebirgen (Kap Blanc, Bon). Von NO. dringt der Golf von T. ein, von O. die von Hammamet und von Gabes (Kleine Syrte); vor letzterm liegen die Inseln Kerkenah und Dscherba. Für die Oberflächengestalt lassen sich vier Regionen unterscheiden: 1) das bergige Tell, mit Wäldern, Maisfeldern und Weiden, 2) das Küstenland Sahel mit Oliven, von ehemals großer Fruchtbarkeit, das auch die Hoffnungen für die Zukunft birgt, 3) die Hochflächen (Dschebel Mechila 1477 m), mit Korn, Vieh und Halfa (ein Drittel nicht kultivierbar), 4) die tunesische Sahara, wasserarm mit Ausnahme der Oasen. Zwischen den Schotts Gharsa (-21 m) und El Dscherid (vielleicht Lacus Tritonis der Römer) liegt die dattelreiche Landschaft Biled ul Dscherid (s. d.). Die meisten Bäche und Flüßchen (Wadi) aus den quellenreichen Gebirgen verlieren sich im Sand oder sind nur Küstenflüsse von kurzem Lauf, so daß kein Fluß schiffbar ist. Der bedeutendste ist der Medscherda (s. d.), der bei Porto Farina ins Mittelmeer mündet und die Uferlandschaften durch Schlammablagerungen befruchtet, nächst ihm Wadi el Kebir und Wadi el Miliana; die großen Ebenen des Innern sind sehr wasserarm. In seinem geologischen Bau (s. Afrika, S. 136) schließt sich T. an Algerien eng an. Abgesehen von einer Reihe vulkanischer Bildungen an der Küste v…
in scheme: travel!digital Thesaurus
narrower: mitteltunesisch
related match: Tunisia
narrower: nordtunesisch
narrower: südtunesisch
pref label: tunesisch

mitteltunesisch
type: Concept
pref label: mitteltunesisch
in scheme: travel!digital Thesaurus
definition: bdk: siehe tunesisch

mitteltunesisch
type: Label
in scheme: travel!digital Thesaurus

nordtunesisch
type: Concept
in scheme: travel!digital Thesaurus
pref label: nordtunesisch
definition: bdk: siehe tunesisch

nordtunesisch
type: Label
in scheme: travel!digital Thesaurus

südtunesisch
type: Concept
in scheme: travel!digital Thesaurus
pref label: südtunesisch
definition: bdk: siehe tunesisch

südtunesisch
type: Label
in scheme: travel!digital Thesaurus

tunesisch
type: Label
in scheme: travel!digital Thesaurus

maltesisch
type: Concept
pref label: maltesisch
related: Malteser
alternative label: malteser
narrower: anglo-maltesisch
definition: Duden: Malta, die Malteser (1) betreffend | [Anm.: unvollständig: Malta, die Malteser betreffend; von den Maltesern stammend, zu ihnen gehörend; auf Malta gelegen]
in scheme: travel!digital Thesaurus
alt label: malteser

maltesisch
type: Label
hasVariant: malteser
in scheme: travel!digital Thesaurus

malteser
type: Label
isVariantOf: maltesisch
in scheme: travel!digital Thesaurus

anglo-maltesisch
type: Concept
pref label: anglo-maltesisch
in scheme: travel!digital Thesaurus
related: britisch
related: englisch
definition: bdk: siehe englisch, maltesisch
comment: Mittelmeer 1909: nur italienisch
pref label: anglo-maltese
preferred label: anglo-maltese @it

anglo-maltesisch
type: Label
hasTranslation: anglo-maltese
in scheme: travel!digital Thesaurus

anglo-maltese
type: Label
isTranslationOf: anglo-maltesisch
in scheme: travel!digital Thesaurus

britisch
type: Concept
narrower: britisch-canadisch
pref label: british
pref label: britisch
pref label: britannique
preferred label: britannique @fr
related: Brite
preferred label: britanico @it
pref label: britanico
narrower: britisch-indisch
narrower: indisch-britisch
in scheme: travel!digital Thesaurus
preferred label: british @en
definition: Duden: Großbritannien, die Briten betreffend; von den Briten stammend, zu ihnen gehörend; aus Großbritannien stammend | [Anm.: unvollständig: Großbritannien, die Briten betreffend; von den Briten stammend, zu ihnen gehörend; in Großbritannien gelegen] | Duden: Großbritannien: Kurzwort für: Vereinigtes Königreich Großbritannien und Nordirland; Kurzform: Britannien (1)

british
type: Label
isTranslationOf: britisch
hasTranslation: britannique
hasTranslation: britanico
in scheme: travel!digital Thesaurus

britisch
type: Label
hasTranslation: british
hasTranslation: britannique
hasTranslation: britanico
in scheme: travel!digital Thesaurus

britannique
type: Label
isTranslationOf: britisch
hasTranslation: british
hasTranslation: britanico
in scheme: travel!digital Thesaurus

britanico
type: Label
isTranslationOf: britisch
in scheme: travel!digital Thesaurus
hasTranslation: britannique
hasTranslation: british

englisch
type: Concept
narrower: englisch-birmanisch
narrower: englisch-canadisch
pref label: inglese
narrower: englisch-gotisch
narrower: französisch-englisch
in scheme: travel!digital Thesaurus
narrower: englisch-amerikanisch
related: britisch
preferred label: inglizi @ar
definition: Duden: die Engländer, England betreffend, aus England stammend, zu England gehörend | [Anm.: unvollständig: England, die Engländer betreffend; von den Engländern stammend, zu ihnen gehörend; in England gelegen] | Duden: England 1. Teil von Großbritannien | 2. (volkstümlich) Großbritannien
narrower: englisch-ägyptisch
preferred label: english @en
pref label: englisch
preferred label: inglés @es
preferred label: inglese @it
pref label: english
pref label: inglizi
narrower: englisch-protestantisch
related: Engländer
preferred label: anglais @fr
narrower: englisch-französisch
narrower: englisch-indisch
pref label: anglais
pref label: inglés

inglese
type: Label
isTranslationOf: englisch
hasTranslation: english
hasTranslation: inglés
hasTranslation: anglais
in scheme: travel!digital Thesaurus
hasTranslation: inglizi

englisch
type: Label
hasTranslation: anglais
hasTranslation: english
hasTranslation: inglese
hasTranslation: inglés
in scheme: travel!digital Thesaurus
hasTranslation: inglizi

anglais
type: Label
isTranslationOf: englisch
hasTranslation: english
hasTranslation: inglés
hasTranslation: inglese
in scheme: travel!digital Thesaurus
hasTranslation: inglizi

english
type: Label
isTranslationOf: englisch
hasTranslation: anglais
hasTranslation: inglés
hasTranslation: inglese
in scheme: travel!digital Thesaurus
hasTranslation: inglizi

inglés
type: Label
isTranslationOf: englisch
hasTranslation: english
hasTranslation: anglais
hasTranslation: inglese
in scheme: travel!digital Thesaurus
hasTranslation: inglizi

inglizi
type: Label
in scheme: travel!digital Thesaurus
isTranslationOf: englisch
hasTranslation: english
hasTranslation: inglés
hasTranslation: anglais
hasTranslation: inglese

englisch-gotisch
type: Concept
pref label: englisch-gotisch
in scheme: travel!digital Thesaurus
definition: bdk: siehe englisch | Duden: gotisch: 2. a. die Gotik betreffend, zu ihr gehörend | b. für die Gotik typisch; an die Gotik erinnernd | Duden: Gotik: europäische Stilepoche (von der Mitte des 12. bis zum Ende des 15. Jahrhunderts) in [Sakral]architektur (mit Rippengewölben, Spitzbogen, Strebewerk, Maßwerk), [Architektur]plastik sowie Tafel- und Buchmalerei
related match: Gothic art

englisch-gotisch
type: Label
in scheme: travel!digital Thesaurus

englisch-amerikanisch
type: Concept
in scheme: travel!digital Thesaurus
definition: bdk: siehe englisch, amerikanisch
pref label: englisch-amerikanisch

englisch-amerikanisch
type: Label
in scheme: travel!digital Thesaurus

englisch-protestantisch
type: Concept
pref label: englisch-protestantisch
in scheme: travel!digital Thesaurus
definition: bdk: siehe englisch, protestantisch

englisch-protestantisch
type: Label
in scheme: travel!digital Thesaurus

Sbêʿ-Beduine
type: Concept
definition: bdk: arabische Stammesgemeinschaft in Jordanien
pref label: Sbêʿ-Beduine
related: Beduine
in scheme: travel!digital Thesaurus

Sbêʿ-Beduine
type: Label
in scheme: travel!digital Thesaurus

Chickasaw
type: Concept
alternative label: Chickasaw-lndianer
related: Indianer
alt label: Chickasaw-lndianer
pref label: Chickasaw
definition: Meyers Großes Konversations-Lexikon 1909: Tschikasa (engl. Chickasaw), nordamerikan. Indianerstamm der Tschokta-Muskogi, der früher in Alabama und Tennessee wohnte. In den Kämpfen mit den Franzosen (1736–40) wurde der Stamm sehr geschwächt, 1786 unterwarf er sich der Union und siedelte 1837–38 nach dem südwestlichen Teil des Indianerterritoriums über. Die T., (1890) 3464 Köpfe stark, gehören zu den fünf zivilisierten Nationen und haben eigne Legislatur mit Senat und Repräsentantenhaus, gute Schulen und geregelte Finanzen. Ihre Sprache ist von der der Tschokta wenig verschieden. Vokabularien derselben finden sich in Adairs »History of the American Indians« (Lond. 1775) und im 2. Bande der »Archaeologia americana«. | Quelle: Meyers Großes Konversations-Lexikon, Band 19. Leipzig 1909, S. 777. | Permalink: http://www.zeno.org/nid/20007612001
in scheme: travel!digital Thesaurus

Chickasaw-lndianer
type: Label
in scheme: travel!digital Thesaurus

Chickasaw
type: Label
in scheme: travel!digital Thesaurus

libysch
type: Concept
definition: Duden: Libyen, die Libyer betreffend; von den Libyern stammend, zu ihnen gehörend | [Anm.: unvollständig: Libyen, die Libyer betreffend; von den Libyern stammend, zu ihnen gehörend; in Libyen gelegen]
narrower: libyphönizisch
in scheme: travel!digital Thesaurus
related: Libyer
narrower: punisch-libysch
pref label: libysch

libyphönizisch
type: Concept
related: Libyphönizier
in scheme: travel!digital Thesaurus
pref label: libyphönizisch
definition: bdk: siehe libysch, phönizisch

libyphönizisch
type: Label
in scheme: travel!digital Thesaurus

punisch-libysch
type: Concept
in scheme: travel!digital Thesaurus
pref label: punisch-libysch
definition: bdk: siehe phönizisch, karthagisch, libysch

punisch-libysch
type: Label
in scheme: travel!digital Thesaurus

libysch
type: Label
in scheme: travel!digital Thesaurus

Burgunder
type: Concept
definition: Duden: 1. Einwohnerbezeichnung | [Anm.: unvollständig: Einwohnerbezeichnung zu Burgund] | Duden: Burgund: französische Landschaft und früheres Herzogtum | Meyers Großes Konversations-Lexikon1905: Burgund (Bourgogne), vormalige franz. Provinz, der zentrale Landstrich des östlichen Frankreich, der im N. von der Champagne, im W. von Bourbonnais und Nivernais, im S. von Lyonnais und [631] Dauphiné, im O. von Savoyen, der Schweiz und der Franche-Comté umschlossen ward. Die Provinz, bestehend aus den ehemaligen Landschaften Auxerrois, Montagne, Auxois, Dijonnais, Autunais, Châlonnais, Charolais, Mâconnais, dem Fürstentum Dombes, der Bresse, dem Bugey, dem Land von Gex und Val Romey, war 25,714 qkm (467 QM.) groß und umfaßte die jetzigen Departements Ain, Saôneet-Loire, Côte-d'Or und Yonne. – Der eigentliche Burgunder ist charakterisiert durch Freimut und Aufrichtigkeit, Beharrlichkeit und Festigkeit; er verbindet Frohsinn und Witz mit einer gewissen Barschheit, und sein rauhes, schneidendes Patois paßt gut zu seinem satirischen Ton. Die Schriftsteller, deren B. viele aufzuweisen hat, zeichnen sich durch einen bilderreichen, aber auch oft schwülstigen Stil aus. | Geschichte der Burgunderreiche. | Die Burgunder (Burgundiones), ein germanisches Volk, Zweig der Vandalen, wohnten ursprünglich im Gebiete der Netze und Warthe. Un 1250 n. Chr. zogen sie nach der obern Weichsel, wo sie von dem Gepidenkönig Fastida zurückgeworfen wurden, dann südwestwärts, wobei sie 277 von Kaiser Probus zum Frieden gezwungen wurden, und ließen sich nördlich von den Alemannen im Maingebiet nieder. Von hier machten sie Einfälle in Gallien und lagen dann mit den Alemannen lange in Fehde wegen der Grenze und des Besitzes von Salzquellen. Eine Schar Burgunder nahm 406 an dem Zug des Radagais nach Italien teil, andre brachen in Gallien ein. 413 ließen sie sich mit Zustimmung der Römer (Iovinus) unter ihrem König Gunt(i)ar am linken Rheinufer zwischen Lauter und Nahe nieder und gründeten ein Reich mit de…
in scheme: travel!digital Thesaurus
pref label: Burgunder
related match: Burgundy
related match: Kingdom of Burgundy

Burgunder
type: Label
in scheme: travel!digital Thesaurus

Gileaditer
type: Concept
in scheme: travel!digital Thesaurus
pref label: Gileaditer
definition: Meyers Großes Konversations-Lexikon 1907: Gilĕad, ein im Altertum reichbewaldetes Bergland in Palästina, östlich des Jordans, zwischen dessen Zuflüssen Jabbok und Jarmuk, im Stammesgebiet Manasse, hatte tiefe, enge, wasserreiche Täler und schöne Weiden. G. heißt auch oft das ganze Ostjordanland, soweit es von Juden bewohnt war (s. Karte »Palästina«). | Quelle: Meyers Großes Konversations-Lexikon, Band 7. Leipzig 1907, S. 847. | Permalink: http://www.zeno.org/nid/20006683487
related match: Gilead

Gileaditer
type: Label
in scheme: travel!digital Thesaurus

Jât
type: Concept
definition: Meyers Großes Konversations-Lexikon 1906: Dschat (engl. Jat), Volksstamm im östlichen Belutschistan und in Britisch-Indien (namentlich im N.: Pandschab 1,498,694, Nordwestprovinzen 674,547, Radschputana 425,598), bewohnt einige der kleinen Radschputenstaaten ausschließlich. Ihre Gesamtzahl in Indien wird auf etwa 7 Mill. angegeben. Die D. werden von Lassen u.a. mit den Ji-ta (Indoskythen, weißen Hunnen) in Zusammenhang gebracht, während F. Müller sie als einen arischen Zweig bezeichnet, der sich, im Gegensatze zu dem über das Gangestal verbreiteten indischen, von dem dort entwickelten Brahmanismus unbeeinflußt erhalten hat. Daß die D. von W. einwanderten, geht aus ihrem Fehlen im Himalaja hervor. Sie sind ein kräftiger Menschenschlag, aber kleiner als die obern Hindukasten. Sie haben manch altertümliche Sitten, wie den Brautraub, beibehalten, kennen aber kein Kastenwesen und werden daher von den Hindu mit einer gewissen Verachtung angesehen. Sie bekennen sich zum Islam oder der Religion der Sikh und sind fleißige Ackerbauer. – Die Urheimat der D., von einigen für identisch mit den Geten gehalten, von denen eine Abteilung, die Dhe, die Dahä Strabons, am Kaspischen Meer gewohnt haben soll, scheint am Oxus gelegen zu haben: sie sind die. kam des Plinius und Ptolemäos, die Xanthii Strabons, die durch die Karmanische Wüste an der Grenze von Drongiana in die Landschaft Abiria und die Städte Pardabathra und Bardaxema in Sind wanderten. Von hier breiteten sie sich weiter aus, so daß sie heute die obengenannten Gebiete bevölkern. 1026 n. Chr. wurde ihr Heer vom Sultan Mahmud von Ghasna fast völlig vernichtet, auch Timur besiegte sie 1397 im Pandschab. Dennoch gelangten sie wieder zu großer Macht, kämpften auch gegen die Briten mit großer Tapferkeit. | Quelle: Meyers Großes Konversations-Lexikon, Band 5. Leipzig 1906, S. 230. | Permalink: http://www.zeno.org/nid/20006515983
pref label: Jât
in scheme: travel!digital Thesaurus

Jât
type: Label
in scheme: travel!digital Thesaurus

Samaritaner
type: Concept
alternative label: Samariter
alt label: Samariter
in scheme: travel!digital Thesaurus
definition: Duden: Angehöriger eines Volkes in Palästina | Meyers Großes Konversations-Lexikon 1909: Samaritāner (von Luther »Samariter«, in der rabbinischen Literatur nach ihrer Heimatprovinz Kutha »Kuthim, Kuthäer« genannt), die Bewohner der Landschaft Samaritis oder Samarias. Sie entstanden aus der Vermischung der bei der Eroberung des Reiches Israel (722 v. Chr.) im Lande zurückgelassenen Israeliten mit den heidnischen Kolonisten, die von dem Assyrerkönig Sargon und später von Assarhaddon in Palästina angesiedelt wurden. Sie nahmen die israelitische Religion an und assimilierten sich mit der eingesessenen Bevölkerung. Von Eifer für den Kultus in Jerusalem erfüllt, wollten sie nach der Rückkehr der Juden aus dem Babylonischen Exil (536 v. Chr.) am Wiederaufbau des Tempels teilnehmen, wurden aber, da man eine Schädigung der im Exil geläuterten Religion befürchtete, zurückgewiesen, wodurch sie erbitterte Feinde der Juden wurden. Sie suchten den Wiederaufbau des Tempels durch Denunziation bei der persischen Regierung zu verhindern, erreichten aber ihren Zweck nicht. Um 466 v. Chr. erwirkten sie von Artaxerxes I. die Erlaubnis, die kaum errichteten Mauern Jerusalems zu demolieren. Später übernahmen sie den Pentateuch als heiliges Gesetzbuch und bauten sich einen Tempel auf dem Berge Garizim bei Sichem. Die S. teilten nach Alexanders d. Gr. Tode das Schicksal der übrigen Bewohner Palästinas; doch wußten sie die Mißhandlungen, die Antiochos Epiphanes an den Juden verübte, dadurch von sich abzuwenden, daß sie ihre Tempel zum Schein dem Zeus Xenios weihten. 128 v. Chr. eroberte der jüdische Fürst Johann Hyrkanos Samarien und zerstörte den Tempel der S., die nach politischem Druck unter jüdischer Herrschaft von Pompejus befreit wurden. Später ward das Land dem Königreich des Herodes einverleibt. Zur Zeit Christi standen sie unter römischen Prokuratoren. Daß Jesus den Haß gegen sie nicht teilte, beweist sein Gleichnis vom »barmherzigen Samariter« (Luk. 10, 30 ff.). Mit den Juden nahme…
pref label: Samaritaner

Samariter
type: Label
in scheme: travel!digital Thesaurus

Samaritaner
type: Label
in scheme: travel!digital Thesaurus

äolisch
type: Concept
related: Äolier
pref label: äolisch
in scheme: travel!digital Thesaurus
definition: Duden: Äolien betreffend, von dort stammend | [Anm.: unvollständig: Äolien, die Äolier betreffend; von den Äoliern stammend zu ihnen gehörend; in Äolien gelegen]

äolisch
type: Label
in scheme: travel!digital Thesaurus

Slowene
type: Concept
related match: Slovenia
definition: Duden: Einwohnerbezeichnung | [Anm.: unvollständig: Einwohnerbezeichnung zu Slowenien] | Duden: Slowenien: Staat in Südosteuropa | Meyers Großes Konversations-Lexikon 1909: Slowēnen (von slow. Slovenci, Einz. Slovenec), auch Winden genannt, südslawischer Volksstamm, der Krain, Untersteiermark, den südöstlichen Teil Kärntens, Görz und das Gebiet von Triest, einen kleinen Teil von Istrien (im NW.) und ein kleines Stück von Ungarn (im SW., zwischen Raab und Mur) und Italien (bei Cividale) bewohnt und 1900 etwa 11/3 Mill. Seelen zählte (in Krain 475,300 [93,54 Proz. der Bevölkerung], Steiermark 409,530 [30,19 Proz. der Bevölkerung], Kärnten 102,850 [28 Proz. der Bevölkerung], Görz und Gradisca ca. 140,000 [ca. 60 Proz. der Bevölkerung], Triest mit Gebiet 24,680 [13,81 Proz. der Bevölkerung], Istrien 47,720 [13,83 Proz. der Bevölkerung], Ungarn 70,650, Kroatien-Slawonien 21,000, Bosnien und Herzegowina mindestens 2000, endlich in Italien etwa 40,000). Hinsichtlich des Gebietes der S. vgl. Artikel »Slowenische Sprache« sowie die »Ethnographische Karte von Österreich-Ungarn« im 15. Band. Die S. sind, mit Ausnahme von etwa 15,000 Protestanten, römisch-katholisch. Nachdem die S. gegen Ende des 6. Jahrh., dem Andrang der Avaren weichend, von Pannonien her eingewandert waren, finden wir sie bereits 595 mit dem bayrischen Herzog Thassilo im Pustertal im Kampf. Zwischen 627 und 662 standen sie zu Samos Reich in einem Bundesverhältnis, und um diese Zeit fand nach und nach das Christentum bei ihnen Eingang. Nachdem sie mit dem Markgrafen von Friaul zum Teil siegreiche Kämpfe bestanden hatten, mußten sie sich seit der Mitte des 8. Jahrh. der Herrschaft der Franken unterwerfen. Als erster den Franken unterworfener windischer Fürst wird Borut (750) genannt. Sodann bildete die sogen. windische Mark einen Bestandteil des Reiches Karls d. Gr. Noch jetzt führt der Kaiser von Österreich den Titel eines Herrn der windischen Mark. Weiteres in den Artikeln »Krain«, »Kärnten«, »Steiermark« et…
in scheme: travel!digital Thesaurus
pref label: Slowene

Slowene
type: Label
in scheme: travel!digital Thesaurus

Talâing
type: Concept
alternative label: Talâing-Stamm
related match: Hanthawaddy Kingdom
definition: Meyers Großes Konversations-Lexikon 1908: Pegu, Division der britisch-ind. Provinz Niederbirma, umfaßt 23,721 qkm mit (1901) 1,820,638 Einw., davon 1,541,388 Buddhisten, 152,151 Hindu, 65,534 Mohammedaner, 38,274 Christen, 21,709 Naturanbeter, die sich selbst Mon nennen, bei den Birmanen Talaing heißen und eine reiche Literatur besitzen. Die meisten Einwohner sind Birmanen, dann Karen, Schau, Tamil, Chinesen u.a.; dazu etwa 10,000 Europäer, darunter 200 Deutsche. In meridionaler Richtung durchzieht die Bergkette Pegu-Yoma das Gebiet, im O. bildet eine zweite die Grenze gegen Tenasserim. Hauptfluß ist der Irawadi, dann der eine ansehnliche Strecke aufwärts schiffbare Pegufluß; im S O. mündet der Sittang. Angebaut wird vornehmlich Reis, dann Ölsaaten, Tabak, Baumwolle; sehr bedeutend ist die Obstkultur. Auf den Flüssen leben in 4638 Booten 23,851 Personen. Der sehr bedeutende Handel wird durch ein dichtes Netz vom Irawadi und Sittang ausgehender Flußarme sowie durch die Eisenbahn von Rangun nach Prome gefördert. P. zerfällt in vier Distrikte: Rangun Stadt, Hanthawadi, Tharawadi und Prome. Sitz der Verwaltung ist Rangun. – Die gleichnamige Stadt, am gleichnamigen Fluß im Hanthawadidistrikt, hat verfallene Mauern, neuere Palisaden, war vor ihrer Zerstörung durch Alompra (1757) eine große (150,000 Einw.) und reiche Stadt, Hauptstadt des Königreichs Taleng, von deren Glanz noch der 115 m hohe, angeblich 2320 Jahre alte Tempel des Gourtama Schwemada (»goldenes Heiligtum«) zeugt, zählte aber 1901 nur 14,132 Einw. (9901 Buddhisten, 291 Christen). Die Portugiesen erlangten hier 1540 Zutritt. 1586 besuchte der erste Engländer die Hauptstadt, die 1852 von England besetzt wurde. Vgl. Phayre, On the history of P. (im »Journal of the Asiatic Society of Bengal«, Kalkutta 1873). | Quelle: Meyers Großes Konversations-Lexikon, Band 15. Leipzig 1908, S. 538. | Permalink: http://www.zeno.org/nid/2000722544X
alt label: Talâing-Stamm
pref label: Talâing
in scheme: travel!digital Thesaurus

Talâing-Stamm
type: Label
in scheme: travel!digital Thesaurus

Talâing
type: Label
in scheme: travel!digital Thesaurus

Enakiter
type: Concept
alt label: Enakim
pref label: Enakiter
definition: bdk: kanaanitischer Stamm | Duden: riesengestaltiges vorisraelitisches Volk in Palästina | Pierer's Universal-Lexikon 1861: Phönikien (Phönīke, Phoenicia, Kanaan) [...] Den Namen Phönikien leiteten die Alten ab entweder von Phönix (s.d. 1), od. von dem griechischen φοίνιξ, d. i. der Palmbaum od. der Purpur, ab, also Palmen- od. Purpurland. Die eigentlichen Phöniker (Kananiter, Zidonier) waren Aramäer od. Semiten u. zwar Kananiter u. sollten von den Küsten des Erythräischen Meeres, u. zwar aus Arabien od. Ägypten, od. von den Küsten des Persischen Meerbusens, od. auch von den sumpfigen Ufern des Euphrat, u. zwar lange vor den Israeliten, hier eingewandert sein. Vor ihnen wohnten die Riesenvölker der Rephaiter, Emiter, Enakiter, Aviter u.a. hier. [...] | Quelle: Pierer's Universal-Lexikon, Band 13. Altenburg 1861, S. 83-84. | Permalink: http://www.zeno.org/nid/2001063326X | Meyers Großes Konversations-Lexikon 1906: Enakīter (Enakim, Enaks Söhne), zu Moses' Zeit ein Riesenvolk im südlichen Kanaan (unweit Hebron; 5. Mos. 9,2). | Quelle: Meyers Großes Konversations-Lexikon, Band 5. Leipzig 1906, S. 767. | Permalink: http://www.zeno.org/nid/20006552226
related match: Anak
alternative label: Enakim
in scheme: travel!digital Thesaurus
related: Kanaʿaniter

Enakim
type: Label
in scheme: travel!digital Thesaurus

Enakiter
type: Label
in scheme: travel!digital Thesaurus

Moqui-Indianer
type: Concept
definition: Meyers Großes Konversations-Lexikon 1908: Moqui (Moki), nordamerikan. Indianerstamm der Ute-Schoschonen in Arizona, unfern des Kleinen Colorado, der sieben gewaltige, dreistöckige, aus Lehmziegeln ausgeführte Gebäude (Pueblos, s. Puebloindianer) bewohnt. Seit 1850 schmolzen sie durch Pockenepidemien von 6700 auf (1890) 1996 Seelen zusammen. Ihren Schlangentanz beschrieb Bourke (»Snake-dance of the Moquis«, New York 1884). Vgl. Tafel »Kunst der Naturvölker I«, Fig. 13. | Quelle: Meyers Großes Konversations-Lexikon, Band 14. Leipzig 1908, S. 129. | Permalink: http://www.zeno.org/nid/20007110626
in scheme: travel!digital Thesaurus
related: Indianer
pref label: Moqui-Indianer

Moqui-Indianer
type: Label
in scheme: travel!digital Thesaurus

Tolistobojer
type: Concept
in scheme: travel!digital Thesaurus
related: Galater
pref label: Tolistobojer
definition: bdk: Teilstamm der Volker; siehe Galater | bdk: Volker: antikes keltisches Volk

Tolistobojer
type: Label
in scheme: travel!digital Thesaurus

Ammoniter
type: Concept
alternative label: Ammon
alt label: Ammon
pref label: Ammoniter
in scheme: travel!digital Thesaurus
definition: Duden: Angehöriger eines alttestamentlichen Nachbarvolks der Israeliten | Meyers Großes Konversations-Lexikon 1905: Ammonīter, semit. Hirtenvolk, auf dessen Entstehung aus der Vermischung der Semiten mit andern Stämmen die Erzählung von ihrem blutschänderischen Ursprung (1. Mos. 19,38) hindeutet. Grenznachbarn der Stämme Ruben und Gad, wohnten sie in der Wüste des nördlichen Arabien zwischen dem Jabok und Arnon (s. Karte »Palästina«). Ihre Religion war die der Kanaaniter mit Beschneidung und Molochsdienst. Sie trieben Ackerbau und Viehzucht, waren aber kriegerisch; ihre uns bekannte Geschichte ist nur eine Reihe erbitterter Fehden mit den Israeliten, die unter Jephtha und Saul ihre Einfälle in israelitisches Gebiet zurückschlugen und unter David, durch eine Beschimpfung gereizt, die Hauptstadt der A., Rabba, eroberten. Die A. leisteten Nebukadnezar Hilfe gegen Israel und hinderten den Wiederaufbau Jerusalems unter Nehemia. Noch einmal eroberte Antiochos Epiphanes ihre Hauptstadt, und Judas Makkabäus schlug siegreich ihren Angriff zurück. Nach dem 2. Jahrh. n. Chr. kommt der Name nicht mehr vor, da sie sich unter den Arabern verloren. Die assyrischen Inschriften erwähnen sie unter dem Namen Bît ammân (Haus Ammons). | Quelle: Meyers Großes Konversations-Lexikon, Band 1. Leipzig 1905, S. 446. | Permalink: http://www.zeno.org/nid/20006223451

Ammon
type: Label
in scheme: travel!digital Thesaurus

Ammoniter
type: Label
in scheme: travel!digital Thesaurus

arabisch
type: Concept
alt label: neuarabisch
narrower: arabisch-normannisch
definition: Duden: 1. Arabien, die Araber betreffend; von den Arabern stammend, zu ihnen gehörend | [Anm.: unvollständig: Arabien, die Araber betreffend; von den Arabern stammend, zu ihnen gehörend; in Arabien gelegen]
pref label: arab
narrower: arabisch-türkisch
preferred label: arabe @fr
in scheme: travel!digital Thesaurus
narrower: arabisch-protestantisch
narrower: arabisch-indisch
alternative label: altarabisch
narrower: syrisch-arabisch
narrower: ägyptisch-arabisch
narrower: byzantinisch-arabisch
alt label: altarabisch
narrower: südarabisch
pref label: ʿarabi
related: Araber
preferred label: arab @en
narrower: türkisch-arabisch
alternative label: neuarabisch
narrower: nordarabisch
pref label: arabe
pref label: arabisch
preferred label: ʿarabi @ar

neuarabisch
type: Label
in scheme: travel!digital Thesaurus

arab
type: Label
isTranslationOf: arabisch
in scheme: travel!digital Thesaurus
hasTranslation: arabe
hasTranslation: ʿarabi

arabisch
type: Label
in scheme: travel!digital Thesaurus
hasTranslation: arab
hasTranslation: ʿarabi

ʿarabi
type: Label
hasTranslation: arabe
in scheme: travel!digital Thesaurus
isTranslationOf: arabisch
hasTranslation: arab

arabe
type: Label
isTranslationOf: arabisch
hasTranslation: arab
in scheme: travel!digital Thesaurus
hasTranslation: ʿarabi

arabisch-protestantisch
type: Concept
definition: bdk: siehe arabisch, protestantisch
pref label: arabisch-protestantisch
in scheme: travel!digital Thesaurus

arabisch-protestantisch
type: Label
in scheme: travel!digital Thesaurus

syrisch-arabisch
type: Concept
in scheme: travel!digital Thesaurus
definition: bdk: siehe syrisch, arabisch
pref label: syrisch-arabisch

syrisch-arabisch
type: Label
in scheme: travel!digital Thesaurus

altarabisch
type: Label
in scheme: travel!digital Thesaurus

südarabisch
type: Concept
definition: bdk: siehe arabisch
in scheme: travel!digital Thesaurus
pref label: südarabisch
related: Südaraber

südarabisch
type: Label
in scheme: travel!digital Thesaurus

nordarabisch
type: Concept
definition: bdk: siehe arabisch
in scheme: travel!digital Thesaurus
pref label: nordarabisch
related: Nordaraber

nordarabisch
type: Label
in scheme: travel!digital Thesaurus

thrakisch
type: Concept
alternative label: thrazisch
alt label: thrazisch
pref label: thrakisch
in scheme: travel!digital Thesaurus
related: Thraker
definition: Duden: Thrakien, die Thrakier betreffend | [Anm.: unvollständig: Thrakien, die Thraker/Thrakier betreffend; von den Thrakern/Thrakiern stammend, zu ihnen gehörend; in Thrakien gelegen]

thrazisch
type: Label
isVariantOf: thrakisch
in scheme: travel!digital Thesaurus

thrakisch
type: Label
hasVariant: thrazisch
in scheme: travel!digital Thesaurus

dorisch
type: Concept
pref label: dorisch
definition: Duden: die [Kunst der] Dorer betreffend | [Anm.: unvollständig: die Dorer betreffend; von den Dorern stammend, zu ihnen gehörend]
in scheme: travel!digital Thesaurus
related: Dorer

dorisch
type: Label
in scheme: travel!digital Thesaurus

Dorer
type: Concept
pref label: Dorer
in scheme: travel!digital Thesaurus
definition: Duden: Angehöriger eines altgriechischen Volksstammes | Meyers Großes Konversations-Lexikon 1906: Dorĭer (D or er), einer der Hauptstämme des griechischen Volkes, leiteten ihren Namen von Deukalions Enkel Doros, Hellens Sohn, ab. Wir finden sie in den frühesten Zeiten in Thessalien, geteilt in drei Stämme, Pamphyler, Dymanen und Hylleis. Der Einbruch der Thessaler von Norden her zwang sie, ihre Wohnsitze nach Süden vorzuschieben; als Spur ihrer Wanderung blieb aber die Landschaft Doris am Öta mit der Hauptstadt Erineos, stets von Doriern bewohnt. Ums Jahr 1104 führten sie ihren Zug in den Peloponnes fort. Die Sage läßt sie den Korinthischen Meerbusen überschreiten, und zwar unter der Anführung der Nachkommen des Herakles, den sie zu ihrem Stammheros erhoben hatten, und von dem sie ihre Fürstengeschlechter ableiteten (die sogen. Dorische Wanderung oder die Rückkehr der Herakliden). Im Peloponnes stürzten sie die erschlafften Mykenischen Staaten und bemächtigten sich des Südens und Ostens der Halbinsel, der Landschaften Lakonien, Messenien und Argolis, die nach der Sage den drei Heraklidenbrüdern Aristodemos, Kresphontes und Temenos zufielen, ferner Korinths und in Mittelgriechenland Megaris'. Nur ein Teil von Elis, Arkadien und Achaia verblieb den frühern Einwohnern; in den dorisch gewordenen Landschaften wurde ihnen mit Ausnahme einiger ächäischen Geschlechter, welche die Dorier in ihre Stammesgemeinschaft aufnahmen, die untergeordnete Stellung von Zinsbauern (Periöken) und Staatssklaven (in Sparta Heloten genannt) zugewiesen. Der Dialekt wurde überall der dorische, von den Göttern genoß in den meisten Staaten Apollon die höchste Verehrung, zu seinem Orakel in Delphi standen namentlich die spartanischen Könige in enger Beziehung. Auch außerhalb des Peloponnes breiteten sich die D. durch Kolonien aus. So begründeten sie eine neue Bevölkerung und Kultur auf der Insel Kreta, die allmählich völlig von ihnen unterworfen wurde, und besetzten die südlichen Kykladen (nament…

Dorer
type: Label
in scheme: travel!digital Thesaurus

Rumäne
type: Concept
definition: Duden: Einwohnerbezeichnung | [Anm.: unvollständig: Einwohnerbezeichnung zu Rumänien] | Duden: Rumänien: Staat in Südosteuropa | siehe auch: Meyers Großes Konversations-Lexikon 1909: Rumänĭen | Quelle: Meyers Großes Konversations-Lexikon, Band 17. Leipzig 1909, S. 249-257. | Permalink: http://www.zeno.org/nid/20007374437
related match: Romania
pref label: Rumäne
in scheme: travel!digital Thesaurus

Rumäne
type: Label
in scheme: travel!digital Thesaurus

Berber
type: Concept
narrower: Beni Messauer
narrower: Ouled Aoun
narrower: Beni Messous
narrower: Haracta
narrower: Kabyle
narrower: Beni Raten
narrower: Biskris
narrower: Semmûr
narrower: Amour
narrower: Fenaïa
narrower: Aït Ousammeur
narrower: Ouled Ayar
narrower: Beni Waraïn
narrower: Riahstamm
narrower: Beni Amrous
narrower: Matmata
narrower: Beni Himmel
narrower: Saïr
narrower: Beni Salah
narrower: Tuâreg
narrower: Aït Yahia
narrower: Beni Yenni
narrower: Beni Bou Addou
narrower: Bedschaïa
narrower: Beni Addi
narrower: Oulad Saïd
narrower: Zenata
narrower: Beni Akbil
narrower: Oulad Sendassen
narrower: Beni Menasser
narrower: Rirha
narrower: Beni Mimoun Djoua
narrower: Gebirgsberber
narrower: Madjeur
narrower: Djlass
narrower: Ouled Ziane
narrower: Beni Ghobri
narrower: Mozabite
narrower: Beni Ferah
definition: Duden: 1. Angehöriger einer nordafrikanischen Völkergruppe | Meyers Großes Konversations-Lexikon 1905: Berber (Berbern), zu den Hamiten gehöriger Volksstamm in Nordafrika, zu dem außer den ausgestorbenen Guanchen (s. d.) die Libyer, Mauren, Numidier, Gätuler und Garamanten der alten Geographen gehörten, und der bis heute trotz der semitischen und nordeuropäischen Eroberer auf dem Lande sich in voller Reinheit erhalten hat. Die B. werden schon im Altertum als große, kräftige Rasse von edler Körperhaltung geschildert. Typisch für sie sind ovales, volles Gesicht mit Abplattung in der Gegend der Backenknochen, kurze, stumpfe, platte Nase, kleine Augen, rundes Kinn. Die Mehrzahl ist dunkelhaarig, daneben findet sich auch ein blonder Typus. Die B. zerfallen in drei Hauptstämme der Amazirghen, Schelluh und Kabylen. Die Amazirghen (Amazigh, Imoscharh), d. h. die Freien, bewohnen 2 bis 21/2 Mill. Köpfe stark das Er-Rif und das Land östlich vom Uad-Kurt bis zum Muluja sowie den nördlichen Teil des Atlas. Die Schelluh oder Schloh, 11/2 Mill. Köpfe, wohnen zwischen 32 u. 38° nördl. Br. von der Küste bis zum Meridian von El Araisch, die Kabylen in Algerien und Tunis, in ersterm 760,000 Köpfe zählend. Dazu kommt eine Anzahl von Stämmen in der Sahara, wie die Sanhadscha im W., die Tuareg im Mittelgebiete der Wüste, die Dschebaliya im SO. von Tunis, die Bewohner von Siwah. Ihre Sprache, das Amazirgh, hat sich in zahlreichen Dialekten bei allen diesen Stämmen erhalten. Sie wird mit arabischen Buchstaben geschrieben; nur die Tuareg haben für ihre Sprache, das Ta-Maschek, ein eignes Alphabet (vgl. Basset, Etudes sur les dialectes berbères, Par. 1895). Die B. des Atlas sind meist Ackerbauer, Händler, Kaufleute, seßhaft und mehr an die Scholle gefesselt als die Araber. Ihre Dörfer liegen meist auf festen, gut zu verteidigenden Punkten und bestehen aus Häusern, Hütten und wenigen Zelten. Zur Kleidung dienen selbstgefertigte Wollenstoffe. Die Frauen tragen ein langes Hemd, die Männer eine…
narrower: Beni Slimane
narrower: Touazine
narrower: Schilluh
narrower: Ouled Naïl
narrower: Beni Meraï
narrower: Beni Hassain
narrower: Beni Bou Aïssi
narrower: Bejaoua
narrower: Amasîgen
narrower: Beni Mansour
narrower: Saiân
alternative label: Berberstamm
narrower: Souassistamm
narrower: Berâber
narrower: Fraichich
narrower: Beni Abbes
narrower: Beni Chougrane
narrower: Mogod
narrower: Oulad Sidi-Abid
alt label: Berberstamm
narrower: Ouled Sidi-Cheîk
narrower: Accara
narrower: Beni Mekla
pref label: Berber
narrower: Auresberber
narrower: Rîfberber
narrower: Bettioua
narrower: Khezour
narrower: Beni Smart
in scheme: travel!digital Thesaurus
narrower: Oaderna
narrower: Beni Mezghanna

Beni Messauer
type: Concept
pref label: Beni Messauer
in scheme: travel!digital Thesaurus
definition: bdk: Berbergruppe in Marokko

Beni Messauer
type: Label
in scheme: travel!digital Thesaurus

Ouled Aoun
type: Concept
pref label: Ouled Aoun
in scheme: travel!digital Thesaurus
definition: bdk: Berbergruppe in Tunesien

Ouled Aoun
type: Label
in scheme: travel!digital Thesaurus

Beni Messous
type: Concept
related match: Béni Messous
in scheme: travel!digital Thesaurus
pref label: Beni Messous
definition: bdk: Berbergruppe in Algerien

Beni Messous
type: Label
in scheme: travel!digital Thesaurus

Haracta
type: Concept
pref label: Haracta
in scheme: travel!digital Thesaurus
definition: bdk: Berbergruppe in Algerien

Haracta
type: Label
in scheme: travel!digital Thesaurus

Kabyle
type: Concept
related match: Kabylie
in scheme: travel!digital Thesaurus
pref label: Kabyle
definition: bdk: Berbergruppe in Algerien | Duden: Angehöriger eines Berberstammes | Duden: Kabylei: Gebirgslandschaft in Nordalgerien | Meyers Großes Konversations-Lexikon 1907: Kabylen (arab. Qabail, »Stämme«, Mehrzahl von Kabil), ein zur hamitischen Familie gehöriges Volk berberischer Abstammung in Algerien und Tunis,[409] dessen Zahl für ersteres auf 760,000 berechnet wird. Ursprünglich reine Berber, haben sie seit alters fremde, besonders arabische Beimischung erhalten. Sie sind mittelgroß, starkknochig, von dunkelbrauner, ins Schmutziggelbe spielender Hautfarbe. Sie sind sämtlich Mohammedaner, seßhaft, gastfrei, halten fest an der Blutrache, wohnen in Dörfern, treiben Ackerbau (Spatenwirtschaft), mehr aber Viehzucht, sind geschickte Weber und Schwertfeger und bearbeiten die Eisen- und Bleibergwerke des Atlas. Man findet Wassermühlen, Teppichwirkereien und Töpfereien bei ihnen; besonders heimisch aber ist die Ölbereitung. Auch wandern jährlich Tausende als Lastträger und Arbeiter in die Städte, um nach Erwerb einer kleinen Summe in die Heimat zurückzukehren. Grammatiken ihrer zu dem hamitischen Sprachstamm gehörigen Sprache lieferten Hanoteau (Algier 1858), Basset (Par. 1887), Belkassem (das. 1887), ein »Dictionnaire français-kabyle« Huyghe (Mecheln 1903). Proben ihrer Volkspoesie veröffentlichten Hanoteau (Algier 1867), Rivière (Par. 1883), Basset (in den »Bulletins de correspondance africaine«, Algier 1885), Rinn (in der »Revue Africaine«, Par. 1887) u. a. Unter den verschiedenen Stämmen der K. besteht eine Art von traditionellem Bündnis (Soff), das in Fällen gemeinsamer Gefahr ins Leben tritt. Ihre Verfassung ist rein demokratisch. Jeder Stamm (Artsch) teilt sich in so viel Bezirke (Charuba), wie er Täler oder Berge besetzt hält; der Amine ist der Anführer im Kriege, der Richter im Frieden. Die wahre Macht ruht in der Sawia, der von Marabuts gebildeten kirchlichen Gemeinde. Die Gesetzgebung geht von der Dschemma, der Gemeindeversammlung, aus. Die von der Sawia erhobenen…

Kabyle
type: Label
in scheme: travel!digital Thesaurus

Beni Raten
type: Concept
alternative label: Irate
in scheme: travel!digital Thesaurus
alt label: Irate
pref label: Beni Raten
definition: bdk: Berbergruppe in Algerien

Irate
type: Label
in scheme: travel!digital Thesaurus

Beni Raten
type: Label
in scheme: travel!digital Thesaurus

Biskris
type: Concept
in scheme: travel!digital Thesaurus
pref label: Biskris
definition: bdk: Berbergruppe in Algerien

Biskris
type: Label
in scheme: travel!digital Thesaurus

Semmûr
type: Concept
definition: bdk: Berbergruppe in Marokko
pref label: Semmûr
in scheme: travel!digital Thesaurus

Semmûr
type: Label
in scheme: travel!digital Thesaurus

Amour
type: Concept
pref label: Amour
in scheme: travel!digital Thesaurus
definition: bdk: Berbergruppe in Algerien

Amour
type: Label
in scheme: travel!digital Thesaurus

Fenaïa
type: Concept
pref label: Fenaïa
in scheme: travel!digital Thesaurus
definition: bdk: Berbergruppe in Algerien

Fenaïa
type: Label
in scheme: travel!digital Thesaurus

Aït Ousammeur
type: Concept
in scheme: travel!digital Thesaurus
pref label: Aït Ousammeur
definition: bdk: Berbergruppe in Algerien

Aït Ousammeur
type: Label
in scheme: travel!digital Thesaurus

Ouled Ayar
type: Concept
pref label: Ouled Ayar
in scheme: travel!digital Thesaurus
definition: bdk: Berbergruppe in Tunesien

Ouled Ayar
type: Label
in scheme: travel!digital Thesaurus

Beni Waraïn
type: Concept
in scheme: travel!digital Thesaurus
pref label: Beni Waraïn
definition: bdk: Berbergruppe in Marokko

Beni Waraïn
type: Label
in scheme: travel!digital Thesaurus

Riahstamm
type: Concept
related: Stamm
in scheme: travel!digital Thesaurus
pref label: Riahstamm
definition: bdk: Berbergruppe in Tunesien

Riahstamm
type: Label
in scheme: travel!digital Thesaurus

Beni Amrous
type: Concept
pref label: Beni Amrous
in scheme: travel!digital Thesaurus
definition: bdk: Berbergruppe in Algerien

Beni Amrous
type: Label
in scheme: travel!digital Thesaurus

Matmata
type: Concept
in scheme: travel!digital Thesaurus
pref label: Matmata
definition: bdk: Berbergruppe in Tunesien

Matmata
type: Label
in scheme: travel!digital Thesaurus

Beni Himmel
type: Concept
in scheme: travel!digital Thesaurus
pref label: Beni Himmel
definition: bdk: Berbergruppe in Algerien

Beni Himmel
type: Label
in scheme: travel!digital Thesaurus

Saïr
type: Concept
definition: bdk: Berbergruppe in Marokko
pref label: Saïr
in scheme: travel!digital Thesaurus

Saïr
type: Label
in scheme: travel!digital Thesaurus

Beni Salah
type: Concept
in scheme: travel!digital Thesaurus
pref label: Beni Salah
definition: bdk: Berbergruppe in Algerien

Beni Salah
type: Label
in scheme: travel!digital Thesaurus

Tuâreg
type: Concept
definition: bdk: Berbergruppe in Nordafrika | Meyers Großes Konversations-Lexikon 1909: Tuareg (Tuarik, Singular Targi), wichtigster Berberstamm der Sahara, der sich selbst Imoscharh (Imuharh, Imazirhen) nennt. Zwischen Atlas (N.) und Niger (S.) sowie den maurischen Stämmen (W.) und den Tibbu (O.) wohnen sie vornehmlich in den Oasen Tuat, Ghat, in den Landschaften Asgar und Ahaggar, etwa 240,000 Köpfe stark, und zerfallen in die freien (Ihaggaren) und unterworfenen Stämme (Imrhad) und mehrere, meist einander feindliche Stämme: die Asgar im NO., die Haggar im N., die Kelowi im Bergland von Aïr, die Auelimmiden (50–80,000), die Erbauer Timbuktus, u. a. Aus den Landschaften am Niger wurden sie in jüngster Zeit durch die Franzosen vertrieben. Ein schöner, bräunlicher Menschenschlag mit echt kaukasischen Gesichtszügen, durchstreifen sie raubend und als Viehzüchter die Wüste und sind wichtig als Vermittler des Karawanenverkehrs zwischen Nordafrika und dem Sudân. Als besonderes Kennzeichen tragen sie das Litham oder Tessilgemist, ein nur die Augen freilassendes Gesichtstuch. Sie sind die Nachkommen der Gätuler und Garamanten (s. d.) des Altertums, fanatische Mohammedaner und treulos; ihrer Mordsucht fielen Alexine Tinné. E. v. Bary u. a. zum Opfer. Ihre Sprache heißt Tamaschek (s. d.). Vgl. Duveyrier, Les Touaregs du Nord (Par. 1864); Rohlfs, Quer durch Afrika, Bd. 1 (Leipz. 1874); Nachtigal, Sahara und Sudân, Bd. 1 (Berl. 1879); Bissuel, Les Touareg de l'ouest (Par. 1889); F. Bernard, Deux missions chez les Touareg (Algier 1896); Hourst, Sur le Niger et an pays des T. (Par. 1898); Fermé, Les Touareg (das. 1900); Dex, Au pays des Touareg (das. 1901); A. Köhler, Verfassung, soziale Gliederung, Recht und Wirtschaft der T. (Gotha 1904). | Quelle: Meyers Großes Konversations-Lexikon, Band 19. Leipzig 1909, S. 786. | Permalink: http://www.zeno.org/nid/20007613172
in scheme: travel!digital Thesaurus
pref label: Tuâreg

Tuâreg
type: Label
in scheme: travel!digital Thesaurus

Aït Yahia
type: Concept
related match: Aït Yahia
in scheme: travel!digital Thesaurus
pref label: Aït Yahia
definition: bdk: Berbergruppe in Algerien

Aït Yahia
type: Label
in scheme: travel!digital Thesaurus

Beni Yenni
type: Concept
alternative label: Beni-Yenni
related match: Beni Yenni
in scheme: travel!digital Thesaurus
pref label: Beni Yenni
alt label: Beni-Yenni
definition: bdk: Berbergruppe in Algerien

Beni Yenni
type: Label
hasVariant: Beni-Yenni
in scheme: travel!digital Thesaurus

Beni-Yenni
type: Label
isVariantOf: Beni Yenni
in scheme: travel!digital Thesaurus

Beni Bou Addou
type: Concept
related match: Aït Bouaddou
pref label: Beni Bou Addou
in scheme: travel!digital Thesaurus
definition: bdk: Berbergruppe in Algerien

Beni Bou Addou
type: Label
in scheme: travel!digital Thesaurus

Bedschaïa
type: Concept
alternative label: Budschaïa
related match: Béjaïa
alt label: Budschaïa
in scheme: travel!digital Thesaurus
definition: Meyers Großes Konversations-Lexikon 1905: Bougie (spr. būschī, Budschajah), Arrondissementshauptort und stark befestigte Hafenstadt in der alger. Provinz Konstantine, an der Westecke der Bai von B., mit gutem Ankergrund, an der Bahn B.-Beni-Mansur, die es mit Algier und Konstantine verbindet, liegt amphitheatralisch am Abhang des 672 m hohen Dschebel Guraya, über den eine in den Felsen gehauene Straße führt, hat eine Kirche, mehrere Moscheen, Kasernen, Arsenal, Militär- und Zivilhospital und (1901) 8713 Einw., die Fabrikation von hydraulischem Kalk und Zement und Handel mit Öl, Kort, Getreide, Wein betreiben; 1896 liefen 1350 Schiffe von 350,804 Ton. ein. In der Nähe die warmen [275] Eisenquellen von Fennaia und die heißen Solquellen von Hammam beni Serinen. – B. ist das Saldae der Römer; im 5. Jahrh. gehörte es zu Geiserichs Vandalenreich und ward 708 von den Arabern erobert. Im 10. Jahrh. faßten die berberischen Bedschaia hier Fuß, gaben der Stadt den Namen des Stammes und zugleich solche Bedeutung, daß man diesen Stapelplatz zwischen Nordafrika und Europa Klein-Mekka (Mekka essagerieh) nannte. 1152 fiel B. an Marokko, 1240 an das Königreich Tunis und 1352 an den Meriniden Abu Inân, Sohn des Kalifen 'l Hasan von Fez. Im 15. Jahrh. ein Seeräubernest, ward es 1510 von den Spaniern erobert, kam aber 1555 durch des Grafen Peratta Kapitulation an den Pascha von Algier. Die französischen Eroberer fanden 2. Okt. 1833 nur ein elendes Dorf vor, das sie zu einer starken Festung und einem wichtigen Handelsplatz emporgehoben haben. Vgl. Erzherzog Ludwig Salvator, B., Die Perle Nordafrikas (Leipz. 1900). | Quelle: Meyers Großes Konversations-Lexikon, Band 3. Leipzig 1905, S. 275-276. | Permalink: http://www.zeno.org/nid/20006357628
pref label: Bedschaïa

Budschaïa
type: Label
isVariantOf: Bedschaïa
in scheme: travel!digital Thesaurus

Bedschaïa
type: Label
hasVariant: Budschaïa
in scheme: travel!digital Thesaurus

Beni Addi
type: Concept
pref label: Beni Addi
in scheme: travel!digital Thesaurus
definition: bdk: Berbergruppe in Algerien

Beni Addi
type: Label
in scheme: travel!digital Thesaurus

Oulad Saïd
type: Concept
pref label: Oulad Saïd
in scheme: travel!digital Thesaurus
definition: bdk: Berbergruppe in Tunesien

Oulad Saïd
type: Label
in scheme: travel!digital Thesaurus

Zenata
type: Concept
in scheme: travel!digital Thesaurus
pref label: Zenata
definition: bdk: Berbergruppe in Algerien

Zenata
type: Label
in scheme: travel!digital Thesaurus

Beni Akbil
type: Concept
pref label: Beni Akbil
in scheme: travel!digital Thesaurus
definition: bdk: Berbergruppe in Algerien

Beni Akbil
type: Label
in scheme: travel!digital Thesaurus

Oulad Sendassen
type: Concept
pref label: Oulad Sendassen
in scheme: travel!digital Thesaurus
definition: bdk: Berbergruppe in Tunesien

Oulad Sendassen
type: Label
in scheme: travel!digital Thesaurus

Beni Menasser
type: Concept
in scheme: travel!digital Thesaurus
related match: Shenwa language
pref label: Beni Menasser
definition: bdk: Berbergruppe in Algerien

Beni Menasser
type: Label
in scheme: travel!digital Thesaurus

Rirha
type: Concept
pref label: Rirha
in scheme: travel!digital Thesaurus
definition: bdk: Berbergruppe in Algerien

Rirha
type: Label
in scheme: travel!digital Thesaurus

Beni Mimoun Djoua
type: Concept
in scheme: travel!digital Thesaurus
pref label: Beni Mimoun Djoua
definition: bdk: Berbergruppe in Algerien

Beni Mimoun Djoua
type: Label
in scheme: travel!digital Thesaurus

Gebirgsberber
type: Concept
pref label: Gebirgsberber
in scheme: travel!digital Thesaurus
definition: bdk: siehe Berber

Gebirgsberber
type: Label
in scheme: travel!digital Thesaurus

Madjeur
type: Concept
in scheme: travel!digital Thesaurus
pref label: Madjeur
definition: bdk: Berbergruppe in Tunesien

Madjeur
type: Label
in scheme: travel!digital Thesaurus

Djlass
type: Concept
alternative label: Zlass
in scheme: travel!digital Thesaurus
alt label: Zlass
pref label: Djlass
definition: bdk: Berbergruppe in Tunesien

Zlass
type: Label
isVariantOf: Djlass
in scheme: travel!digital Thesaurus

Djlass
type: Label
hasVariant: Zlass
in scheme: travel!digital Thesaurus

Ouled Ziane
type: Concept
pref label: Ouled Ziane
in scheme: travel!digital Thesaurus
definition: bdk: Berbergruppe in Algerien

Ouled Ziane
type: Label
in scheme: travel!digital Thesaurus

Beni Ghobri
type: Concept
pref label: Beni Ghobri
in scheme: travel!digital Thesaurus
definition: bdk: Berbergruppe in Algerien

Beni Ghobri
type: Label
in scheme: travel!digital Thesaurus

Mozabite
type: Concept
definition: Pierer's Universal-Lexikon 1860: Mozabiten, Volksstamm der Berbern, s.d. b). | Quelle: Pierer's Universal-Lexikon, Band 11. Altenburg 1860, S. 494. | Permalink: http://www.zeno.org/nid/20010473629 | Pierer's Universal-Lexikon 1857: [...] b) Die östlichen Stämme, darunter am bekanntesten die Kabyl en (d.i. Stämme) in den Gebirgsgegenden Algiers, vor allem dem Dschurdschura (s. Kabylen), u. die Schauïa od. Schowiah (d.i. Hirten) im Aurâs bis herab[586] zum mittleren Theile der Provinz Constantine, Ein Berberstamm mit etwas abweichender Sprache sind die Beni-Mzas od. Mozabiten in einer größeren Oase. Wie die marokkischen B. als die Nachkommen der alten Mauren od. Maurusier zu betrachten sind, so hatten die algierischen B. die Numider zu Vorfahren. In Tunis, Tripolis u. Berka sind die B. fast völlig untergegangen; einzelne Rester haben sich im Tunesischen u. bei Sockna in Tripolis erhalten. c) Die südlichen Stämme. Unter ihnen stehen oben an die Tuarek (s.d.), od., wie sie sich selbst nennen, Ymoshar, im westlichen Theil der Sahara, zwischen dem Atlantischen Ocean u. Fezzan. Ihre Vorgänger sind die Gätuli der Alten. Verdorbene Dialekte des Berberischen werden noch in den östlichsten des großen Oasenzugs, in Augila u. Siwah, gesprochen. Ausgestorben sind Guanchen (s.d.) auf den Canarischen Inseln, die dem B-stamme angehörten. Die B. bedienen sich gegenwärtig des arabischen Alphabets, dem sie einige punktirte Zeichen hinzufügen; doch besitzen sie von Alters her eine eigene nationale Schrift (jetzt Tisinaghi genannt), die zuerst auf der zweisprachigen Inschrift zu Thugga erscheint u. etwas modificirt von Einzelnen bes. unter den Tuareks angewendet wird. Eine Berber-Literatur ist nicht vorhanden, wenn auch in neuester Zeit Einiges in Berbersprache geschrieben u. selbst in Algier gedruckt worden ist. Die verschiedenen Dialekte sind nie lexikalisch, nur sehr wenig grammatisch verschieden. Am bekanntesten unter ihnen ist der der Kabylen in Algier. Grammatik u. Wörterbuch der L…
alternative label: Mzabite
in scheme: travel!digital Thesaurus
alt label: Mzabite
pref label: Mozabite

Mzabite
type: Label
isVariantOf: Mozabite
in scheme: travel!digital Thesaurus

Mozabite
type: Label
hasVariant: Mzabite
in scheme: travel!digital Thesaurus

Beni Ferah
type: Concept
pref label: Beni Ferah
in scheme: travel!digital Thesaurus
definition: bdk: Berbergruppe in Algerien

Beni Ferah
type: Label
in scheme: travel!digital Thesaurus

Beni Slimane
type: Concept
related match: Beni Slimane
in scheme: travel!digital Thesaurus
pref label: Beni Slimane
definition: bdk: Berbergruppe in Algerien

Beni Slimane
type: Label
in scheme: travel!digital Thesaurus

Touazine
type: Concept
pref label: Touazine
in scheme: travel!digital Thesaurus
definition: bdk: Berbergruppe in Tunesisen

Touazine
type: Label
in scheme: travel!digital Thesaurus

Schilluh
type: Concept
alternative label: Schluh
pref label: Schilluh
alt label: Schluh
in scheme: travel!digital Thesaurus
definition: bdk: Berbergruppe in Marokko | Meyers Großes Konversations-Lexikon 1909: Schlöch (Schloh, Schluh, Schellogh, Schillöchen), Gruppe der Berber (s. d.) in Marokko, mit besonderer Sprache; sie sind im Gegensatz zu den Rifberbern im ganzen friedfertig und Gewerbe und Handel zugeneigt; von dunklem Typus, bergen sie auch viele Mischelemente (mit Arabern und Negern). | Quelle: Meyers Großes Konversations-Lexikon, Band 17. Leipzig 1909, S. 871. | Permalink: http://www.zeno.org/nid/20007428421 | Brockhaus' Kleines Konversations-Lexikon 1911: Schilluh, Schluh, Berberstamm im südl. Marokko. | Quelle: Brockhaus' Kleines Konversations-Lexikon, fünfte Auflage, Band 2. Leipzig 1911., S. 633. | Permalink: http://www.zeno.org/nid/20001537474

Schilluh
type: Label
hasVariant: Schluh
in scheme: travel!digital Thesaurus

Schluh
type: Label
isVariantOf: Schilluh
in scheme: travel!digital Thesaurus

Ouled Naïl
type: Concept
pref label: Ouled Naïl
in scheme: travel!digital Thesaurus
definition: bdk: Berbergruppe in Algerien

Ouled Naïl
type: Label
in scheme: travel!digital Thesaurus

Beni Meraï
type: Concept
in scheme: travel!digital Thesaurus
pref label: Beni Meraï
definition: bdk: Berbergruppe in Algerien

Beni Meraï
type: Label
in scheme: travel!digital Thesaurus

Beni Hassain
type: Concept
pref label: Beni Hassain
in scheme: travel!digital Thesaurus
definition: bdk: Berbergruppe in Algerien

Beni Hassain
type: Label
in scheme: travel!digital Thesaurus

Beni Bou Aïssi
type: Concept
related match: Béni-Aïssi
pref label: Beni Bou Aïssi
in scheme: travel!digital Thesaurus
definition: bdk: Berbergruppe in Algerien

Beni Bou Aïssi
type: Label
in scheme: travel!digital Thesaurus

Bejaoua
type: Concept
pref label: Bejaoua
in scheme: travel!digital Thesaurus
definition: bdk: Berbergruppe in Tunesien

Bejaoua
type: Label
in scheme: travel!digital Thesaurus

Amasîgen
type: Concept
definition: bdk: Berbergruppe in Marokko | Meyers Großes Konversations-Lexikon 1905: Amazirghen (Imazirhen), Volk, s. Marokko. | Quelle: Meyers Großes Konversations-Lexikon, Band 1. Leipzig 1905, S. 410. | Permalink: http://www.zeno.org/nid/20006220649
pref label: Amasîgen
in scheme: travel!digital Thesaurus

Amasîgen
type: Label
in scheme: travel!digital Thesaurus

Beni Mansour
type: Concept
in scheme: travel!digital Thesaurus
related match: Maqil
pref label: Beni Mansour
definition: bdk: Berbergruppe in Algerien

Beni Mansour
type: Label
in scheme: travel!digital Thesaurus

Saiân
type: Concept
definition: bdk: Berbergruppe in Marokko
pref label: Saiân
in scheme: travel!digital Thesaurus

Saiân
type: Label
in scheme: travel!digital Thesaurus

Souassistamm
type: Concept
related: Stamm
in scheme: travel!digital Thesaurus
pref label: Souassistamm
definition: bdk: Berbergruppe in Tunesien

Souassistamm
type: Label
in scheme: travel!digital Thesaurus

Berâber
type: Concept
in scheme: travel!digital Thesaurus
pref label: Berâber
definition: bdk: Berbergruppe in Marokko

Berâber
type: Label
in scheme: travel!digital Thesaurus

Fraichich
type: Concept
alternative label: Frexes
pref label: Fraichich
in scheme: travel!digital Thesaurus
alt label: Frexes
definition: bdk: Berbergruppe in Tunesien

Fraichich
type: Label
in scheme: travel!digital Thesaurus

Frexes
type: Label
in scheme: travel!digital Thesaurus

Beni Abbes
type: Concept
related match: Béni Abbès
pref label: Beni Abbes
in scheme: travel!digital Thesaurus
definition: bdk: Berbergruppe in Algerien

Beni Abbes
type: Label
in scheme: travel!digital Thesaurus

Beni Chougrane
type: Concept
related match: Beni-Chougrane
pref label: Beni Chougrane
in scheme: travel!digital Thesaurus
definition: bdk: Berbergruppe in Algerien

Beni Chougrane
type: Label
in scheme: travel!digital Thesaurus

Mogod
type: Concept
pref label: Mogod
in scheme: travel!digital Thesaurus
definition: bdk: Berbergruppe in Tunesien

Mogod
type: Label
in scheme: travel!digital Thesaurus

Oulad Sidi-Abid
type: Concept
in scheme: travel!digital Thesaurus
pref label: Oulad Sidi-Abid
definition: bdk: Berbergruppe in Tunesien

Oulad Sidi-Abid
type: Label
in scheme: travel!digital Thesaurus

Berberstamm
type: Label
in scheme: travel!digital Thesaurus

Ouled Sidi-Cheîk
type: Concept
pref label: Ouled Sidi-Cheîk
in scheme: travel!digital Thesaurus
definition: bdk: Berbergruppe in Algerien

Ouled Sidi-Cheîk
type: Label
in scheme: travel!digital Thesaurus

Accara
type: Concept
in scheme: travel!digital Thesaurus
pref label: Accara
definition: bdk: Berbergruppe in Tunesien

Accara
type: Label
in scheme: travel!digital Thesaurus

Beni Mekla
type: Concept
related match: Mekla
in scheme: travel!digital Thesaurus
pref label: Beni Mekla
definition: bdk: Berbergruppe in Algerien

Beni Mekla
type: Label
in scheme: travel!digital Thesaurus

Berber
type: Label
in scheme: travel!digital Thesaurus

Auresberber
type: Concept
related match: Chaoui people
in scheme: travel!digital Thesaurus
pref label: Auresberber
definition: bdk: Berbergruppe in Algerien

Auresberber
type: Label
in scheme: travel!digital Thesaurus

Rîfberber
type: Concept
pref label: Rîfberber
in scheme: travel!digital Thesaurus
definition: bdk: Berbergruppe in Marokko

Rîfberber
type: Label
in scheme: travel!digital Thesaurus

Bettioua
type: Concept
in scheme: travel!digital Thesaurus
pref label: Bettioua
definition: bdk: Berbergruppe in Algerien

Bettioua
type: Label
in scheme: travel!digital Thesaurus

Khezour
type: Concept
definition: bdk: Berbergruppe in Tunesien
pref label: Khezour
in scheme: travel!digital Thesaurus

Khezour
type: Label
in scheme: travel!digital Thesaurus

Beni Smart
type: Concept
in scheme: travel!digital Thesaurus
pref label: Beni Smart
definition: bdk: Berbergruppe in Algerien

Beni Smart
type: Label
in scheme: travel!digital Thesaurus

Oaderna
type: Concept
in scheme: travel!digital Thesaurus
pref label: Oaderna
definition: bdk: Berbergruppe in Tunesisen

Oaderna
type: Label
in scheme: travel!digital Thesaurus

Beni Mezghanna
type: Concept
in scheme: travel!digital Thesaurus
pref label: Beni Mezghanna
definition: bdk: Berbergruppe in Algerien

Beni Mezghanna
type: Label
in scheme: travel!digital Thesaurus

vorgriechisch
type: Concept
related: griechisch
pref label: vorgriechisch
in scheme: travel!digital Thesaurus
definition: bdk: siehe griechisch

vorgriechisch
type: Label
in scheme: travel!digital Thesaurus

Bischer
type: Concept
definition: bdk: arabische Stammesgemeinschaft in Syrien
related: Beduine
in scheme: travel!digital Thesaurus
pref label: Bischer

Bischer
type: Label
in scheme: travel!digital Thesaurus

Taʿâmire
type: Concept
definition: bdk: arabische Stammesgemeinschaft in Syrien
related: Beduine
alt label: Taʿâmire-Beduine
pref label: Taʿâmire
alternative label: Taʿâmire-Beduine
in scheme: travel!digital Thesaurus

Taʿâmire-Beduine
type: Label
in scheme: travel!digital Thesaurus

Taʿâmire
type: Label
in scheme: travel!digital Thesaurus

Georgier
type: Concept
pref label: Georgier
in scheme: travel!digital Thesaurus
definition: Duden: Einwohnerbezeichnung | [Anm.: unvollständig: Einwohnerbezeichnung zu Georgien] | Duden: Georgien: Staat in Transkaukasien | Meyers Großes Konversations-Lexikon 1907: Georgĭer (von den Russen Grusiner genannt), kaukasischer Stamm in Transkaukasien, nennt sich selbst Karthweli oder Karthli (nach dem Stammvater Karthlos), wohnt fast ausschließlich in den Gouv. Tiflis und Kutaïs und zerfällt in Ost- und Westgrusiner. Zu den erstern gehören die eigentlichen Grusiner (1885: 381,208), die Tuschen, Pschawen, Chewsuren (s.d.), Mtiuletiner und Ingiloier, zusammen (1886) 413,598 Köpfe, zu den zweiten die Imerethier[614] (423,199), Gurier und Adscharen, zusammen 558,810 Köpfe, dazu 214,811 Mingrelier (s. Mingrelien) und Lasen und 14,035 Swaneten (s.d.), so daß die Gesamtzahl aller G. 1,201,254 Köpfe beträgt. Ursprünglich der Lehre Zoroasters anhängend, bekennen sich die G. jetzt zur griechisch-katholischen Kirche. Sie sind groß, schlank, kräftig, haben schöne Gesichtszüge mit dunkeln Augen und dunkles, lockiges Haar. Die Tracht der Männer besteht aus einem bis zum Knie reichenden Rock mit langen, geschlitzten Ärmeln, einer Ärmelweste, weiten Beinkleidern in den Stiefeln und spitzer Lammfellmütze. An Stelle der letztern tragen die Imerethier und Gurier eine tellerartige, farbige, mit Goldschnur besetzte und unter dem Kinn festgebundene Mütze, dazu lange, nicht weite Beinkleider, kurze Ärmelweste und darüber eine Jacke mit vielen Knöpfen. Die Frauen (s. Tafel »Asiatische Völker II«, Fig. 7), sonst europäisch gekleidet, hüllen sich beim Ausgehen in einen Schleier (Tschadra) und setzen dazu ein kleines goldgesticktes Samtmützchen auf. In der Jugend meist sehr schön, verblühen sie ungemein schnell. Voll Selbstgefühl, Ehr-, Ruhm- und Prunksucht, arbeitet der G. nur, um sich seinen Unterhalt zu verschaffen; die übrige Zeit widmet er der Jagd, Ringkämpfen, Tanz etc. Während die Bauern oft noch Erdhütten bewohnen, sind die Häuser in den Städten von Ziegeln oder von Stein mit plat…

Georgier
type: Label
in scheme: travel!digital Thesaurus

Avare
type: Concept
definition: Duden: Angehöriger eines untergegangenen türkisch-mongolischen Steppennomadenvolkes | Meyers Großes Konversations-Lexikon 1905: Avaren (Awaren; sinisch: Šo šo oder Žu žu, pers.: Âbas oder Awar), tatar. Volk, das 400 die Uiguren, 402 die westlichen Hunnen, dann die hunnischen Sabiren am Irtisch besiegte und um 460 unter dem Namen Ogoren am Don und am Asowschen Meer wohnte. Als diese von den Türken bedrängt wurden, zog der Rest, der seitdem A. hieß, nach dem Kaukasus und bot 557 dem Kaiser Justinian seine Dienste an; dieser trug ihnen auf, die Slawen und Bulgaren an der untern Donau zu bekriegen. Nachdem sie diese unterworfen hatten, siedelten sie sich unter ihrem »Chagan« (Zerspalter) in Pannonien an, halfen den Langobarden 566 das Gepidenreich zertrümmern und verbreiteten sich unter Bajan über das Donaugebiet von den Alpen bis zum Schwarzen Meer. Das Land zerfiel in sieben Hagane, denen in »Ringen« wohnende Tarchane unter der Oberhoheit des Chagans vorstanden; der einflußreiche Oberpriester hieß Bokal Abras. Den Byzantinern (seit 575), den Franken (571 und 596) und den Langobarden (seit 610) fiel das räuberische Nachbarvolk höchst beschwerlich;[195] während des letzten byzantinisch-persischen Krieges plünderte es im Juni 619 die Vorstädte von Konstantinopel und umlagerte 29. Juni bis 3. Aug. 624 die Hauptstadt. Nach Bajans Tode (630) ausgebrochene Unruhen erleichterten zwar den Bulgaren 635 die Wiedererlangung der Selbständigkeit, nachdem bereits die Tschechen und Moraver (Mährer) unter dem Franken Samo, dann auch die Sorben unter Der van und andre slawische Stämme sich befreit hatten. Dennoch suchten die A. noch im 8. Jahrh. Italien und Deutschland wiederholt durch Plünderungen heim. Erst Karl d. Gr. drang in das Gebiet der A., die den aufständischer Tassilo von Bayern unterstützt hatten, 790 bis zur Raab vor; sein Sohn Pippin stürmte 796 den Hauptring zwischen Donau und Theiß und erbeutete an Schätzen, was die A. seit 300 Jahren den Griechen abgenommen hatten. Ihr…
pref label: Avare
in scheme: travel!digital Thesaurus
related: Nomade

Avare
type: Label
in scheme: travel!digital Thesaurus

armenisch
type: Concept
alt label: alt-armenisch
pref label: armenisch
in scheme: travel!digital Thesaurus
related: Armenier
alternative label: alt-armenisch
definition: Duden: 1. Armenien, die Armenier betreffend; von den Armeniern stammend, zu ihnen gehörend | [Anm.: unvollständig: Armenien, die Armenier betreffend; von den Armeniern stammend, zu ihnen gehörend; in Armenien gelegen]
narrower: armenisch-katholisch

alt-armenisch
type: Label
in scheme: travel!digital Thesaurus

armenisch
type: Label
in scheme: travel!digital Thesaurus

Armenier
type: Concept
definition: Duden: Einwohnerbezeichnung | [Anm.: unvollständig: Einwohnerbezeichnung zu Armenien] | Duden: Armenien: Staat in Vorderasien | Meyers Großes Konversations-Lexikon 1905: Armenĭen, Land in Vorderasien (s. Karte »Kaukasien«), das bis ins Mittelalter zeitweise unter eignen Königen stand, dann seine politische Selbständigkeit verlor und gegenwärtig unter Rußland, die Türkei und Persien geteilt ist. Es umfaßt das Gebiet zwischen Kleinasien im W., der Tiefebene des Aras und Kur im O., dem Kaukasus im N. und den Gebirgen südlich des Murad im S. und bildet in diesem Umfang ein in sich geschlossenes Naturganzes: eine mächtige, die umgebenden Länder überragende Hochlands masse mit seit alters einheitlicher Bevölkerung. Das Innere nehmen 800–2000 m ü. M. gelegene, weidereiche Hochebenen ein, auf denen sich isolierte, bis über 5000 m hohe Kegelberge, meist alte Krater, und lange Gebirgsketten erheben. Unter letztern ist die vom Ararat bis zum Zusammenfluß der beiden Quellflüsse des Euphrat sich erstreckende vielnamige Kette die bedeutendste; sie teilt das Land in eine südliche und eine nördliche Hälfte. In der südlichen liegt die Talebene des Murad Su oder östlichen Euphrat, bei Musch etwa 1400 m hoch; in der nördlichen sind die Hochebenen von Bajezid, Erzerum (1860 m), Kars, Achalzych und Eriwan (985 m). Der Hochebene von Eriwan sind ausgesetzt: der Große Ararat (5156 m), der Kleine Ararat (4030 m) und der Alagöz (4180 m). Die Ränder des Hochlandes fallen gegen N. und S. jäh in tiefer liegende Landschaften ab, während der Übergang im W. zum kleinasiatischen, im O. zum iranischen Hochland unmerklich ist. Zwischen dem Nordabfall und dem vom armenischen Taurus gebildeten Südrande steigen mehrere Berggruppen zu mehr als 3000 man, z. B. Bingöl Dagh (3925 m), Palandöken (3150 m), Sipan Dagh (3800 m), Ala Dagh (3520 m). Südlich vom Taurus folgt eine breite Längenstufe, in welcher der Tigris in der Tal ebene von Diarbekr nach O., weiter westlich auch der Euphrat auf eine Strecke nach …
in scheme: travel!digital Thesaurus
pref label: Armenier
related match: Armenia

Armenier
type: Label
in scheme: travel!digital Thesaurus

armenisch-katholisch
type: Concept
pref label: armenisch-katholisch
in scheme: travel!digital Thesaurus
definition: bdk: siehe armenisch, katholisch

armenisch-katholisch
type: Label
in scheme: travel!digital Thesaurus

schottisch
type: Concept
pref label: scotch
definition: Duden: 1. Schottland, die Schotten betreffend; von den Schotten stammend, zu ihnen gehörend | [Anm.: unvollständig: Schottland, die Schotten betreffend; von den Schotten stammend, zu ihnen gehörend; in Schottland gelegen]
narrower: schottisch-irisch
in scheme: travel!digital Thesaurus
pref label: schottisch
related: Schotte
preferred label: scotch @en

scotch
type: Label
isTranslationOf: schottisch
in scheme: travel!digital Thesaurus

schottisch
type: Label
hasTranslation: scotch
in scheme: travel!digital Thesaurus

schottisch-irisch
type: Concept
definition: bdk: siehe schottisch, irisch
pref label: schottisch-irisch
in scheme: travel!digital Thesaurus

schottisch-irisch
type: Label
in scheme: travel!digital Thesaurus

Schotte
type: Concept
definition: Duden: Einwohnerbezeichnung zu Schottland | Duden: Schottland: Teil von Großbritannien | siehe auch: Meyers Großes Konversations-Lexikon 1909: Schottland | Quelle: Meyers Großes Konversations-Lexikon, Band 18. Leipzig 1909, S. 16-25. | Permalink: http://www.zeno.org/nid/20007437145
in scheme: travel!digital Thesaurus
pref label: Schotte
related match: Scotland

Schotte
type: Label
in scheme: travel!digital Thesaurus

Susiter
type: Concept
definition: bdk: kanaanitischer Stamm
related: Kanaʿaniter
alt label: Samsummiter
pref label: Susiter
alternative label: Samsummiter
in scheme: travel!digital Thesaurus

Samsummiter
type: Label
in scheme: travel!digital Thesaurus

Susiter
type: Label
in scheme: travel!digital Thesaurus

Schweizerin
type: Concept
definition: Duden: weibliche Form zu Schweizer (1, 2)
pref label: Schweizerin
in scheme: travel!digital Thesaurus
related: Schweizer

Schweizerin
type: Label
in scheme: travel!digital Thesaurus

israelitisch
type: Concept
pref label: israelitisch
preferred label: israélitique @fr
related: jüdisch
definition: Duden: die Israeliten betreffend, jüdisch | [Anm.: unvollständig: die Israeliten betreffend; von den Israeliten stammend, zu ihnen gehörend]
pref label: israélitique
in scheme: travel!digital Thesaurus
related: Israelit

israelitisch
type: Label
hasTranslation: israélitique
in scheme: travel!digital Thesaurus

israélitique
type: Label
isTranslationOf: israelitisch
in scheme: travel!digital Thesaurus

jüdisch
type: Concept
in scheme: travel!digital Thesaurus
alternative label: mosaisch
narrower: griechisch-römisch-jüdisch
alternative label: altjüdisch
alt label: altjüdisch
pref label: jüdisch
alt label: mosaisch
definition: Duden: 1. die Juden, das Judentum betreffend | 2. für die Juden charakteristisch; das Judentum betreffend | 3. die Juden, den Judaismus betreffend
related: Jude
related: semitisch
narrower: nationaljüdisch
narrower: mohammedanisch-jüdisch
narrower: spanisch-jüdisch
related: Judentum
narrower: römisch-jüdisch

altjüdisch
type: Label
in scheme: travel!digital Thesaurus

jüdisch
type: Label
in scheme: travel!digital Thesaurus

mosaisch
type: Label
in scheme: travel!digital Thesaurus

semitisch
type: Concept
in scheme: travel!digital Thesaurus
related: Semit
pref label: semitisch
definition: Duden: die Semiten betreffend, zu ihnen gehörend | [Anm.: unvollständig: die Semiten betreffend; von den Semiten stammend, zu ihnen gehörend]

Semit
type: Concept
definition: Duden: Angehöriger einer sprachlich und anthropologisch verwandten Gruppe von Völkern besonders in Vorderasien und Nordafrika | Meyers Großes Konversations-Lexikon 1909: Semiten. Mit diesem biblischen Namen (s. Sem) werden in neuern Werken über Völkerkunde diejenigen Völker des Altertums und der Neuzeit bezeichnet, bei denen die nahe untereinander verwandten semitischen Sprachen heimisch sind (s. die »Sprachenkarte«). Dieser wichtige Sprachstamm läßt sich in eine nord- und eine südsemitische Abteilung zerlegen. Zu dec fast erloschenen nördlichen Abteilung gehören die erst in neuerer Zeit durch die Entdeckung und Entzifferung der Keilinschriften aus Licht gezogenen Schwesterdialekte von Assyrien und Babylonien, das Hebräisch-Kanaanitische (d. h. das Hebräische mit dem Moabitischen, dem Phönikischen und dem Punischen der Karthager), endlich das Aramäische, ursprünglich die Sprache der semitischen Bergvölker, die sich als Handelssprache früh beinahe über ganz Vorderasien verbreitete und etwa vom 8. Jahrh. v. Chr. ab nach und nach alle vorgenannten Sprachen verdrängte. Zum Aramäischen gehören die Dialekte der Inschriften von Sendschîrli (8. Jahrh. v. Chr.) und von Nérab (7. Jahrh. v. Chr.), die irrigerweise früher als Chaldäisch bezeichnete Sprache der nichthebräischen Teile des Esra- und des Danielbuches im Alten Testament und der jüdischen Targume, das Samaritanische, das Palmyrenische, das Nabatäische, das Syrische, der Dialekt des babylonischen Talmuds, das Mandäische u. a. (s. Aramäische Sprachen). Von allen nordsemitischen Sprachen sind heutzutage nur noch einige verderbte (aramäische) Volksdialekte der Nestorianer und Jakobiten und das Neuhebräische übrig, eine modernisierte Form des Hebräischen, die von den Juden teilweise als Schriftsprache gebraucht wird. Das Gebiet der nordsemitischen Sprachen wird jetzt größtenteils durch das Arabische eingenommen, die wichtigste Sprache der südlichen Abteilung, die in eine Fülle von untereinander ziemlich verwandten Mundart…
in scheme: travel!digital Thesaurus
pref label: Semit

Semit
type: Label
in scheme: travel!digital Thesaurus

semitisch
type: Label
in scheme: travel!digital Thesaurus

nationaljüdisch
type: Concept
in scheme: travel!digital Thesaurus
pref label: nationaljüdisch
definition: bdk: siehe jüdisch | Duden: national: 1. eine Nation betreffend; zur Nation gehörend | 2. überwiegend die Interessen der eigenen Nation vertretend; patriotisch gesinnt

nationaljüdisch
type: Label
in scheme: travel!digital Thesaurus

mohammedanisch-jüdisch
type: Concept
definition: bdk: moslemisch, jüdisch
in scheme: travel!digital Thesaurus
pref label: mohammedanisch-jüdisch

mohammedanisch-jüdisch
type: Label
in scheme: travel!digital Thesaurus

römisch-jüdisch
type: Concept
definition: bdk: siehe römisch, jüdisch
in scheme: travel!digital Thesaurus
pref label: römisch-jüdisch

römisch-jüdisch
type: Label
in scheme: travel!digital Thesaurus

Penobscot-Indianer
type: Concept
definition: Pierer's Universal-Lexikon 1857: Algonkīner (Algonkinen, Algonquins), eine weitverbreitete Völkergruppe der Indianer in Nordamerika, deren angehörende Stämme od. Völker, deren 26 größere gezählt wurden, einst vom Mississippi bis südlich von der Chesapeakbai u. im Innern bis zum Cumberlandflusse u. an den Mississippi reichte; Labrador, Neu-Schottland u. Neu-Braunschweig, ein großer Theil von Canada, des Gebiets der Hudsonsbaigesellschaft u. der Vereinigten Staaten war einst od. ist noch von A-n bewohnt. Diese große Gruppe wird eingetheilt: A) östliche A.: a) Scheschatapusch u. Scoffies, an der Nordküste des St. Lorenzbusens; b) Mikmaks in Neu-Schottland u. der Westküste u. den Zuflüssen des St. Lorenzbusens; jetzt noch Reste auf Neufundland; c) Etschemins od. Canoemen, am St. John u. zwischen diesem u. dem Penobscott; d) Abenakis, am Kennebec u. Androscoggin. B) A. am Atlantischen Meere: a) Massachusetts, Narragansetts u. Mohikaner, vom Sako bis zum Hudson; alle drei waren sehr nahe mit einander sprachverwandt; die Narragansetts in Connecticut u. Rhode Island galten für die am meisten civilisirten unter den A-n; zu den Mohikanern gehörten die Pequods im östlichen Theile von Connecticut u. einem Theile von Long Island; b) Montaks, auf Long Island; c) Minsi u. Delawaren bildeten früher eine Nation, zwischen Hudson u. Susquehanna, in Neu-Jersey, den Delaware aufwärts bis zu dessen Quellen im Thalbecken des Schuylkill; d) Nanticokes, an der Ostküste der Chesapeakbai, mit den Acçomac; e) Susquehannoks, am Susquehanna; f) Powhattans, in Virginien; g) Pamlicoes, in Nordcarolina südlich bis zum Cap Hatteras, u. die Coramines, im Süden des Neuse, bis zum Cap Fear, der Südgrenze der algonkinischen Sprachen. C) Nördliche A.: a) Knistinos od. Krihks (Creeks), im Süden der Athabaskas, von der Hudsonsbai bis zu den Quellen des Mississtppi; b) Montagnards, am St. Lorenz, von Montreal bis zur Mündung; c) Ottáwas, früher an dem gleichnamigen Flusse in Canada, später in Michigan; d) O…
in scheme: travel!digital Thesaurus
related: Indianer
pref label: Penobscot-Indianer

Penobscot-Indianer
type: Label
in scheme: travel!digital Thesaurus

Choctaw
type: Concept
definition: Meyers Großes Konversations-Lexikon 1909: Tschokta (Choctaw, Chacta), Indianerstamm in Nordamerika, der früher am untern Mississippi wohnte, seit 1837 aber im Indianerterritorium angesiedelt ist. Die T. bilden mit den Muskogi (s. Krik) einen eignen Sprachstamm, zu dem auch die Tschikasa, Krik und Seminolen gehören. Wie diese zählen sie zu den fünf zivilisierten Nationen; sie treiben Ackerbau, Viehzucht und die wichtigsten Handwerke, haben eine Verfassung, die derjenigen der Union nachgebildet ist, mit einem Gesetzgebenden Rat von 40 Mitgliedern und einem Gouverneur. Von der Regierung erhalten sie für die abgetretenen Ländereien ein Jahrgeld von 36,000 Dollar, wovon unter anderm 36 Schulen unterhalten werden. Ihre Zahl betrug 1890: 9996 Köpfe. Eine Grammatik ihrer Sprache schrieb Byington (Philadelphia 1870), ein Wörterbuch Wright (engl., St. Louis 1880). | Quelle: Meyers Großes Konversations-Lexikon, Band 19. Leipzig 1909, S. 780. | Permalink: http://www.zeno.org/nid/20007612494
in scheme: travel!digital Thesaurus
related: Indianer
pref label: Choctaw

Choctaw
type: Label
in scheme: travel!digital Thesaurus

italienisch
type: Concept
definition: Duden: 1. Italien, die Italiener betreffend; von den Italienern stammend, zu ihnen gehörend | [Anm.: unvollständig: Italien, die Italiener betreffend; von den Italienern stammend, zu ihnen gehörend; in Italien gelegen]
narrower: mittellitalienisch
pref label: italiano
related: Italiener
preferred label: italyâni @ar
pref label: italienisch
narrower: italienisch-gotisch
in scheme: travel!digital Thesaurus
narrower: oberitalienisch
pref label: italian
preferred label: italian @en
pref label: italyâni
preferred label: italiano @it

mittellitalienisch
type: Concept
pref label: mittellitalienisch
in scheme: travel!digital Thesaurus
definition: bdk: siehe italienisch

mittellitalienisch
type: Label
in scheme: travel!digital Thesaurus

italiano
type: Label
isTranslationOf: italienisch
in scheme: travel!digital Thesaurus
hasTranslation: italian
hasTranslation: italyâni

italienisch
type: Label
hasTranslation: italiano
hasTranslation: italian
in scheme: travel!digital Thesaurus
hasTranslation: italyâni

italian
type: Label
isTranslationOf: italienisch
in scheme: travel!digital Thesaurus
hasTranslation: italiano
hasTranslation: italyâni

italyâni
type: Label
in scheme: travel!digital Thesaurus
isTranslationOf: italienisch
hasTranslation: italian
hasTranslation: italiano

Italiener
type: Concept
definition: Duden: Einwohnerbezeichnung | [Anm.: unvollständig: Einwohnerbezeichnung zu Italien] | Duden: Italien: Staat in Südeuropa | siehe auch: Meyers Großes Konversations-Lexikon 1907: Italĭen | Quelle: Meyers Großes Konversations-Lexikon, Band 10. Leipzig 1907, S. 70-98. | Permalink: http://www.zeno.org/nid/2000683227X
in scheme: travel!digital Thesaurus
pref label: Italiener
narrower: Süditaliener
related match: Italy

Italiener
type: Label
in scheme: travel!digital Thesaurus

Süditaliener
type: Concept
in scheme: travel!digital Thesaurus
pref label: Süditaliener
definition: bdk: siehe Italiener

Süditaliener
type: Label
in scheme: travel!digital Thesaurus

italienisch-gotisch
type: Concept
related match: Gothic art
in scheme: travel!digital Thesaurus
pref label: italienisch-gotisch
definition: bdk: siehe italienisch | Duden: gotisch: 2. a. die Gotik betreffend, zu ihr gehörend | b. für die Gotik typisch; an die Gotik erinnernd | Duden: Gotik: europäische Stilepoche (von der Mitte des 12. bis zum Ende des 15. Jahrhunderts) in [Sakral]architektur (mit Rippengewölben, Spitzbogen, Strebewerk, Maßwerk), [Architektur]plastik sowie Tafel- und Buchmalerei

italienisch-gotisch
type: Label
in scheme: travel!digital Thesaurus

oberitalienisch
type: Concept
in scheme: travel!digital Thesaurus
definition: bdk: siehe italienisch
pref label: oberitalienisch

oberitalienisch
type: Label
in scheme: travel!digital Thesaurus

afghanisch
type: Concept
preferred label: afghan @en
in scheme: travel!digital Thesaurus
related: Afghane
pref label: afghanisch
pref label: afghan
definition: Duden: Afghanistan, die Afghanen betreffend | [Anm.: unvollständig: Afghanistan, die Afghanen betreffend; von den Afghanen stammend, zu ihnen gehörend; in Afghanisthan gelegen]

Afghane
type: Concept
definition: Duden: 1. Einwohnerbezeichnung zu Afghanistan | Duden: Afghanistan: Staat in Vorderasien | Meyers Großes Konversations-Lexikon 1905: Afghanistan (Drangiana und Ariana der Alten, von den Eingebornen Urlajat, »Stammland«, genannt; s. die Karten »Zentralasien« und »Persien«), das nordöstliche Iran zwischen Indien, Belutschistan, Bochara und Persien. Das durch die Stellung der afghanisch-indischen Grenzgebiete unter britische Verwaltung und eine Verschiebung der Nordwestgrenze zu gunsten Rußlands auf 624,000 qkm beschränkte Gebiet liegt zwischen 30–37°45´ nördl. Br. und 61–72° östl. L. A. ist reich an Altertümern aus griechischer und buddhistischer Zeit (Kabultal, Tal von Peschawar, Bamian). [...] | Die Bevölkerung soll 4,550,000 Köpfe betragen. Sie gehört zur großen iranischen Völkerfamilie und besteht aus einer Anzahl von Völkern, vereinigt durch den Islam und die politischen Erfolge im 18. Jahrh. Die Afghanen sind nach ihrer Überlieferung Einwanderer aus Syrien, wohnten zuerst im W., zogen im 7. Jahrh. n. Chr. ostwärts und haben heute Kandahar und die hier einmündenden Täler zu Hauptsitzen. Sie nennen sich selbst Paschtun (Mehrzahl Paschtauch) und scheiden sich in eine westliche, östliche und indische Abteilung. Die letzte gehört ganz, die zweite zum Teil zu Britisch-Indien. Von den zahlreichen Stämmen ist der der 800,000 Köpfe zählenden Durani, besonders zwischen Herat und Kandahar, der herrschende, seitdem Achmed Schah 1747 aus diesem damals Abdali genannten Stamme sich zum Herrscher unter dem Titel Duri-Duran (»Perle des Jahrhunderts«) aufwarf. Noch stärker, nach andern nur 600,000 Köpfe, sollen die Ghilzai sein, die das Hochplateau nördlich von Kandahar einnehmen, östlich zur Suleimankette und nordwärts zum Kabul sich erstrecken. In ihrem Gebiet ziehen die Nasir umher, wahrscheinlich eingewanderte Belutschen. Die Jusufzai (700,000 Köpfe) bewohnen ein großes Gebiet nördlich von Peschawar. Fast ganz unter britischer Botmäßigkeit stehen die Kakar (200,000), Khattak …
related match: Pashtuns
related match: Afghanistan
in scheme: travel!digital Thesaurus
pref label: Afghane

Afghane
type: Label
in scheme: travel!digital Thesaurus

afghanisch
type: Label
hasTranslation: afghan
in scheme: travel!digital Thesaurus

afghan
type: Label
isTranslationOf: afghanisch
in scheme: travel!digital Thesaurus

Rephaiter
type: Concept
pref label: Rephaiter
alt label: Rephâim
related: Kanaʿaniter
alternative label: Rephâim
in scheme: travel!digital Thesaurus
definition: bdk: kanaanitischer Stamm | Pierer's Universal-Lexikon 1861: Phönikien (Phönīke, Phoenicia, Kanaan) [...] Den Namen Phönikien leiteten die Alten ab entweder von Phönix (s.d. 1), od. von dem griechischen φοίνιξ, d. i. der Palmbaum od. der Purpur, ab, also Palmen- od. Purpurland. Die eigentlichen Phöniker (Kananiter, Zidonier) waren Aramäer od. Semiten u. zwar Kananiter u. sollten von den Küsten des Erythräischen Meeres, u. zwar aus Arabien od. Ägypten, od. von den Küsten des Persischen Meerbusens, od. auch von den sumpfigen Ufern des Euphrat, u. zwar lange vor den Israeliten, hier eingewandert sein. Vor ihnen wohnten die Riesenvölker der Rephaiter, Emiter, Enakiter, Aviter u.a. hier. [...] | Quelle: Pierer's Universal-Lexikon, Band 13. Altenburg 1861, S. 83-84. | Permalink: http://www.zeno.org/nid/2001063326X | Pierer's Universal-Lexikon 1862: Rephaim (Rephaiten), alte Riesenvölker jen- u. diesseit des Jordanlandes, bes. die zur Zeit Abrahams im Ostjordanlande bei Astaroth-Karnaim neben den Samsumim u. Emim hausenden Stämme, von denen noch zu Mosis Zeit ein Rest in Basan als Reich des Og erwähnt wird, welches von den Israeliten erobert u. dem Stamm Manasse zugetheilt wurde. Von den R., welche im Westen des Jordan saßen, war noch das Thal R. in der Gegend von Jerusalem genannt. | Quelle: Pierer's Universal-Lexikon, Band 14. Altenburg 1862, S. 50. | Permalink: http://www.zeno.org/nid/20010742298

Rephaiter
type: Label
in scheme: travel!digital Thesaurus

Rephâim
type: Label
in scheme: travel!digital Thesaurus

Mohégan
type: Concept
alt label: Mohikaner
in scheme: travel!digital Thesaurus
pref label: Mohégan
alternative label: Mohikaner
related: Indianer
definition: Duden: Mohikaner: Angehöriger eines nordamerikanischen Indianerstamms | Meyers Großes Konversations-Lexikon 1908: Mohikaner (Mohegan), jetzt ausgestorbener Indianerstamm der östlichen Algonkin, der zwischen dem Hudson und Connecticut wohnte und dem Fünfvölkerbunde der Lenni Lenape (s. Delawaren) angehörte. | Quelle: Meyers Großes Konversations-Lexikon, Band 14. Leipzig 1908, S. 20. | Permalink: http://www.zeno.org/nid/20007100728

Mohikaner
type: Label
in scheme: travel!digital Thesaurus

Mohégan
type: Label
in scheme: travel!digital Thesaurus

Tektosage
type: Concept
related: Galater
in scheme: travel!digital Thesaurus
pref label: Tektosage
definition: bdk: Teilstamm der Volker; siehe Galater | bdk: Volker: antikes keltisches Volk | Meyers Großes Konversations-Lexikon 1907: Tektosagen, Stamm der Galater (s. d.). | Quelle: Meyers Großes Konversations-Lexikon, Band 19. Leipzig 1909, S. 381. | Permalink: http://www.zeno.org/nid/20007569459

Tektosage
type: Label
in scheme: travel!digital Thesaurus

persisch
type: Concept
pref label: persisch
in scheme: travel!digital Thesaurus
narrower: persisch-indisch
definition: Duden: Persien, die Perser betreffend; von den Persern stammend, zu ihnen gehörend [Anm.: unvollständig: Persien, die Perser betreffend; von den Persern stammend, zu ihnen gehörend; in Persien gelegen]
alternative label: altpersisch
alt label: altpersisch
narrower: türkisch-persisch
narrower: persisch-schiitisch
related: Perser
alternative label: alt-persisch
alt label: alt-persisch

persisch
type: Label
in scheme: travel!digital Thesaurus

altpersisch
type: Label
isVariantOf: alt-persisch
in scheme: travel!digital Thesaurus

alt-persisch
type: Label
hasVariant: altpersisch
in scheme: travel!digital Thesaurus

persisch-schiitisch
type: Concept
definition: bdk: siehe persisch, Schiit | Duden: schiitisch: zur Schia gehörend, sie betreffend | [Anm.: Ergänzung: die Schiiten betreffend, von ihnen stammend, zu ihnen gehörend]
in scheme: travel!digital Thesaurus
pref label: persisch-schiitisch
related: Schiit

persisch-schiitisch
type: Label
in scheme: travel!digital Thesaurus

Schiit
type: Concept
related match: Shia Islam
alt label: Schiʿit
in scheme: travel!digital Thesaurus
related: Schiʿitismus
pref label: Schiit
definition: Duden: Anhänger der Schia | Duden: Schia: religiöse Gruppe des Islam, die allein Ali, den Schwiegersohn des Propheten Mohammed, sowie dessen Nachkommen als rechtmäßige Stellvertreter des Propheten anerkennt | Meyers Großes Konversations-Lexikon 1909: Schiiten, mohammedan. Sekte, die im Gegensatz zu den Sunniten Ali, den Schwiegersohn des Propheten, als den rechtmäßigen Nachfolger Mohammeds anerkennt. Ursprünglich ist die schî'at'Ali, »die Gefolgschaft Alis«, nichts als die Gesamtheit der Anhänger Alis im Bürgerkriege gegen Moâwija I.; nach Alis Tod ist es die legitimistische Partei, welche die herrschende Dynastie der Omaijaden verwirft und den Nachkommen Alis das Recht auf das Kalifat zuspricht. Trotz aller Verfolgung seitens der Herrschenden wuchs die Schi'a, zu der sich insbes. zahlreiche Perser hielten, denen das ihnen widerwärtige Arabertum in der Omaijadendynastie verkörpert war. Daher wirkten die S. mit den Abbasiden zum Sturze der Omaijaden zusammen; als aber das Ziel erreicht war, sahen die Aliden sich von den Abbasiden, wie früher von den Omaijaden, auf die Seite gedrängt. Unter neuen Verfolgungen wuchsen die Gegensätze; es bildeten sich unter dem Einfluß ostpersisch-buddhistischer Strömungen immer extremere Gruppen, welche die Verehrung Alis dahin steigerten, daß sie in ihm, wie in den zu seiner Nachfolge berechtigten Abkömmlingen, nicht bloß die wahren Imâme (Religions- und Gemeindehäupter), sondern geradezu Inkarnationen der Gottheit sahen (s. Ismaëliten, Karmaten, Drusen, Nossairier). Andre blieben gemäßigter, ließen aber doch auch die Verehrung Alis und der Aliden gegenüber der des Propheten Mohammed immer mehr in den Vordergrund treten. Die hauptsächlichste dieser gemäßigten Parteien ist die der sogen. Zwölfer, die von Ali an gerechnet zwölf Imâme annahmen, deren letzter die Abbasiden stürzen sollte. Da dies um die entsprechende Zeit (etwa 870) nicht geschah, so entstand der Glaube, der zwölfte Imâm Mohammed sei auf übernatürliche Weise verschwunden,…
alternative label: Schiʿit

Schiʿit
type: Label
in scheme: travel!digital Thesaurus
isTranslationOf: Schiit

Schiit
type: Label
in scheme: travel!digital Thesaurus
hasTranslation: Schiʿit

Perser
type: Concept
definition: Duden: 1. a. Einwohnerbezeichnung zu Persien; Iraner | b. Angehöriger einer Ethnie in Vorder- und Zentralasien, deren verbindendes Element die persische Sprache ist | Duden: Persien: alter Name von Iran | Meyers Großes Konversations-Lexikon 1908: Persĭen (hierzu die Karte »Persien«), im Lande selbst Iran genannt, vorderasiatische Monarchie, die größere Westhälfte des alten Ariana, im N. vom Fluß Aras, dem Kaspischen Meer, dem untern Atrek und dem Nordabhang des nördlichen Randgebirges von Chorasan bis Serachs, im S. vom Persischen Meerbusen und Arabischen Meer begrenzt, während es im W. in dem armenisch-kurdischen Hochgebirge an Türkisch-Kurdistan und Irak Arabi, im O. an Afghanistan und Belutschistan stößt. Der Flächenraum wird zu 1,645,000 qkm, die Bevölkerung (1902) auf 91/2 Mill. (s. unten, S. 610) geschätzt. [...] | Bevölkerung, Kultur. | Die Zahl der Bevölkerung Persiens läßt sich in Ermangelung einer eigentlichen Zählung nicht genau angeben; Houtum-Schindler schätzte 1881 folgendermaßen: [...] | (4,6 Menschen auf 1 qkm), doch werden neuerdings im ganzen 9,5 Mill. angenommen. Davon sind etwa 8 Mill. Schiiten, 800,000 Sunniten und mohammedanische Sektierer, 9000 Parsen, 35,000 Juden, 45,000 Armenier, 25,000 Nestorianer und Chaldäer. Diese Bewohner sind nach Abstammung, Sitte und Sprache außerordentlich verschieden (Perser, Turktataren, Turkmenen, Armenier, Nestorianer, Chaldäer, Juden, Kurden, Araber, Zigeuner, Neger, Afghanen, Belutschen, Hindu, etwa 1200 Europäer etc.). Die Mehrzahl besteht aus Tadschik, den seßhaften Ureingebornen oder Ureinwanderern, namentlich im NW., im S. und in den mittlern Provinzen. Daneben besteht ein Viertel oder ein Drittel der Bevölkerung aus eingewanderten Stämmen, die sich durch Gewohnheiten und Lebensweise von jenen unterscheiden. Sie heißen Ilijat (d.h. Familien) und bewohnen die Nordostgrenzen und die Gebirgsländer im NW., W. und SW. Einige leben stets unter Zelten, im Winter in den tiefern Ebenen (Kischlaks oder Winterquarti…
related match: Persian Empire
pref label: Perser
in scheme: travel!digital Thesaurus

Perser
type: Label
in scheme: travel!digital Thesaurus

nichtisraelitisch
type: Concept
pref label: nichtisraelitisch
definition: bdk: siehe israelitisch
in scheme: travel!digital Thesaurus
related: Nicht-Israelit

nichtisraelitisch
type: Label
in scheme: travel!digital Thesaurus

Oneida
type: Concept
alt label: Oneida-Indianer
definition: Meyers Großes Konversations-Lexikon 1908: Oneida, nordamerikan. Indianerstamm, der zum Bunde der Irokesen gehörte. In der Green Bay Agentur im Staate Wisconsin lebten 1890: 1716 Seelen. | Quelle: Meyers Großes Konversations-Lexikon, Band 15. Leipzig 1908, S. 62. | Permalink: http://www.zeno.org/nid/20007184328
in scheme: travel!digital Thesaurus
pref label: Oneida
related: Indianer
alternative label: Oneida-Indianer

Oneida-Indianer
type: Label
in scheme: travel!digital Thesaurus

Oneida
type: Label
in scheme: travel!digital Thesaurus

Emim
type: Concept
definition: bdk: kanaanitischer Stamm
related: Kanaʿaniter
in scheme: travel!digital Thesaurus
pref label: Emim

Emim
type: Label
in scheme: travel!digital Thesaurus

Afridistamm
type: Concept
definition: bdk: Stamm der Paschtunen in Süd- und Zentralasien | Duden: Paschtune: Angehöriger eines in Afghanistan und Pakistan ansässigen Volkes | Meyers Großes Konversations-Lexikon 1905: Afridi, mächtigstes Bergvolk Afghanistans, an der Nordwestgrenze von Britisch-Indien, im W. und SW. von Peschawar, das die wichtigen Pässe Chaiber und Kohat jahrhundertelang hielt und sich deren Überschreitung von Dschengis-Chan, Timur, Baber, Nadir Schah und den Briten erkaufen ließ, bis diese sie 1878 unterwarfen. Sie können über 5000 waffenfähige Männer stellen und nehmen jetzt auch in der britischindischen Grenzarmee Dienste. Beim Aufstande der Grenzvölker 1895–96 machten die A. den Engländern viel zu schaffen (s. Tschitral). | Quelle: Meyers Großes Konversations-Lexikon, Band 1. Leipzig 1905, S. 133. | Permalink: http://www.zeno.org/nid/20006198112
label: Afrididstamm
pref label: Afridistamm
in scheme: travel!digital Thesaurus
related: Stamm

Afridistamm
type: Label
in scheme: travel!digital Thesaurus

aquitanisch
type: Concept
definition: bdk: Aquitanien, die Aquitanier betreffend; von den Aquitaniern stammend, zu ihnen gehörend; in Aquitanien gelegen | Duden: Aquitanien: historische Landschaft in Südwestfrankreich | Meyers Großes Konversations-Lexikon 1905: Aquitanĭen, ursprünglich Name des südwestlichen Teiles von Gallien (s. Karte »Germanien etc.«), insbesondere des von iberischen Stämmen bewohnten Landes zwischen den Pyrenäen und der Garonne; dann (seit Augustus) Name einer römischen Provinz, die das Land von den Pyrenäen bis zum Liger (Loire) und vom Atlantischen Ozean bis zu den Cevennen umfaßte. Diese 275,300 qkm große, über ein Drittel des heutigen Frankreich umfassende Provinz ward im 4. Jahrh. wieder in drei zerteilt: 1) Aquitania prima, der nordöstliche Teil, mit den spätern Landschaften Berry, Bourbonnais, Auvergne, Velay, Gévaudan, Rouergue, Albigeois, Quercy und Marche; 2) A. secunda. der Nordwesten, mit der Hauptstadt Burdigala (Bordeaux) und den spätern Landschaften Bordelais, Poitou, Saintonge, Angoumois und dem westlichen Guyenne; 3) A. tertia oder Novempopulana, der südlichste Teil an den Pyrenäen, mit den spätern Landschaften Bigorre, Cominge, Armagnac, Béarn, Pays des Basques, Gascogne u.a. – Die ältesten Einwohner Aquitaniens waren Iberer, unter denen sich keltische Stämme, namentlich die Bituriger, niederließen. Den Römern wurde A. 57 v. Chr. durch Cäsars Legaten Crassus unterworfen. Das Land umfaßte damals bloß den südwestlichsten, überwiegend von Iberern bewohnten Teil Galliens (das spätere Vasconia oder Gascogne). Bei der neuen Provinzeinteilung unter Octavianus 37 v. Chr. wurde A. nach N. und O. bis zur Loire erweitert. In der Völkerwanderung ließen sich die Westgoten unter Ataulf in A. nieder und stifteten unter Wallia, Ataulfs Nachfolger, ein Reich mit der Hauptstadt Toulouse. Durch die Schlacht bei Voullon (507) ward mit ganz Südgallien auch A. ein Teil des fränkischen Reiches. Unter den Merowingern bildete A. ein nur dem Namen nach von dem Frankenreich abhängiges Herzog…
related match: Aquitaine
related match: Aquitani
pref label: aquitanisch
in scheme: travel!digital Thesaurus

aquitanisch
type: Label
in scheme: travel!digital Thesaurus

Mahratte
type: Concept
related match: Maratha Empire
pref label: Mahratte
in scheme: travel!digital Thesaurus
definition: Pierer's Universal-Lexikon 1860: Mahratten (Maharatten), ein indisches Volk, ursprünglich die Bewohner der altindischen Landschaft Maharashra im centralen Indien, von der sie ihren Namen haben, seit dem 16. Jahrh. aber über einen großen Theil des mittleren Vorderindien als herrschender Stamm verbreitet; hatten drei Jahrhunderte lang unter der Herrschaft der Muhammedaner gestanden, während welcher Zeit ihre Sprache arischen Stammes u. ihre brahmanische Religion fast die einzigen Momente waren, durch weichste sich von ihren Herren schieden u. unter einander verbanden. Erst um die Mitte des 17. Jahrh. tauchten sie Plötzlich in der Geschichte auf, als der kühne u. abenteuerliche Weise Sevajee das Mahrattische Reich begründete. Sevajee war der Sohn des Shahjee, welcher von seinem Vater Shalolee die Lehnsherrschaft Poona (zum Königreiche Ahmednagar gehörig) geerbt hatte, aber in die Dienste des Königs von Beejapoor getreten u. hier in den Besitz von Tanjore gelangt war. Da Shahjee letzteres Fürstenthum seinen übrigen Kindern hinterließ, wurde Sevajee in Poona unter der Aufsicht eines der Offiziere seines Vaters erzogen. Noch nicht 17 Jahre alt, sammelte er eine Bande um sich, kam zum Besitz der Herrschaft Poona u. vermehrte dieselbe, trotz der fortdauernden Kämpfe des Großmogul gegen ihn, durch Eroberungen der ganzen Küste von Goa bis Damaun u. weiter Strecken in Beejapur; um 1665 nahm er den Titel Radscha an, ließ sich 1674 nach altindischer Sitte zum König krönen u. führte das Sanskrit zur Bezeichnung der Ämter u. Würden statt des Persischen ein, wie denn überhaupt die Brahmanen an seinem Hofe die höchste Achtung genossen. 1673 zog er mit einem Heere nach Golconda, schloß ein Bündniß mit dem dortigen Könige, siel dann in Karnatik ein, behielt aber die bedeutenden Eroberungen, die er machte, für sich. In einem neuen Krieg, welchen er mit Aurengzeb u. dessen Perbündeten, dem Könige von Beejapur, führte, war »fast immer glücklich, starb aber 1680 noch vor Beendigung demsel…

Mahratte
type: Label
in scheme: travel!digital Thesaurus

schwedisch
type: Concept
definition: Duden: 1. Schweden, die Schweden betreffend; von den Schweden stammend, zu ihnen gehörend | [Anm.: unvollständig: Schweden, die Schweden betreffend; von den Schweden stammend, zu ihnen gehörend; in Schweden gelegen] | Duden: Schweden: Staat in Nordeuropa | siehe auch: Meyers Großes Konversations-Lexikon 1909: Schweden | Quelle: Meyers Großes Konversations-Lexikon, Band 18. Leipzig 1909, S. 130-146. | Permalink: http://www.zeno.org/nid/20007446799
in scheme: travel!digital Thesaurus
related match: Sweden
pref label: schwedisch

schwedisch
type: Label
in scheme: travel!digital Thesaurus

amerikanisch
type: Concept
pref label: américaine
preferred label: amerikâni @ar
definition: Duden: 1. a. Amerika, die Amerikaner betreffend | [Anm.: unvollständig: Amerika, die Amerikaner betreffend; von den Amerikanern stammend, zu ihnen gehörend; in Amerika gelegen]
narrower: canadisch-amerikanisch
pref label: amerikanisch
narrower: englisch-amerikanisch
narrower: spanisch-amerikanisch
narrower: hamburg-amerikanisch
narrower: südamerikanisch
in scheme: travel!digital Thesaurus
alt label: jungamerikanisch
narrower: niederländisch-amerikanisch
pref label: americana
preferred label: american @en
narrower: nordamerikanisch
narrower: centralamerikanisch
preferred label: americana @la
narrower: französisch-amerikanisch
narrower: deutsch-amerikanisch
preferred label: américaine @fr
alternative label: amelikâni @ar
pref label: american
narrower: hispano-amerikanisch
alternative label: jungamerikanisch
narrower: anglo-amerikanisch
related: Amerikaner
alt label: amelikâni
pref label: amerikâni

américaine
type: Label
hasTranslation: amerikâni
isTranslationOf: amerikanisch
in scheme: travel!digital Thesaurus
hasTranslation: americana
hasTranslation: american

amerikâni
type: Label
hasVariant: amelikâni
hasTranslation: américaine
hasTranslation: americana
hasTranslation: american
isVariantOf: amerikanisch
in scheme: travel!digital Thesaurus

amelikâni
type: Label
isVariantOf: amerikâni
in scheme: travel!digital Thesaurus

americana
type: Label
hasTranslation: amerikâni
isTranslationOf: amerikanisch
in scheme: travel!digital Thesaurus
hasTranslation: american
hasTranslation: américaine

amerikanisch
type: Label
hasTranslation: amerikâni
hasTranslation: americana
in scheme: travel!digital Thesaurus
hasTranslation: américaine
hasTranslation: american

american
type: Label
hasTranslation: amerikâni
isTranslationOf: amerikanisch
hasTranslation: americana
in scheme: travel!digital Thesaurus
hasTranslation: américaine

hamburg-amerikanisch
type: Concept
definition: bdk: siehe hamburger, amerikanisch
related: hamburger
in scheme: travel!digital Thesaurus
pref label: hamburg-amerikanisch

hamburger
type: Concept
related match: Hamburg
definition: bdk: Hamburg, die Hamburger betreffend; von den Hamburgern stammend, zu ihnen gehörend; in Hamburg gelegen | Duden: Hamburg: Stadt und deutsches Bundesland | Meyers Großes Konversations-Lexikon 1907: Hamburg (Freie und Hansestadt H.; hierzu die Karte »Umgebung von Hamburg«), Bundesstaat des Deutschen Reiches, an der untern Elbe, wird von den preußischen Provinzen Schleswig-Holstein und Hannover begrenzt. Das Staatsgebiet ist 415 qkm (7,58 QM.) groß, wovon 7690 Hektar auf die Stadt (einschließlich der ihr gegenüber am südlichen Elbufer liegenden Inseln Veddel, Kleiner Grasbrook und Steinwärder, Kuhwärder etc.), 26,050 Hektar auf das Landgebiet und 7780 Hektar auf das Kuxhavener Gebiet an der Elbmündung kommen. Etwa 3280 Hektar sind davon Wasserflächen. Das Landgebiet ist in vier Landherrenschaften unter je einem Senator als Landherrn eingeteilt. Im N. schließen sich unmittelbar an das Stadtgebiet sechs Landgemeinden an, die mit den im Holsteinischen gelegenen vier Walddörfern zusammen die Landherrenschaft der Geestlande bilden, im O. sieben Landgemeinden der Marschlande, wozu noch die Marschgemeinde Moorwärder auf der Spitze der Gabelung der Hamburger Norderelbe und der Harburger Süderelbe sowie Finkenwärder und Moorfleeth auf zwei Elbinseln kommen, und weiterhin östlich die Landherrenschaft Bergedorf (Stadt Bergedorf, die Vierlande [Neuengamme, Kirchwärder, Altengamme und Curslack], Ostkrauel und die Dorfschaft Geesthacht, eine Enklave in lauenburgischem Gebiet), endlich als vierte Landherrenschaft Ritzebüttel mit Kuxhaven, zehn kleinen Dorfschaften und der Insel Neuwerk. Zwei Flüsse, die Alster und Bille, münden innerhalb der Stadt in die Elbe, deren Mündung in die Nordsee bei Kuxhaven von H. 125 km entfernt ist. Ursprünglich mündete der Strom an der Stelle, wo jetzt H. liegt, und die Elbinseln zwischen H. und Harburg stellen das Elbdelta dar, während die sogen. Unterelbe von H. bis Kuxhaven der durch Deiche flußartig zusammengedrängte Meerbusen ist, dessen Grenzen…
in scheme: travel!digital Thesaurus
pref label: hamburger

hamburger
type: Label
in scheme: travel!digital Thesaurus

hamburg-amerikanisch
type: Label
in scheme: travel!digital Thesaurus

südamerikanisch
type: Concept
definition: Duden: Südamerika, die Südamerikaner betreffend; aus Südamerika stammend | [Anm.: unvollständig: Südamerika, die Südamerikaner betreffend; von den Südamerikanern stammend, zu ihnen gehörend; in Südamerika gelegen] | Duden: Südamerika: südlicher Teil Amerikas | Meyers Großes Konversations-Lexikon 1909: Südamerika (hierzu 2 Karten: »Südamerika, Fluß- und Gebirgssystem« und »Südamerika, politische Übersicht«), einer von den sechs Erdteilen, hängt im N. durch die bis auf 50 km verschmälerte Landenge von Pan. ima mit Mittel-, bez. Nordamerika zusammen und reicht, im N. vom Karaibischen Meer, im W. vom Großen Ozean und im O. vom Atlantischen Ozean bespült, mit seiner Südspitze Kap Hoorn (s. d.) am weitesten von den Südkontinenten gegen den Südpol hin.[168] | S. gehört zum größern Teile der südlichen Halbkugel an. Die Südspitze, Kap Hoorn. liegt unter 55°59' südl. Br. und 67°11' westl. L., die Nordspitze, Kap Gallinas, auf der Halbinsel Goajira, unter 12°25' nördl. Br und 71°40' westl. L. Somit beträgt die Längenausdehnung 671/2° oder rund 7500 km, die Breitenausdehnung hingegen von der Punta Parma in Peru unter 81°20' westl. L., bis Kap Branco unter 34°50' westl. L., 5100 km oder rund zwei Drittel der erstern. Von Afrika trennt im N. der 3000 km breite Atlantische Ozean, im Süden liegen 87 Längengrade zwischen den Südspitzen Afrikas und Südamerikas und 127 Längengrade oder rund 9000 km zwischen letzterm und Neuseeland. Unter Ausschluß von Panama, das bereits zu Mittelamerika gehört, berechnet A. Bludau die Fläche Südamerikas zu 17,605,000 qkm, andre Angaben gehen über diese Zahl hinaus, da genaue Vermessungen der südamerikanischen Staaten noch fehlen. Gewöhnlich wird für S. ein Areal von 17,732,000 qkm angegeben. Wie die beiden andern Südkontinente fällt auch S. durch den Mangel an Gliederung auf; es besitzt fast keine Halbinseln und nur wenige Inseln; das Verhältnis der Glieder zum Rumpfe gibt H. Wagner mit 1:77 an; S. hat somit nur eine sehr geringe Küstenentwickelung, …
narrower: hamburg-südamerikanisch
pref label: südamerikanisch
in scheme: travel!digital Thesaurus
related match: South America

hamburg-südamerikanisch
type: Concept
related: hamburger
definition: bdk: siehe hamburger, südamerikanisch
in scheme: travel!digital Thesaurus
pref label: hamburg-südamerikanisch

hamburg-südamerikanisch
type: Label
in scheme: travel!digital Thesaurus

südamerikanisch
type: Label
in scheme: travel!digital Thesaurus

jungamerikanisch
type: Label
in scheme: travel!digital Thesaurus

niederländisch-amerikanisch
type: Concept
definition: bdk: siehe niederländisch, amerikanisch
in scheme: travel!digital Thesaurus
pref label: niederländisch-amerikanisch

niederländisch-amerikanisch
type: Label
in scheme: travel!digital Thesaurus

nordamerikanisch
type: Concept
definition: Duden: Nordamerika betreffend, aus Nordamerika stammend, zu Nordamerika gehörend | [Anm.: unvollständig: Nordamerika, die Nordamerikaner betreffend; von den Nordamerikanern stammend, zu ihnen gehörend; in Nordamerika gelegen]
in scheme: travel!digital Thesaurus
pref label: nordamerikanisch
related: Nordamerikaner

nordamerikanisch
type: Label
in scheme: travel!digital Thesaurus

Nordamerikaner
type: Concept
definition: Duden: Einwohnerbezeichnung | [Anm.: unvollständig: Einwohnerbezeichnung zu Nordamerika] | Duden: Nordamerika: nördlicher Teil Amerikas | siehe auch: Meyers Großes Konversations-Lexikon: Nordamerika | Quelle: Meyers Großes Konversations-Lexikon, Band 14. Leipzig 1908, S. 737-746. | Permalink: http://www.zeno.org/nid/20007161263
related match: North America
pref label: Nordamerikaner
in scheme: travel!digital Thesaurus
alt label: Nordameriker
alternative label: Nordameriker

Nordamerikaner
type: Label
in scheme: travel!digital Thesaurus
hasVariant: Nordameriker

Nordameriker
type: Label
in scheme: travel!digital Thesaurus
isVariantOf: Nordamerikaner

centralamerikanisch
type: Concept
definition: Duden: Zentralamerika betreffend, dazu gehörend; aus Zentralamerika stammend | Duden: Zentralamerika: festländischer Teil Mittelamerikas | Meyers Großes Konversations-Lexikon 1908: Mittelamerika, das Übergangsland zwischen Nord- und Südamerika (s. diese Artikel und Karte »Westindien und Mittelamerika«), das sich in der Richtung von NW. nach SO. von der Landenge von Tehuantepec bis zur Landenge von Panama erstreckt, den Stillen Ozean vom Atlantischen (Mexikanischen und Karibischen Meer) scheidet und in seinen geologischen und morphologischen Verhältnissen von Nord- und Südamerika erheblich abweicht, hat ein Areal von 775,000 qkm und 5,3 Mill. Einw. Bei Panama auf 50 km, in Costarica teilweise auf 75 km, am Hondurasgolf auf 260 km und bei Tehuantepec auf 220 km verschmälert, ist es auch in Honduras nur 520 km breit, während die Halbinsel Yukatan (s. d.) ein fremdartiges Anhängsel zu dem langgestreckten Hauptkörper des Landes bildet. Letzterer besteht in seinem Kern aus stark abgeflachten, aus kristallinischen und paläozoischen Gesteinsarten zusammengesetzten Bergrücken, die ostwestlich streichen, in Guatemala in der Sierra de las Minas bis 3000 m, in den Altos Cuchumatanes bis 3700 m aufsteigen und an die sich beiderseits in ihrer Lagerung vielfach gestörte und von zahlreichen Brüchen durchsetzte cretazeïsche und tertiäre Kalk-, Sandstein- und Mergelschichten anlehnen. In südöstlicher Richtung verlaufende Reihen junger, vielfach noch tätiger Vulkane, darunter der Tacana (3990 m), Tajamulco (4210 m), Santa Maria (3768 m, mit starkem Ausbruch 1902), Acatenango (3960 m), Agua (3753 m), Coseguina, Momotombo, Masaya (mit Ausbruch 1902), Orosi, Poas (2711 m), Irazu (3417 m), Turialba (3300 m) und Chiriqui (3437 m), begleiten die Südwestseite. Dahin richtet sich auch der Steilabfall des Landes, so daß dort zwischen hohet. Vorgebirgen, die unmittelbar an den Stillen Ozean treten, nur schmale, mit Lagunen besetzte und mit Mangroven bewachsene, alluviale Küstenniederungen liege…
related match: Central America
in scheme: travel!digital Thesaurus
pref label: centralamerikanisch

centralamerikanisch
type: Label
in scheme: travel!digital Thesaurus

hispano-amerikanisch
type: Concept
preferred label: hispano-americano @es
pref label: hispano-americano
pref label: hispano-amerikanisch
comment: Mittelmeer 1909: nur spanisch
in scheme: travel!digital Thesaurus
definition: bdk: siehe hispanisch, amerikanisch

hispano-americano
type: Label
isTranslationOf: hispano-amerikanisch
in scheme: travel!digital Thesaurus

hispano-amerikanisch
type: Label
hasTranslation: hispano-americano
in scheme: travel!digital Thesaurus

anglo-amerikanisch
type: Concept
preferred label: anglo-américain @fr
related: britisch
related: englisch-amerikanisch
pref label: anglo-amerikanisch
definition: bdk: siehe englisch, amerikanisch
comment: Mittelmeer 1909: nur französisch
related: englisch
in scheme: travel!digital Thesaurus
pref label: anglo-américain

anglo-amerikanisch
type: Label
hasTranslation: anglo-américain
in scheme: travel!digital Thesaurus

anglo-américain
type: Label
isTranslationOf: anglo-amerikanisch
in scheme: travel!digital Thesaurus

Amerikaner
type: Concept
definition: Duden: 1. Einwohnerbezeichnung zu Amerika; Kurzwort: Ami | Duden: Amerika: 1. a. aus den Teilen Nord-, Zentral- und Südamerika bestehender Kontinent | b. einer der Teile des amerikanischen Kontinents | 2. Kurzwort für: Vereinigte Staaten von Amerika | siehe auch: Meyers Großes Konversations-Lexikon 1905: Amerika | Quelle: Meyers Großes Konversations-Lexikon, Band 1. Leipzig 1905, S. 423-431. | Permalink: http://www.zeno.org/nid/20006222153
related match: United States
in scheme: travel!digital Thesaurus
pref label: Amerikaner
narrower: Nordamerikaner

Amerikaner
type: Label
in scheme: travel!digital Thesaurus

Horiter
type: Concept
definition: bdk: kanaanitischer Stamm | Pierer's Universal-Lexikon 1859: Horiter, Volk semitischen Ursprungs, an der Südgrenze Palästinas auf dem Gebirge Seïr, das Urvolk war in Edom, wurde durch Esau u. seine Nachkommen unterjocht u. zum Theil ausgerottet. | Quelle: Pierer's Universal-Lexikon, Band 8. Altenburg 1859, S. 536. | Permalink: http://www.zeno.org/nid/20010134298
pref label: Horiter
in scheme: travel!digital Thesaurus
related: Kanaʿaniter

Horiter
type: Label
in scheme: travel!digital Thesaurus

dardanisch
type: Concept
related match: Dardani
definition: Meyers Großes Konversations-Lexikon 1906: Dardăner, illyr. Volksstamm in Obermösien an der obern Morawa, der schließlich zur Bildung des rumänischen Volkstums mit beigetragen hat; in der Römerzeit wurden die D. stark zum Militärdienst herangezogen, was die Romanisierung dieses als Durchzugsgebiet wichtigen Landes beförderte. Kaiser Claudius H. war wahrscheinlich ein D., auch Konstantin stammte aus Naissus (Nisch) in diesem Gebiete. D. hießen auch die Bewohner der früh zu Grunde gegangenen Stadt Dardania am Fuß des Ida in Kleinasien (s. Dardanos) sowie die mit den Trojanern verbundenen Teukrer. | Quelle: Meyers Großes Konversations-Lexikon, Band 4. Leipzig 1906, S. 513. | Permalink: http://www.zeno.org/nid/20006465730
related match: Dardania (Roman province)
in scheme: travel!digital Thesaurus
pref label: dardanisch
related match: List of ancient tribes in Thrace and Dacia

dardanisch
type: Label
in scheme: travel!digital Thesaurus

phönizisch
type: Concept
pref label: phönizisch
in scheme: travel!digital Thesaurus
alternative label: altphönicisch
related: Phönizier
alternative label: phönicisch
narrower: berberisch-phönizisch
alt label: altphönicisch
alt label: phönicisch
narrower: libyphönizisch
narrower: phönizisch-römisch
definition: Duden: die Phönizier betreffend, zu ihnen gehörend | [Anm.: unvollständig: Phönizien, die Phönizier betreffend; von den Phöniziern stammend, zu ihnen gehörend; in Phönizien gelegen]

phönizisch
type: Label
hasVariant: phönicisch
in scheme: travel!digital Thesaurus

phönicisch
type: Label
isVariantOf: phönizisch
in scheme: travel!digital Thesaurus

berberisch-phönizisch
type: Concept
pref label: berberisch-phönizisch
in scheme: travel!digital Thesaurus
definition: bdk: siehe berberisch, phönizisch

berberisch-phönizisch
type: Label
in scheme: travel!digital Thesaurus

altphönicisch
type: Label
in scheme: travel!digital Thesaurus

phönizisch-römisch
type: Concept
in scheme: travel!digital Thesaurus
pref label: phönizisch-römisch
definition: bdk: siehe phönizisch, römisch

phönizisch-römisch
type: Label
in scheme: travel!digital Thesaurus

etruskisch
type: Concept
pref label: etruskisch
in scheme: travel!digital Thesaurus
related: Etrusker
definition: Duden: Etrurien, die Etrusker betreffend, aus Etrurien stammend | [Anm.: unvollständig: Etrurien, die Etrusker betreffend; von den Etruskern stammend, zu ihnen gehörend; in Etrurien gelegen]

etruskisch
type: Label
in scheme: travel!digital Thesaurus

Albanese
type: Concept
definition: Duden: Albaner: Einwohnerbezeichnung zu Albanien | Duden: Albanien: Staat in Südosteuropa | siehe auch: Meyers Großes Konversations-Lexikon 1905: Albanĭen | Quelle: Meyers Großes Konversations-Lexikon, Band 1. Leipzig 1905, S. 261-262. | Permalink: http://www.zeno.org/nid/20006207219
related match: Albania
in scheme: travel!digital Thesaurus
pref label: Albanese

Albanese
type: Label
in scheme: travel!digital Thesaurus

Garamanten
type: Concept
in scheme: travel!digital Thesaurus
pref label: Garamanten
definition: Meyers Großes Konversations-Lexikon 1907: Garamanten, im Altertum großes, noch sehr unkultiviertes Volk im innern Afrika, südlich von der Großen Syrte, im Land Phazania (Fezzan) mit der Hauptstadt Garama (Dscherma). Die Römer drangen mit ihren Eroberungen auch bis zu diesem Volk vor, und Cornelius Balbus triumphierte 19 v. Chr. über sie. Die G. sind die Vorfahren der heutigen Tuareg. | Quelle: Meyers Großes Konversations-Lexikon, Band 7. Leipzig 1907, S. 326. | Permalink: http://www.zeno.org/nid/20006652808

Garamanten
type: Label
in scheme: travel!digital Thesaurus

Midianiter
type: Concept
definition: Duden: Angehöriger eines nordarabischen Volkes im Alten Testament | Meyers Großes Konversations-Lexikon 1908: Midĭaniter, im Altertum Volksstamm in Nordarabien, der zu beiden Seiten des Meerbusens von Akabah wohnte, meist aber im O. der Israeliten nomadisierte. Sie waren Abkömmlinge Midians, des Sohnes Abrahams und der Ketura; zu ihnen flüchtete sich Moses. Zur Zeit der Richter belästigten die M. die Juden durch wiederholte Einfälle, bis Gideon sie mit dem Stamme Manasse besiegte, worauf sie aus der Geschichte verschwinden. Vgl. Midian. | Quelle: Meyers Großes Konversations-Lexikon, Band 13. Leipzig 1908, S. 774. | Permalink: http://www.zeno.org/nid/20007086148 | Meyers Großes Konversations-Lexikon 1908: Midĭan (Madian), Land im nordwestlichen Arabien, am Roten Meer, unter Ismail Pascha vorübergehend ägyptisch, seit 1887 wieder türkisch, reicht vom Meerbusen von Akabah bis zur Hafenstadt El Widsch, mit unbestimmter Grenze nach O. Es wird in der Bibel zuerst erwähnt (2. Mos. 2,15); die Römer trieben dort Bergbau. Nach Untergang der Römerherrschaft war M. gleichsam verschollen und wurde erst durch Burton neu entdeckt, der das Land im Auftrag des Vizekönigs von Ägypten 1877–78 besuchte. Hinter der Küste zieht sich eine doppelte Reihe von Bergen hin, von teilweise fruchtbaren Wadis durchschnitten. Das Land, einst berühmt wegen seiner Erze und Edelsteine, ist noch jetzt reich an Schwefel, Steinsalz, Silver, Kupfer, Petroleum und namentlich Türkisen. Überall sind noch Spuren alter großartiger Bergwerke. Die Ruinen von Schuwak (Suka des Ptolemäos) mit großen Katakomben und Aquädukten bedecken einen weiten Raum, im Wadi Hams die Trümmer eines im reinsten griechischen Stil erbauten Tempels. Hafenorte des Landes, das nur von einigen räuberischen Maazeh-Beduinen durchstreift wird, sind Siba (Zibbr)[773] und El Widsch. Vgl. Burton, The gold mines of M. and the ruined Midianite cities (Lond. 1878) und The land of M. revisited (das. 1879, 2 Bde.). | Quelle: Meyers Großes Konversa…
alt label: Midjaniter
pref label: Midianiter
alternative label: Midjaniter
in scheme: travel!digital Thesaurus

Midjaniter
type: Label
isVariantOf: Midianiter
in scheme: travel!digital Thesaurus

Midianiter
type: Label
hasVariant: Midjaniter
in scheme: travel!digital Thesaurus

holländisch
type: Concept
pref label: holländisch
related: Holländer
alt label: altholländisch
in scheme: travel!digital Thesaurus
pref label: dutch
narrower: spanisch-holländisch
preferred label: dutch @en
alternative label: altholländisch
narrower: holländisch-westindisch
definition: Duden: 1. Holland, die Holländer betreffend; aus Holland stammend | [Anm.: unvollständig: Holland, die Holländer betreffend; von den Holländern stammend, zu ihnen gehörend; in Holland gelegen]
narrower: holländisch-ostindisch
narrower: südholländisch

holländisch
type: Label
hasTranslation: dutch
in scheme: travel!digital Thesaurus

dutch
type: Label
isTranslationOf: holländisch
in scheme: travel!digital Thesaurus

Holländer
type: Concept
definition: Duden: 1. Einwohnerbezeichnung | [Anm.: unvollständig: Einwohnerbezeichnung zu Holland] | Duden: Holland: 1. Westteil der Niederlande | 2. (volkstümlich) Niederlande | siehe auch: Meyers Großes Konversations-Lexikon 1907: Holland | Quelle: Meyers Großes Konversations-Lexikon, Band 9. Leipzig 1907, S. 476-478. | Permalink: http://www.zeno.org/nid/20006784801
related match: Holland
in scheme: travel!digital Thesaurus
pref label: Holländer

Holländer
type: Label
in scheme: travel!digital Thesaurus

altholländisch
type: Label
in scheme: travel!digital Thesaurus

holländisch-westindisch
type: Concept
definition: bdk: siehe holländisch, westindisch
in scheme: travel!digital Thesaurus
pref label: holländisch-westindisch

holländisch-westindisch
type: Label
in scheme: travel!digital Thesaurus

südholländisch
type: Concept
preferred label: zuid-hollandsch @nl
pref label: zuid-hollandsch
pref label: südholländisch
in scheme: travel!digital Thesaurus
comment: Mittelmeer 1909: nur holländisch
definition: bdk: siehe holländisch

zuid-hollandsch
type: Label
isTranslationOf: südholländisch
in scheme: travel!digital Thesaurus

südholländisch
type: Label
hasTranslation: zuid-hollandsch
in scheme: travel!digital Thesaurus

Tibeter
type: Concept
definition: Duden: Einwohnerbezeichnung | [Anm.: unvollständig: Einwohnerbezeichnung zu Tibet] | Duden: Tibet: 1. autonome Region in der Volksrepublik China | 2. Hochland in Zentralasien | Meyers Großes Konversations-Lexikon 1909: Tibet, großes Gebiet Innerasiens, zwischen 27–39° nördl. Br. und 78–102° östl. L., begrenzt von dem Hauptkamm des Himalaja im S., von einer unregelmäßigen Linie gegen das Karakorumgebiet im W., vom Altyn Tagh und Nanschan im N. und den chinesischen Provinzen Kansu und Sz'tschwan im O. (s. die Karten »Zentralasien« und »China«), ist einschließlich des in diese Grenzen einbegriffenen Kuku-Nor-Gebiets 2,109,000 qkm groß, wovon ein Teil im W. zum britisch-indischen Vasallenstaat Kaschmir, ein andrer im O. zu Sz'tschwan gehört, der weitaus größte Teil aber ein chinesisches Nebenland bildet. Die Angaben über die Einwohnerzahl schwanken zwischen knapp 11/2 und 61/2 Mill. Im großen unterscheidet man: das Tschangtang, den Hauptteil des Hochlandes; das Bodjul im S. und SO.; das Kuku-Nor-Gebiet im NO. | Trotzdem die Erforschung von T. seit Jahrzehnten einen Gegenstand des geographischen Ehrgeizes bildet, sind noch sehr große Gebiete unbekannt. Im ganzen ist T. das größte und höchste Plateau der Erde, entspricht dieser Bezeichnung aber nur in gewissen Grenzen. Der weitaus größte Teil wird vom Gebirgssystem des Kwenlun (Streichen etwa W. bis O., genauer W. zu N. bis O. zu S.) beherrscht; jedoch wird dadurch in den westlichen Zweidritteln der Charakter des Plateaus wenig gestört, da dieses bereits eine Meereshöhe von wenigstens 4000 m hat, die Gebirgszüge im Innern aber im allgemeinen nur 1000–1500 m in meist sanften Wellen darüber ansteigen. Eine Ausnahme bilden zunächst die Randzonen: Im S. finden sich in den beiden Hauptvorketten des Himalaja noch sehr bedeutende Erhebungen (Gangri oder Kailas im N. der Quellseen des Indus mit 6650 m, Nintschen-tangla im S. vom Tengrinor 7300 m, Nojin im W. des Yamdoksees 7200 m); im W. erreicht der Alung-gangri nördlich vom obe…
related match: Tibet
in scheme: travel!digital Thesaurus
pref label: Tibeter

Tibeter
type: Label
in scheme: travel!digital Thesaurus

Jemenit
type: Concept
pref label: Jemenit
in scheme: travel!digital Thesaurus
definition: Duden: Einwohnerbezeichnung | [Anm.: unvollständig: Einwohnerbezeichnung zu Jemen] | Duden: Jemen: Staat im Süden der Arabischen Halbinsel | Meyers Großes Konversations-Lexikon 1907: Jemeniten hießen die Bewohner des südlichen Arabien (Jemen), zum Unterschied von den Keisiten, den nördlichen Arabern. Der alte, auf dem Gegensatz von Seßhaftigkeit und Nomadentum beruhende Zwist zwischen J. und Nordarabern dauerte im Islam (s. d.) fort. Vgl. Goldziher, Muhammedanische Studien, Bd. 1, S. 78 (Halle 1889). | Quelle: Meyers Großes Konversations-Lexikon, Band 10. Leipzig 1907, S. 223. | Permalink: http://www.zeno.org/nid/20006840043 | Meyers Großes Konversations-Lexikon 1907: Jemen heißt bei den Arabern seit alters die Südwestecke ihrer Halbinsel, das »glückliche Arabien« der Griechen und Römer, die diese Bezeichnung wohl nur infolge eines Mißverständnisses wählten, indem sie den Namen J., d. h. »das (von dem von der Kaaba [Slekka] aus nach Osten blickenden Araber) rechts gelegene Land«, in ominöser Auffassung als »das glückliche Land« deuteten. (Zur Geographie des J. vgl. Arabien, S. 654, zur Entdeckungsgeschichte vgl. Asien, S. 873.) – Das frühere türkische Wilajet J. ist 1900 in die Wilajets Assyr, Hodeida, Sana und Taïzz geteilt worden. Das Gesamtareal beträgt 191,100 qkm, dessen Bevölkerung auf 750,000 geschätzt wird. Die wichtigsten Städte (von N. nach S.). Kunfuda, Lohaja, Beit el Fakih, Hodeida, Sana, Dammar. [...] | Quelle: Meyers Großes Konversations-Lexikon, Band 10. Leipzig 1907, S. 222-223. | Permalink: http://www.zeno.org/nid/20006840035
related: Südaraber
related match: Yemen
related match: Yemen Arab Republic

Jemenit
type: Label
in scheme: travel!digital Thesaurus

Bulgare
type: Concept
related match: Bulgaria
pref label: Bulgare
in scheme: travel!digital Thesaurus
definition: Duden: Einwohnerbezeichnung | [Anm.: unvollständig: Einwohnerbezeichnung zu Bulgarien] | Duden: Bulgarien: Staat in Südosteuropa | siehe auch: Meyers Großes Konversations-Lexikon 1905: Bulgarien | Quelle: Meyers Großes Konversations-Lexikon, Band 3. Leipzig 1905, S. 583-590. | Permalink: http://www.zeno.org/nid/20006381057

Bulgare
type: Label
in scheme: travel!digital Thesaurus

Seminole
type: Concept
alternative label: Seminolen-Indianer
pref label: Seminole
alt label: Seminolen-Indianer
in scheme: travel!digital Thesaurus
definition: Meyers Großes Konversations-Lexikon 1909: Seminōlen (»Flüchtlinge«), nordamerikan. Indianerstamm, gehören mit den Krik (s. d.) zur Sprachgruppe der Tschokta Muskogi, wohnten erst in Georgia, siedelten 1750 nach Florida über und führten in dem sogen. Seminolenkrieg (1835–42) blutige Kämpfe gegen die Truppen der Vereinigten Staaten. Nach der Besiegung der S. wurden die meisten in das Indianerterritorium verpflanzt, wo sie, noch 3000 Köpfe stark, zwischen Nord- und Südfork des Canadian River wohnen und schon ziemlich zivilisiert sind, während die in Florida zurückgebliebenen ein Nomadenleben führen. S. Tafel »Wohnungen der Naturvölker I«, Fig. 9. | Quelle: Meyers Großes Konversations-Lexikon, Band 18. Leipzig 1909, S. 329. | Permalink: http://www.zeno.org/nid/20007463073

Seminole
type: Label
in scheme: travel!digital Thesaurus

Seminolen-Indianer
type: Label
in scheme: travel!digital Thesaurus

Sioux
type: Concept
definition: Duden: Angehöriger eines nordamerikanischen Indianerstammes | Pierer's Universal-Lexikon 1863: Sioux (spr. Stuh), 1) großer Hauptstamm der nordamerikanischen Indianer, welcher im Süden der Athabaska-Indianer auf der Westseite des Mississippi sich bis zum Arkansas River u. dem östlichen Abhang der Rocky Mountains entlang bis zum 43° nördl. Breite ausdehnt; sie zerfallen in vier Hauptfamilien: Winnebagoes, eigentliche S., Minetares u. Osages (s.d. a.). Ihre Gesammtzahl wird auf 50–60,000 Seelen geschätzt; vgl. H. R. Schoolcraft, History, condition and prospects of the Indian tribes, Washington 1851 ff., 6 Bde.; 2) eigentliche S. (Nadowessier, Naudowessies), so v.w. Dakotas, s.d.; 3) S. Niver, Fluß im Staate Minnesota, entspringt aus einem kleinen See unter 45°20' nördl. Breite, fließt sudöstlich u. fällt nach einem Lauf von ungefähr 70 Meilen unter 42°30' in den Missouri River; 4) Grafschaft im Staate Iowa, ungefähr 50 QM., im Westen vom Sioux River begrenzt, vom Floyd's River durchflossen. Erst in neuester Zeit organisirt, Hauptort noch nicht bestimmt. | Quelle: Pierer's Universal-Lexikon, Band 16. Altenburg 1863, S. 137. | Permalink: http://www.zeno.org/nid/20010938346
narrower: Cuthead Sioux
in scheme: travel!digital Thesaurus
related: Indianer
pref label: Sioux

Cuthead Sioux
type: Concept
pref label: Cuthead Sioux
in scheme: travel!digital Thesaurus
related: Indianer
definition: bdk: siehe Sioux

Cuthead Sioux
type: Label
in scheme: travel!digital Thesaurus

Sioux
type: Label
in scheme: travel!digital Thesaurus

Vandale
type: Concept
definition: Meyers Großes Konversations-Lexikon 1909: Wandālen, german. Volk, ursprünglich im mittlern Odergebiet seßhaft, zerfielen in die Asdingen und die Silingen. Später gehörten sie zum gotischen Völkerbund und nahmen an dessen Einfällen in das Römische Reich teil; eine 277 in Gallien eingedrungene Schar wurde von Kaiser Probus besiegt und nach Britannien verpflanzt. Später nach Schlesien und Mähren übergesiedelt, wurden sie von da durch Konstantin nach Pannonien verpflanzt. Auch am Zuge des Radagaisus (406) nahmen W. teil. Die Hauptmasse des Volkes zog aber 407 über den Rhein durch Gallien nach Spanien, dessen mittlern und südlichen Teil sie besetzte. Der Westgote Wallia vernichtete 416 die Silingen und drängte die Asdingen nach Galicien zurück. Aber 428 drangen sie unter Geiserich wieder bis zur Südküste vor, fuhren 429 mit den verbündeten Alanen nach Nordafrika und bemächtigten sich in zwei Jahren aller Städte Mauretaniens. Sie eroberten die Feste Hippo und gründeten nach der Erstürmung Karthagos 439 das Wandalenreich in Nordafrika. Von hier aus plünderten sie alle Inseln und Küsten des westlichen Mittelmeers, 455 auch Rom und vernichteten 468 bei Bone eine große römische Flotte. Im Innern bedrückten sie als eifrige Arianer die orthodoxe Kirche. Aber seit dem Tode Geiserichs (477), unter Hunerich (477–484), Gundamund (484–496) und Thrasamund (496–523; er heiratete 500 Theoderichs d. Gr. Schwester Amalafrida), sanken die W. in Entartung, nahmen römische Unsitten und Üppigkeit an, vernachlässigten Ackerbau und Seefahrt. Thrasamunds Nachfolger Childerich (523–530), der Sohn Hunerichs, neigte zu den Römern und begünstigte die katholische Religion; so gelang es seinem Vetter Gelimer, dem Urenkel Geiserichs, ihn zu stürzen (530). Als Gelimer jede Bitte um Schonung des Königs ablehnte, sandte der oströmische Kaiser Justinian 533 Belisar gegen ihn. Gelimer ließ Childerich und seine Söhne ermorden, gab aber nach der ersten Feldschlacht beim zehnten Meilenstein die Hauptstadt Kar…
in scheme: travel!digital Thesaurus
pref label: Vandale

Vandale
type: Label
in scheme: travel!digital Thesaurus

süd-mahrattisch
type: Concept
pref label: süd-mahrattisch
in scheme: travel!digital Thesaurus
definition: bdk: die Mahrattenstaaten, die Mahratten betreffend; von den Mahratten stammend, zu ihnen gehörend; in den Mahrattenstaaten gelegen
pref label: southern mahratta
related: Mahratte
comment: Indien 1914: nur englisch
preferred label: southern mahratta @en

süd-mahrattisch
type: Label
hasTranslation: southern mahratta
in scheme: travel!digital Thesaurus

southern mahratta
type: Label
isTranslationOf: süd-mahrattisch
in scheme: travel!digital Thesaurus

westgotisch
type: Concept
definition: Duden: den Volksstamm der Goten betreffend | [Anm.: unvollständig: die Goten betreffend; von den Goten stammend, zu ihnen gehörend]
in scheme: travel!digital Thesaurus
pref label: westgotisch
related: Westgote

westgotisch
type: Label
in scheme: travel!digital Thesaurus

mexikanisch
type: Concept
preferred label: mexican @en
pref label: mexican
alt label: altmexikanisch
alternative label: altmexikanisch
pref label: mexicano
definition: Duden: Mexiko, die Mexikaner betreffend; von den Mexikanern stammend, zu ihnen gehörend | [Anm.: unvollständig: Mexiko, die Mexikaner betreffend; von den Mexikanern stammend, zu ihnen gehörend; in Mexiko gelegen]
related: Mexikaner
in scheme: travel!digital Thesaurus
pref label: mexikanisch
preferred label: mexicano @es

mexican
type: Label
isTranslationOf: mexikanisch
in scheme: travel!digital Thesaurus
hasTranslation: mexicano

mexikanisch
type: Label
hasTranslation: mexican
hasTranslation: mexicano
in scheme: travel!digital Thesaurus

mexicano
type: Label
isTranslationOf: mexikanisch
in scheme: travel!digital Thesaurus
hasTranslation: mexican

altmexikanisch
type: Label
in scheme: travel!digital Thesaurus

Haida
type: Concept
definition: Meyers Großes Konversations-Lexikon 1907: Haida, Indianervolk an der Nordwestküste Nordamerikas, bewohnt, 2000 Seelen stark, die Königin Charlotte-Inseln und zeichnet sich durch große Kunstfertigkeit im Bau der Häuser, Kanus, Wappenpfähle (Totems) und Hausgeräte aus (vgl. Tafel »Indianische Kultur I«, Fig. 10, und Tafel »II«, Fig. 6; »Geräte der Naturvölker I«, Fig. 2,18; Tafel »II«, Fig. 38). Ihre Mythen und Gebräuche sind mit denen der Tlinkit (s. d.) verwandt. Vgl. Dawson, On the Haida Indians of the Queen Charlotte Islands (Montreal 1880); Harrison, Haida Grammar (hrsg. von Chamberlain, Ottawa 1895). | Quelle: Meyers Großes Konversations-Lexikon, Band 8. Leipzig 1907, S. 627. | Permalink: http://www.zeno.org/nid/20006731104
related: Indianer
alternative label: Haida Indianer
alt label: Haida Indianer
pref label: Haida
in scheme: travel!digital Thesaurus

Haida Indianer
type: Label
in scheme: travel!digital Thesaurus

Haida
type: Label
in scheme: travel!digital Thesaurus

Djehâlîn
type: Concept
alt label: Djehâlin-Beduine
in scheme: travel!digital Thesaurus
alternative label: Djehâlîn-Beduine
definition: bdk: arabische Stammesgemeinschaft in Syrien
alt label: Djehâlîn-Beduine
pref label: Djehâlîn
related: Beduine
alternative label: Djehâlin-Beduine

Djehâlin-Beduine
type: Label
in scheme: travel!digital Thesaurus
hasVariant: Djehâlîn-Beduine

Djehâlîn-Beduine
type: Label
in scheme: travel!digital Thesaurus
isVariantOf: Djehâlin-Beduine

Djehâlîn
type: Label
in scheme: travel!digital Thesaurus

makedonisch
type: Concept
related: Makedonier
alt label: macedonisch
alternative label: mazedonisch
pref label: makedonisch
definition: Duden: Makedonien, die Makedonier betreffend; aus Makedonien stammend | [Anm.: unvollständig: Makedonien, die Makedonier betreffend; von den Makedoniern stammend, zu ihnen gehörend; in Makedonien gelegen]
in scheme: travel!digital Thesaurus
alt label: mazedonisch
alternative label: macedonisch

Makedonier
type: Concept
definition: Duden: Einwohnerbezeichnung | [Anm.: unvollständig: Einwohnerbezeichnung zu Makedonien] | Duden: Makedonien: Region im nördlichen Griechenland | Meyers Großes Konversations-Lexikon 1908: Mazedonĭen (lat. Macedonia), Landschaft Nordgriechenlands von sehr wechselnden Grenzen, die zur Zeit ihrer größten Ausdehnung nach Philipp II. ungefähr die Unterläufe der Flüsse Strymon (Struma), Axios (Wardar) und Haliakmon (Wistritza) umfaßte. Erstere beiden, einander parallel laufend, sind nur durch Hügelland oder niedrige Gebirge (Kerkine und Dysoron, jetzt Kurscha-Balkan) voneinander getrennt, aber ringsum durch Hochgebirge umschlossen. Im O. scheiden das Pangäon (Bunar Dagh) und der Orbelos (jetzt Perim Dagh), im N. der Skomios (Witosch) und Skardos (Schar Dagh), im W. das Boiongebirge (Grammos) diese Stromgebiete von Thrakien, Illyrien und Epirus. Der mächtige Olympos und die niedrigen Kambunischen Berge trennen es von Thessalien. Als größere Ströme sind zu nennen: Erigon (heute Tzerna), ein rechter Zufluß des Axios, Haliakmon, zwischen diesem und dem Axios der kurze, wasserreiche Ludias (Moglenitiko), der Echedoros (Galliko) und der Angites (Angista), ein Zufluß des Strymon. Ein eignes Gebiet für sich bildet die Landschaft Eordäa (s. d.), das Becken des Sees von Ostrowo, rings von hohen Bergen umschlossen, nach[488] O. vom Bermios (1800 m, jetzt Doxa), nach N. vom Bora (2517 m, jetzt Nidsche), nach W. und S. von der bis 2068 m ansteigenden Kette des Peristeri. Ein fast durchweg enges Tal, das sich nur in seinem Unterlaufe zu einer fruchtbaren Ebene erweitert, durchfließt der Strymon. Die Oberläufe der Hauptflüsse liegen so hoch (bis 860 m), daß das Klima für 40–41° nördl. Br. rauh zu nennen ist und die aus Eichen, Buchen und Fichten bestehenden Wälder einen durchaus nördlichen Charakter tragen. Doch sind die Gebirgsgegenden zur Viehzucht gut geeignet und bargen in ihrem Innern Metalle aller Art, besonders Gold und Silber (im Pangäon, bei Philippi und im Dysoron waren reiche …
alternative label: Mazedonier
related match: Macedonia (region)
in scheme: travel!digital Thesaurus
alt label: Mazedonier
pref label: Makedonier

Mazedonier
type: Label
isVariantOf: Makedonier
in scheme: travel!digital Thesaurus

Makedonier
type: Label
hasVariant: Mazedonier
in scheme: travel!digital Thesaurus

macedonisch
type: Label
hasVariant: mazedonisch
isVariantOf: makedonisch
in scheme: travel!digital Thesaurus

mazedonisch
type: Label
hasVariant: macedonisch
isVariantOf: makedonisch
in scheme: travel!digital Thesaurus

makedonisch
type: Label
hasVariant: macedonisch
hasVariant: mazedonisch
in scheme: travel!digital Thesaurus

albanesisch
type: Concept
alternative label: albanisch
alt label: albanisch
pref label: albanesisch
in scheme: travel!digital Thesaurus
related: Albanese
definition: Duden: albanisch: Albanien, die Albaner betreffend; von den Albanern stammend, zu ihnen gehörend | [Anm.: undvollständig: Albanien, die Albaner betreffend; von den Albanern stammend, zu ihnen gehörend; in Albanien gelegen]

albanisch
type: Label
in scheme: travel!digital Thesaurus

albanesisch
type: Label
in scheme: travel!digital Thesaurus

hamitisch
type: Concept
definition: Duden: zu den Hamiten gehörend, von ihnen stammend, sie betreffend
related: Hamit
in scheme: travel!digital Thesaurus
pref label: hamitisch

Hamit
type: Concept
definition: Duden: Angehöriger einer Völkergruppe in Afrika | Meyers Großes Konversations-Lexikon 1907: Hamíten, die Nachkommen von Ham (s. d.), dem Sohne Noahs. Mit diesem biblischen Namen werden jetzt gewöhnlich eine Reihe afrikanischer Völker begriffen, welche die hamitischen Sprachen reden. Sie zerfallen in drei Gruppen: die ägyptische, die aus zahlreichen Inschriften und Papyrusrollen bekannte Sprache der alten Ägypter und die in der ältesten christlichen Zeit daraus hervorgegangene, jetzt gleichfalls ausgestorbene Sprache der Kopten umfassend; die libysche Gruppe oder Gruppe der Berbersprachen, die, wie die Inschriften und Ortsnamen beweisen, im Altertum, nur durch einige phönikische und griechische Kolonien unterbrochen, den ganzen Nordrand von Afrika westwärts von Ägypten einnahm, während sie heutzutage von der Küste fast überall durch das Arabische verdrängt ist, aber die Sprachen der zahlreichen räuberischen Stämme umfaßt, die unter den Namen Berber, Tuareg, Kabylen u. a. die südlichen Teile von Algerien, Tunis, Marokko und Tripolis sowie alle Oasen zwischen den arabischen Staaten Nordafrikas und den Negerstaaten innehaben; drittens die kuschitische oder äthiopische Sprachengruppe (nicht zu verwechseln mit der äthiopischen Sprache, s. d.), die von Ägypten südwärts bis zu dem Gebiet der Bantusprachen reicht und das Bedscha (als Verkehrssprache auch in Oberägypten herrschend), Belen, Saho, Agau, Falascha, Galla, Dankali und Somali in sich faßt (vgl. Karte »Menschenrassen« und die »Sprachenkarte«). Einen Ausläufer bildet die Sprache der Haussa (s. d.) in Westafrika. Alle hamitischen Sprachen stimmen in betreff der persönlichen Pronomina sowie der aus ihnen entstandenen Personalendungen des Verbums, ferner in der Bezeichnung des weiblichen Geschlechts durch die Endung t, in der Bildung des Plurals und andrer grammatischer Formen auffällig überein. Ferner in wesentlichen Punkten auch mit den semitischen Sprachen, und man nimmt auf Grund derselben eine hamito-semitische Ure…
pref label: Hamit
in scheme: travel!digital Thesaurus

Hamit
type: Label
in scheme: travel!digital Thesaurus

hamitisch
type: Label
in scheme: travel!digital Thesaurus

hyrkanisch
type: Concept
related: Hyrkaner
in scheme: travel!digital Thesaurus
pref label: hyrkanisch
definition: Duden: Hyrkanien betreffend | [Anm.: unvollständig: Hyrkanien, die Hyrkaner betreffend; von den Hyrkanern stammend, zu ihnen gehörend; in Hyrkanien gelegen]

Hyrkaner
type: Concept
related match: Hyrcania
related: Nomade
definition: bdk: Einwohnerbezeichnung zu Hyrkanien | Duden: Hyrkanien: im Altertum Bezeichnung für die südöstliche Küste des Kaspischen Meeres | Meyers Großes Konversations-Lexikon 1907: Hyrkanĭen, im Altertum Name der südöstlichen Küste des Kaspischen Meeres (daher auch Hyrkanisches Meer genannt) und somit der heutigen Provinz Masenderan entsprechend. Der reichliche Regen und die dicke Erdschicht, entstanden aus den verwitterten Gesteinen des Urgebirges (östliche Fortsetzung des Elbrus), machen den Landstrich sehr fruchtbar; in alten Zeiten scheinen die Bewohner aber wenig Ackerbau getrieben und das Nomadenleben ihrer Nachbarn geführt zu haben. Unter Dareios I. war H. mit Medien vereinigt, später eine eigne, mit Parthien verbundene Satrapie. Alexander d. Gr. durchzog H. sehr rasch, nachdem er die Hauptstadt Zadrakarta (wahrscheinlich Astrabad) erobert hatte. Das Gebirge war einst dicht bewaldet und voll wilder Tiere, was dem Lande vielleicht seinen altiranischen Namen (»Wolfsland«) gegeben hat. S. Karte »Reich Alexanders d. Gr.« (im 1. Band). | Quelle: Meyers Großes Konversations-Lexikon, Band 9. Leipzig 1907, S. 718. | Permalink: http://www.zeno.org/nid/20006806244
in scheme: travel!digital Thesaurus
pref label: Hyrkaner

Hyrkaner
type: Label
in scheme: travel!digital Thesaurus

hyrkanisch
type: Label
in scheme: travel!digital Thesaurus

syrisch
type: Concept
narrower: mittelsyrisch
pref label: syrisch
narrower: syrisch-arabisch
pref label: syrian
narrower: syrisch-jacobitisch
alt label: altsyrisch
narrower: syrisch-ägyptisch
definition: Duden: Syrien, die Syrer betreffend; von den Syrern stammend, zu ihnen gehörend | [Anm.: unvollständig: Syrien, die Syrer betreffend; von den Syrern stammend, zu ihnen gehörend; in Syrien gelegen]
preferred label: syrian @en
narrower: syrisch-katholisch
in scheme: travel!digital Thesaurus
alternative label: altsyrisch
related: Syrer

mittelsyrisch
type: Concept
definition: bdk: siehe syrisch
pref label: mittelsyrisch
in scheme: travel!digital Thesaurus

mittelsyrisch
type: Label
in scheme: travel!digital Thesaurus

syrisch
type: Label
hasTranslation: syrian
in scheme: travel!digital Thesaurus

syrian
type: Label
isTranslationOf: syrisch
in scheme: travel!digital Thesaurus

syrisch-jacobitisch
type: Concept
definition: bdk: siehe syrisch, jacobitisch
in scheme: travel!digital Thesaurus
pref label: syrisch-jacobitisch

syrisch-jacobitisch
type: Label
in scheme: travel!digital Thesaurus

altsyrisch
type: Label
in scheme: travel!digital Thesaurus

syrisch-katholisch
type: Concept
definition: bdk: siehe syrisch, katholisch
in scheme: travel!digital Thesaurus
pref label: syrisch-katholisch

syrisch-katholisch
type: Label
in scheme: travel!digital Thesaurus

Syrer
type: Concept
definition: Duden: Einwohnerbezeichnung zu Syrien | Duden: Syrien: Staat im Vorderen Orient | Meyers Großes Konversations-Lexikon 1909: Syrĭen (türk. Sûria), ein Land der asiat. Türkei, an der Ostküste des Mittelländischen Meeres (s. Karte »Kleinasien«), bezeichnete ursprünglich den gesamten Umfang des assyrischen Reiches, bis der Name in abgekürzter Form durch die Griechen auf die Gebiete westlich des Euphrat beschränkt wurde; heute versteht man darunter alles Land zwischen dem Euphrat und der Arabischen Wüste im O., dem Mittelmeer im W., dem-Taurus im N. und der Grenze Ägyptens im Süden, d. h. das heutige Wilajet Sûria, die südwestliche Hälfte von Haleb (Aleppo), das Wilajet Beirut sowie die selbständigen Sandschaks Libanon und Jerusalem (s. Karte »Palästina«). S. gehört, mit Ausnahme des Alma Dagh oder Amanus im NW., zum ungefalteten, tafelförmigen Vorderasien, dessen nordwestlichsten Teil es bildet. Beherrscht wird die Oberflächengestalt von dem nördlichen Teil des syrischen Einbruchgrabens, der Bekaa, dessen südlicher Teil der Graben von Palästina ist. Die Bekaa, unter 34° nördl. Br. bei Baalbek von einer 1160 m hohen Schwelle in zwei Abdachungen geschieden, entsendet nach N. den Orontes (El Asi), nach Süden den Lita (Litani), der zuletzt scharf nach W. umbiegt und in einem kurzen Quertal das Meer erreicht. Zu den Seiten der Bekaa sind der Libanon (bis 3063 m) und der Antilibanon (2670 m), der mit dem isolierten Großen Hermon (Dschebel el Scheich), 2759 m, beginnt und den Jordan entsendet, als Hochschollen stehen geblieben. Sie bestehen aus leicht nach der Bekaa zu geneigten Kalksteinschichten, den Fortsetzungen des niedrigern, 1000–1200 m nicht übersteigenden Tafellandes von Palästina und des Ostjordanlandes. Weiter im O., zwischen 32 und 34° nördl. Br., erhebt sich, ein hydrographisches Zentrum, die ausgedehnte Basaltdecke des fruchtbaren Haurân (1839 m), und im N. davon dehnen sich mit Hunderten von Basalt- und Trachytkegeln besetzte Lavawüsten aus. Sie neigen sich gege…
related match: Syria
pref label: Syrer
in scheme: travel!digital Thesaurus

Syrer
type: Label
in scheme: travel!digital Thesaurus

Phäake
type: Concept
related match: Scheria
definition: Meyers Großes Konversations-Lexikon 1908: Phäaken, bei Homer die Bewohner der nördlich von Ithaka gelegenen Insel Scheria, die von den Alten mit Kerkyra (Korfu) identifiziert ward, aber wahrscheinlich nur Fiktion des Dichters ist. Sie sind ein von den Göttern geliebtes und mit allen Gütern des Lebens gesegnetes, heiteres und genußliebendes Völkchen, bei dem Odysseus als Schiffbrüchiger gastliche Aufnahme fand. Vgl. Welcker, Die P. (im »Rheinischen Museum«, Bd. 2, Bonn 1833). | Quelle: Meyers Großes Konversations-Lexikon, Band 15. Leipzig 1908, S. 754. | Permalink: http://www.zeno.org/nid/20007244304
in scheme: travel!digital Thesaurus
pref label: Phäake

Phäake
type: Label
in scheme: travel!digital Thesaurus

Hebräer
type: Concept
pref label: Hebräer
in scheme: travel!digital Thesaurus
definition: Duden: Angehöriger des israelitischen Volkes | Meyers Großes Konversations-Lexikon 1907: Juden (Israeliten), die Bekenner der mosaischen Religion. Ihr ursprünglicher, meist nach außen geltender Name war Hebräer oder Ebräer (hebr. Ibrim), »die Jenseitigen«, weil ihr Stammvater Abraham von jenseit des Euphrat in Palästina eingewandert war. Die mehr einheimische, auf die Bestimmung des Volkes hinweisende Benennung nach dem dritten Stammvater, Jakob (Israel, d. h. »Gottesstreiter«), Israeliten, entstand schon zu Anfang ihres Geschichtslebens, und mit J. (hebr. J'udim) bezeichnet man nach dem babylonischen Exil die gesamte israelitische Nation, weil die meisten Zurückkehrenden Bürger des ehemaligen Königreichs Juda waren. Die Ereignisse vor der Gefangenschaft in Babylon bilden demnach streng genommen die Geschichte des hebräischen oder israelitischen Volkes, während nach derselben die jüdische Geschichte beginnt. [...] | Quelle: Meyers Großes Konversations-Lexikon, Band 10. Leipzig 1907, S. 328-341. Permalink: http://www.zeno.org/nid/20006846688
related: Jude
related match: Jews

Hebräer
type: Label
in scheme: travel!digital Thesaurus

ʿAlawîn
type: Concept
definition: bdk: arabische Stammesgemeinschaft in Jordanien
in scheme: travel!digital Thesaurus
pref label: ʿAlawîn

ʿAlawîn
type: Label
in scheme: travel!digital Thesaurus

Karēn
type: Concept
definition: Meyers Großes Konversations-Lexikon 1907: Karen (birmanisch Kareng, siamesisch Karieng), zu den Lohitavölkern gehöriger Volksstamm Hinterindiens, in Tenasserim, Siam, Pegu, den Waldgebirgen[622] von Arakan und Oberbirma bis zur Grenze gegen Assam. Sie zerfallen in drei durch ihre Sprache geschiedene Stämme: Sgau (»weiße K.«, nach ihrer Tracht), Pwo oder Talaing und Bghai, unter letztern die Karenin (»rote K.«) in Niederbirma. Die K. sind von kleiner, aber kräftiger Gestalt, heller als die Birmanen, in Gesichtstypus und Augenstellung den Chinesen ähnlich, auch nach ihrer Überlieferung im 4. oder 5. Jahrh. n. Chr. aus Yünnan eingewandert. Während ein größerer Teil unter britischer Herrschaft sich dauernd in den Ebenen angesiedelt hat und Ackerbau treibt, beharrt ein andrer in den Bergen in ursprünglicher Roheit und Unstetigkeit. Die meisten sind Buddhisten, viele aber Naturanbeter, etwa 70,000 durch amerikanische und englische Missionare zum Christentum bekehrt. Ihre Sprache, deren Stellung innerhalb der hinterindischen Sprachgruppe noch nicht feststeht, behandelten Walde (»Karen vernacular grammar«, Maulmain 1861; »The Anglo-Karen dictionary«, Rangun 1883) und Brayton (»A primer of the Pwo-Karen language«, das. 1884). Vgl. Smeaton, The loyal Kareens of Burma (Lond. 1886); J. Nisbet, Burma under British rule and before (das. 1901, 2 Bde.). | Quelle: Meyers Großes Konversations-Lexikon, Band 10. Leipzig 1907, S. 755. | Permalink: http://www.zeno.org/nid/20006871143
in scheme: travel!digital Thesaurus
pref label: Karēn

Karēn
type: Label
in scheme: travel!digital Thesaurus

Germane
type: Concept
preferred label: alemanes @es
definition: Duden: Angehöriger einer der zur indogermanischen Sprach- und Völkerfamilie gehörenden Gruppe untereinander sprachverwandter Völkerschaften in Nord- und Mitteleuropa | Meyers Großes Konversations-Lexikon 1907: Germanen, arischer Volksstamm, gehören mit Griechen und Thrako-Illyriern, Romanen, Slawen, Letten und Kelten zur westlichen Gruppe der Arier und bewohnen außer dem Deutschen Reich, wo sie die weit überwiegende Hauptmasse der Bevölkerung ausmachen (von einer Gesamtbevölkerung von 56,4 nahezu 52 Mill.), in größern zusammenhängenden Gebieten namentlich Österreich, dann die Schweiz und Ungarn und sind auch in Rußland, noch mehr in den Vereinigten Staaten sehr stark vertreten. (vgl. Deutsches Volk, S. 749). Auch die Niederländer und Flamen, die Schweden, die Norweger und Dänen, endlich auch die Engländer gehören zu den G. Der größte Teil der heutigen Deutschen ist ein Mischvolk. Am reinsten noch haben sich die Bewohner Westfalens und der friesischen Küsten erhalten. Die Niederdeutschen flehen den Goten näher; die Oberdeutschen haben lange in engerm Verkehr mit den Kelten gelebt und verkörpern, auch rassenhaft, das germanische Wesen weniger rein. Beide haben in ihren östlichen Abteilungen durch Kolonisation auf slawischem Gebiete (vgl. den Art. »Germanisieren«) die slawisch-gemischte Abart der ostelbischen Deutschen und der Österreicher erzeugt. Von den Oberdeutschen (Franken) ging die Eroberung Galliens, die Frankreich geschaffen, von den Niederdeutschen (Angeln und Sachsen) die Britanniens aus, die den Briten ihre germanische Grundlage gegeben hat. Die Deutschen sind durchschnittlich mesokephal (Index 81,2); doch strebt der Schädel von Norden nach Süden und namentlich nach Südwesten merklich zur Brachykephalie; bei den Niederdeutschen ist er länger als bei den Oberdeutschen. Der Index der Deutschen ist in Hannover 76,7, in der Umgegend von Jena 76,9, in Holstein 77,2, bei Bonn und Köln 77,4, in Hessen 79,2, in Schwaben 79,3, in Bayern 79,8, Unterfranken 80,0, im B…
in scheme: travel!digital Thesaurus
pref label: Germane
pref label: alemanes

Germane
type: Label
hasTranslation: alemanes
in scheme: travel!digital Thesaurus

alemanes
type: Label
isTranslationOf: Germane
in scheme: travel!digital Thesaurus

anatolisch
type: Concept
definition: Duden: Anatolien betreffend | [Anm.: unvollständig: Anatolien, die Anatolier betreffend; von den Anatoliern stammend, zu ihnen gehörend; in Anatolien gelegen] | Duden: Anatolien: asiatischer Teil der Türkei | Meyers Großes Konversations-Lexikon 1905: Anatolĭen (türk. Anadoly), soviel wie Morgenland, insbes. die Westhälfte von Kleinasien. Anatolier, Anhänger der Lehre, daß das Menschengeschlecht nur im Orient entstanden sei, im Gegensatze zu den Ökumeniern, welche die Entstehung desselben auch an andern Punkten der Erde für möglich halten. | Quelle: Meyers Großes Konversations-Lexikon, Band 1. Leipzig 1905, S. 486. | Permalink: http://www.zeno.org/nid/20006227708
related match: Anatolia
narrower: bulgarisch-anatolisch
in scheme: travel!digital Thesaurus
pref label: anatolisch
related: türkisch

bulgarisch-anatolisch
type: Concept
pref label: bulgarisch-anatolisch
in scheme: travel!digital Thesaurus
definition: bdk: sie bulgarisch, anatolisch

bulgarisch-anatolisch
type: Label
in scheme: travel!digital Thesaurus

anatolisch
type: Label
in scheme: travel!digital Thesaurus

Sarde
type: Concept
definition: Duden: Einwohnerbezeichnung zu Sardinien | Duden: Sardinien: italienische Insel im Mittelmeer | siehe auch: Meyers Großes Konversations-Lexikon 1909: Sardinĭen | Quelle: Meyers Großes Konversations-Lexikon, Band 17. Leipzig 1909, S. 606-608. | Permalink: http://www.zeno.org/nid/20007402570
related match: Sardinia
in scheme: travel!digital Thesaurus
pref label: Sarde

Sarde
type: Label
in scheme: travel!digital Thesaurus

chinesisch
type: Concept
preferred label: chineesch @nl
definition: Duden: China, die Chinesen betreffend; von den Chinesen stammend, zu ihnen gehörend | [Anm.: unvollständig: China, die Chinesen betreffend; von den Chinesen stammend, zu ihnen gehörend; in China gelegen]
preferred label: chinese @en
pref label: chinese
narrower: südchinesisch
related: Chinese
narrower: indochinesisch
narrower: chinesisch-hinterindisch
in scheme: travel!digital Thesaurus
pref label: chinesisch
pref label: chineesch

chinese
type: Label
isTranslationOf: chinesisch
in scheme: travel!digital Thesaurus
hasTranslation: chineesch

chinesisch
type: Label
hasTranslation: chinese
in scheme: travel!digital Thesaurus
hasTranslation: chineesch

chineesch
type: Label
isTranslationOf: chinesisch
hasTranslation: chinese
in scheme: travel!digital Thesaurus

südchinesisch
type: Concept
in scheme: travel!digital Thesaurus
definition: bdk: siehe chinesisch
pref label: südchinesisch

südchinesisch
type: Label
in scheme: travel!digital Thesaurus

Chinese
type: Concept
definition: Duden: Einwohnerbezeichnung zu China | Duden: China: Staat in Ostasien | Meyers Großes Konversations-Lexikon 1906: China (hierzu 3 Karten: »China und Japan«, »Die Provinzen Tschili und Schantung«; ferner »Unterlauf des Pei-ho etc.« bei S. 55), in eigentlichem Sinn das »Land der 18 Provinzen« (Schipa schöng), das alte Stammland der chinesischen Herrschaft, oft noch gleichbedeutend mit Chinesisches Reich (s.d.) gebraucht. Der Name C. ist wahrscheinlich malaiischen Ursprungs und zu alter Zeit von Hinterindien aus auf C. übertragen. Der europäischen Kultur des Altertums waren die Bewohner gerüchtweise als Siner oder Serer (Seidenleute) bekannt. Die Chinesen nennen ihr Land namentlich Tschung kwo (Reich der Mitte), nicht aber Himmlisches Reich. Der mittelalterliche Name Kitai oder Kathay (bei Marco Polo für Nordchina) hat sich bei den Russen und Nordasiaten erhalten. Die Chinesen haben sich auch jeweilig nach ihren Dynastien genannt, z. B. Söhne der Han, der Ming. [...] | Die Bevölkerung Chinas bestand ursprünglich aus tibetischen und hinterindischen Stämmen, deren Überreste als Sifan, Yao, Lolo und Miaotse heute in Jünnan, Kweitschou, Kwangsi und Kwangtung wohnen. Sie wurden zurückgedrängt durch ein von NW. (nach der chinesischen Mythologie vom Kwenlun) einwanderndes Volk, das den Grundstock der mit allerlei mongolischen Elementen vermischten eigentlichen Chinesen bildet. Später kamen türkische Stämme, endlich als Eroberer die Mandschu hinzu, ein zum tungusischen Zweig der Altaier gehöriger Stamm, die heute in den wichtigern Städten, wo sie die sogen. Tatarenstadt bewohnen, die Besatzung bilden. Außer den der großen mongolischen Rasse und, mit Ausnahme der Mandschu, den Völkern mit einsilbigen Sprachen angehörigen Stämmen wohnten 1900 in den dem fremden Handel geöffneten Vertragshäfen (s. unten) 16,811 Europäer, Japaner und Amerikaner. | Die eigentlichen Chinesen (s. Tafel »Asiatische Völker I«, Fig. 17) sind selten über 1,52 m groß, die Frauen meist noch kleiner. Das G…
related match: Ethnic groups in Chinese history
in scheme: travel!digital Thesaurus
narrower: Halbchinese
pref label: Chinese
related match: China

Halbchinese
type: Concept
definition: bdk: siehe Chinese
pref label: Halbchinese
in scheme: travel!digital Thesaurus

Halbchinese
type: Label
in scheme: travel!digital Thesaurus

Chinese
type: Label
in scheme: travel!digital Thesaurus

Kroumir
type: Concept
in scheme: travel!digital Thesaurus
pref label: Kroumir
definition: Meyers Großes Konversations-Lexikon 1907: Krumir (Khrumir, Kumir, Akhmaïr), Völkerschaft im nordwestlichen Tunis, an der Grenze gegen Algerien, in einer an Blei, Kupfer, Eisen, Steinsalz, warmen Quellen und prachtvollen Wäldern reichen Landschaft. Das etwa 5500 Köpfe starke Volk besteht aus drei arabischen Stämmen (Slul, Mselma, Chia'ia) und einem Berberstamme (Dedmaka, Tademakka). Hauptort ist Ain Draham mit französischer Garnison. Die K. standen stets nur dem Namen nach unter der Herrschaft des Beis von Tunis; ihre räuberischen Einfälle in algerisches Gebiet gaben 1881 den Vorwand zur Okkupation von Tunis durch Frankreich. Vgl. Farine, Kabyles et Kroumirs (Par. 1881); Antichan, Le pays des Khroumirs (4. Aufl., das. 1892); Guérard und Boutineau, Tunisie. La Kroumirie et sa colonisation (das. 1892). | Quelle: Meyers Großes Konversations-Lexikon, Band 11. Leipzig 1907, S. 748. | Permalink: http://www.zeno.org/nid/20006949223

Kroumir
type: Label
in scheme: travel!digital Thesaurus

moabitisch
type: Concept
definition: bdk: die Moabiter betreffend; von den Mobitern stammend, zu ihnen gehörend
in scheme: travel!digital Thesaurus
pref label: moabitisch
related: Moabiter

moabitisch
type: Label
in scheme: travel!digital Thesaurus

Moabiter
type: Concept
definition: Duden: Bewohner von Moab; Bewohner von Berlin-Moabit | Meyers Großes Konversations-Lexikon 1908: Moabīter, semit. Volksstamm im nördlichen Arabien, südöstlich vom Toten Meer, die Bewohner von Moab (s. d.). Als Stammvater wird Moab, Sohn Lots, genannt (1. Mos. 19, 37). Todfeinde Israels, trieben sie Baalsdienst und verehrten als höchste Gottheit den Kemosch (s. d.). In ihrer Verbreitung wurden die M. zuerst durch die Ammoniter beschränkt, und der Name Gefilde Moab für die Ebenen am Jordan, Jericho gegenüber, deutet auf ihre frühere Ausdehnung nach Norden. In der Richterzeit hatten die M. die südlichen Stämme der Israeliten auf 18 Jahre unterjocht, bis der Richter Ehud ihren König Eglon ermordete. David unterjochte sie, doch kamen sie bei der Teilung des Reiches an Israel. Unter Mesa (s. d.) machten sie sich selbständig, bis Jerobeam II. sie wieder tributpflichtig machte. Um 600 wurden sie von den Babyloniern unter Nebukadnezar unterworfen; später, abhängig von dem arabischaramäischen Handels- und Kulturvolk der Nabatäer, wurden sie diesen in dem Kampf um Paräa, dessen südlichster Teil die Moabītis war, von jüdischen Herrschern entrissen, bis sie dann unter der Römerherrschaft und der Einwanderung der südarabischen Sabäer nach dem Hauran ihre Nationalität verlieren. | Quelle: Meyers Großes Konversations-Lexikon, Band 14. Leipzig 1908, S. 5. | Permalink: http://www.zeno.org/nid/20007098820
alt label: Moab
pref label: Moabiter
alternative label: Moab
in scheme: travel!digital Thesaurus

Moab
type: Label
in scheme: travel!digital Thesaurus

Moabiter
type: Label
in scheme: travel!digital Thesaurus

sardinisch
type: Concept
related: Sarde
pref label: sardinisch
in scheme: travel!digital Thesaurus
definition: Duden: Sardinien, die Sarden betreffend; von den Sarden stammend, zu ihnen gehörend | [Anm.: unvollständig: Sardinien, die Sarden betreffend; von den Sarden stammend, zu ihnen gehörend; auf Sardinien gelegen]

sardinisch
type: Label
in scheme: travel!digital Thesaurus

Oudh-Leute
type: Concept
definition: Meyers Großes Konversations-Lexikon 1905: Audh (Oudh, Oude, spr. aud), Teil der Nordwestprovinzen des britisch-ind. Kaiserreichs (s. Karte »Ostindien«), zwischen Ganges und Nepal, 63,983 qkm groß mit (1891) 12,650,831 Einw. (11,016,209 Hindu, 1,620,930 Mohammedaner, 9316 Christen). Das fast ganz ebene Land wird durchflossen von den schiffbaren Nebenflüssen des Ganges: Gogra und Gumti. Zahlreiche große und kleine Seen sind Über das Land zerstreut. Die mittlere Jahrestemperatur beträgt 25°; die jährliche Regenmenge wechselt zwischen 710 und 960 mm. Die wilden Tiere sind meist ausgerottet, doch finden sich noch Leoparden, Wölfe, Nylgaus, Autil open, verwildertes Rindvieh, zahlreiches wildes Geflügel, Giftschlangen. Ackerbau ist die Hauptbeschäftigung, ihm sind 3,549,480 Hektar gewidmet; Hauptprodukte sind Reis, Weizen, Mohn, Ölsaat, Zuckerrohr, Baumwolle, Indigo, Tabak. Künstlich bewässert werden 1,003,004 Hektar. Der Viehstand betrug 1890: 135,869 Pferde, 62,599 Maultiere und Esel, 5,770,271 Rinder, 1,191,715 Büffel u. 1,698,556 Schafe und Ziegen. Der Fischerei dienen 2954 Boote. Waldungen mit wertvollen Holzarten finden sich an der Nordgrenze; die staatlichen Waldungen bedecken 2800 qkm. Der früher starken Salzgewinnung ist aus fiskalischen Gründen ein Ende gemacht worden; andre wertvolle Mineralien finden sich nicht. Die Industrie (Indigobereitung, Gold- und Silberarbeiten, Musselinweberei, Stickerei) ist unbedeutend, der Handel (auch mit Nepal) lebhaft. Die Rohilkand-A.-Eisenbahn steht mit der am Südufer des Ganges hinziehenden East Indian-Eisenbahn in Verbindung, eine dritte Linie durchschneidet die Provinz von S. nach N. A. steht seit 1877 unter dem Gouverneur der Nordwestprovinzen, der jedoch seine Erlasse für A. als Oberkommissar von A. zeichnet, das auch meist eigene Verwaltung hat. A. ist eingeteilt in vier Divisionen (Lakhnau, Sitapur, Faizabad, Rai Bareli) zu je drei Distrikten. Hauptort ist Lakhnau. – A., das Pantschalâ in Manus Gesetzbuch, ist in der alti…
pref label: Oudh-Leute
in scheme: travel!digital Thesaurus

Oudh-Leute
type: Label
in scheme: travel!digital Thesaurus

Japaner
type: Concept
alt label: Japanese
pref label: Japaner
in scheme: travel!digital Thesaurus
definition: Duden: Einwohnerbezeichnung | [Anm.: unvollständig: Einwohnerbezeichnung zu Japan] | Duden: Japan: Inselstaat in Ostasien | Meyers Großes Konversations-Lexikon 1907: Japān (hierzu Karte »Japan und Korea«), Inselreich im äußersten Osten Asiens, das Nihón, Nippón oder Dai Nippon der Japaner, im Mittelalter Zipangu genannt. Diese Namen stammen teils von der chinesischen Bezeichnung Dschipönnkwo, teils von den sinisch-japanischen Wörtern Nitus (»Sonne«) und Hon (»Ursprung, Ausgang«), also »Land des Sonnenaufgangs«, »Morgenland«, »Orient«. | Lage und Grenzen. Das japanische Reich erstreckt sich in einer langen, aus 3850 großen und kleinen Inseln und Klippen bestehenden Reihe von 21°05' nördl. Br. (Südkap von Formosa) bis 51° nördl. Br. (Schumschir, die nördlichste der Kurilen) und von 119° östl. L. (Pescadores) bis 156°36' (Schumschir). Das Reich wird begrenzt im N. durch die Kurilenstraße gegen Kamtschatka, im O. und S. durch den Stillen Ozean, im W. durch das Ochotskische und Japanische Meer und das Chinesische Ostmeer. Durch die Lapérousestraße wird J. von der Insel Sachalin, durch die Koreastraße von Korea geschieden. Die lange Inselreihe gliedert sich in fünf Gruppen: 1) Altjapan, das eigentliche J. zwischen Colnett- und Tsugarustraße, 30–411/2° nördl. Br., in ältester Zeit Oya-schima (»die großen acht Inseln«) genannt, die Inseln Hondo (Honschu), Kiusiu, Sikoku, Awaji, Sado, Okischima, Iki und Tsuschima umfassend, denen sich noch Tanegaschima und Yakuschima im S., Koshikischima, Amakusaschima und die Gotoschima (»Fünfinseln«) im W. von Kiusiu, ferner die Schichito (»Siebeninseln«) im S. von Hondo zugesellen. 2) Die Insel Jeso, von den Japanern Hokkaidô (»Nordseestraße«) genannt, nordöstlich von Hondo zwischen der Tsugarustraße und der Lapérousestraße. 3) Die Kurilen (japan. Chi-schima, »Tausendinseln«), 36 größere Inseln zwischen Jeso und Kap Lopatka. 4) Die Liukiu-Inseln (Lu-tschu, Riu-Kiu), amtlich Okinawa, zwischen der Colnettstraße und der Insel Formosa. 5) Die…
alternative label: Japanese
related match: Japan

Japanese
type: Label
in scheme: travel!digital Thesaurus

Japaner
type: Label
in scheme: travel!digital Thesaurus

punisch
type: Concept
pref label: punisch
narrower: griechisch-punisch
related: phönizisch
related: karthagisch
alt label: neupunisch
related: Punier
narrower: punisch-libysch
narrower: punisch-ionisch
narrower: punisch-römisch
definition: bdk: siehe phönizisch, karthagisch | Duden: die Punier betreffend; von den Puniern stammend, zu ihnen gehörend | [Anm.: unvollständig: die Punier betreffend; von den Puniern stammend, zu ihnen gehörend]
alternative label: neupunisch
in scheme: travel!digital Thesaurus

punisch
type: Label
in scheme: travel!digital Thesaurus

karthagisch
type: Concept
definition: Duden: Karthago, die Karthager betreffend; aus Karthago stammend | [Anm.: unvollständig: Karthago, die Karthager betreffend; von den Karthagern stammend, zu ihnen gehörend; in Karthago gelegen]
related: Karthager
pref label: karthagisch
in scheme: travel!digital Thesaurus
related: phönizisch

karthagisch
type: Label
in scheme: travel!digital Thesaurus

neupunisch
type: Label
in scheme: travel!digital Thesaurus

punisch-ionisch
type: Concept
in scheme: travel!digital Thesaurus
pref label: punisch-ionisch
definition: bdk: siehe phönizisch, karthagisch, ionisch

punisch-ionisch
type: Label
in scheme: travel!digital Thesaurus

punisch-römisch
type: Concept
in scheme: travel!digital Thesaurus
pref label: punisch-römisch
definition: bdk: siehe phönizisch, karthagisch, römisch

punisch-römisch
type: Label
in scheme: travel!digital Thesaurus

assyrisch
type: Concept
narrower: babylonisch-assyrisch
narrower: assyrisch-griechisch
preferred label: assyrian @en
pref label: assyrian
pref label: assyrisch
related: Assyrer
in scheme: travel!digital Thesaurus
definition: Duden: Assyrien betreffend | [Anm.: unvollständig: Assyrien, die Assyrer bestreffend; von den Assyrern stammend zu ihnen gehörend; in Assyrien gelegen]

assyrian
type: Label
isTranslationOf: assyrisch
in scheme: travel!digital Thesaurus

assyrisch
type: Label
hasTranslation: assyrian
in scheme: travel!digital Thesaurus

Tuscarora
type: Concept
alternative label: Tuscarora-Indianer
alt label: Tuscarora-Indianer
pref label: Tuscarora
related: Indianer
definition: Meyers Großes Konversations-Lexikon 1909: Tuscaróra, nordamerikan. Indianerstamm der Irokesen. Früher in Nordcarolina ansässig, wurden die T. 1712 in den Bund der Irokesen (s. d.) aufgenommen und folgten Ende des 18. Jahrh. den Mohawk nach Kanada. Reste des Stammes bewohnen eine Reservation im Staate New York. | Quelle: Meyers Großes Konversations-Lexikon, Band 19. Leipzig 1909, S. 841. | Permalink: http://www.zeno.org/nid/20007617429
in scheme: travel!digital Thesaurus

Tuscarora-Indianer
type: Label
in scheme: travel!digital Thesaurus

Tuscarora
type: Label
in scheme: travel!digital Thesaurus

ionisch
type: Concept
definition: Duden: 1. Ionien, die Ionier betreffend | 2. die Kunst der Ionier betreffend | [Anm.: unvollständig: Ionien, die Ionier betreffend; von den Ioniern stammend, zu ihnen gehörend; in Ionien gelegen]
related: Ionier
in scheme: travel!digital Thesaurus
pref label: ionien
preferred label: ionian @en
pref label: ionisch
preferred label: ionien @fr
pref label: ionian
narrower: punisch-ionisch

ionien
type: Label
in scheme: travel!digital Thesaurus
isTranslationOf: ionisch
hasTranslation: ionian

ionisch
type: Label
in scheme: travel!digital Thesaurus
hasTranslation: ionien
hasTranslation: ionian

ionian
type: Label
in scheme: travel!digital Thesaurus
isTranslationOf: ionisch
hasTranslation: ionien

Creek
type: Concept
definition: Meyers Großes Konversations-Lexikon 1907: Krik (Creeks), zur Sprachgruppe der Tschokta-Muskogi gehöriger Indianerstamm in den Vereinigten Staaten von Nordamerika, der früher in Georgia, Alabama und Tennessee wohnte, aber 1836–38 in[682] das Indianerterritorium versetzt wurde. Schon vor Ankunft der Europäer trieben die K. ausgedehnten Ackerbau, bauten Mais, Bohnen und Tabak, hatten feste Wohnsitze und eine Art Bilderschrift. Ihre religiösen Gebräuche waren sehr entwickelt; sie verehrten das Prinzip der Fruchtbarkeit und feierten ein großes Fest zur Erntezeit. Sie zählten über 20 Geschlechter, Ehen innerhalb eines Geschlechts waren verboten, der Häuptling, bisweilen eine Frau, wurde auf Lebenszeit aus einem bestimmten Geschlecht gewählt. Die K. schieden sich in zwei Abteilungen: eine nördliche, die Muskogi, und eine südliche, die Seminolen (s. d.). Unter ihrem Häuptling MacGillivray eroberten die K. 1813 das Fort Minas, wurden aber vom General Jackson vollständig unterworfen. Gegenwärtig werden die in der Kultur ziemlich weit vorgeschrittenen und zum Christentum bekehrten K. mit den Seminolen, Tschokta, Tschikasa und Tscherokesen zu den fünf zivilisierten Stämmen oder Nationen gerechnet. Nach dem Zensus von 1900 zählte die Nation der K. 40,674 Seelen, unter diesen etwa drei Viertel Weiße. Sie haben eine geschriebene Verfassung und wählen ihre Häuptlinge und Vertreter, welch letztere den Großen Rat (Grand Council) bilden. Vgl. M. A. Owen, Folk lore of the Musquaki Indians (Lond. 1905). | Quelle: Meyers Großes Konversations-Lexikon, Band 11. Leipzig 1907, S. 682-683. | Permalink: http://www.zeno.org/nid/20006945422
in scheme: travel!digital Thesaurus
related: Indianer
pref label: Creek

Creek
type: Label
in scheme: travel!digital Thesaurus

keltisch
type: Concept
narrower: germanisch-keltisch
pref label: keltisch
related: Kelte
in scheme: travel!digital Thesaurus
definition: Duden: die Kelten betreffend; von den Kelten stammend, zu ihnen gehörend

germanisch-keltisch
type: Concept
definition: bdk: siehe germanisch, keltisch
in scheme: travel!digital Thesaurus
pref label: germanisch-keltisch

germanisch-keltisch
type: Label
in scheme: travel!digital Thesaurus

keltisch
type: Label
in scheme: travel!digital Thesaurus

Innuit
type: Concept
alternative label: Eskimo
definition: Duden: Inuk: Selbstbezeichnung der Eskimos, besonders in Kanada, Nordalaska und Grönland | Meyers Großes Konversations-Lexikon 1906: Eskĭmo, weitverbreiteter Volksstamm des arktischen Amerika, der fast alle Küsten des Festlandes von der Straße Belle Isle am Atlantischen Ozean bis zur Eisbai des Großen Ozeans am Fuße des Eliasberges sowie die Küsten der benachbarten Inseln und Grönlands bewohnt. Zu ihnen gehören auch die Alëuten (s.d.) und die asiatischen Yuit an der Küste der Tschuktschen-Halbinsel vom Ostkap bis zum Anadyr-Golf. An der Westküste Grönlands gehen die E. bis 78° nördl. Br. hinaus. Ihren Namen (eigentlich Eski-mwhan, »Rohfleischesser«) haben sie von dem Algonkinstamm der Abenaki erhalten. Sie selbst nennen sich Innuit (»Menschen«). Ihre Gesamtzahl dürfte trotz der gewaltigen Ausdehnung ihres Gebietes 40,000 nicht überschreiten, von denen etwa 11,000 in Grönland, 1500 in Labrador und 13,000 in Alaska leben. Entgegen der frühern Ansicht, daß die E. asiatischen Ursprungs und über die Beringstraße eingewandert seien, suchen jetzt die meisten Forscher die Ursitze in Amerika, sei es an der Hudsonbai (Boas), sei es im südlichen Alaska (Rink). | Die E. (s. Tafel »Amerikanische Völker I«, Fig. 3 u. 4) sind meist unter Mittelgröße, dabei aber stark und gewandt. Ihr Schädel ist lang und hoch, das Gesicht breit und platt, die Backenknochen hervorstehend, die Augen dunkel und geschlitzt, das Haar schwarz und straff, der Bartwuchs wenig entwickelt, die Haut gelbbraun, Hände und Füße auffallend klein. Im allgemeinen sind die westlichen E. ein schönerer Menschenschlag als die östlichen. Die wichtigste Beschäftigung der E. ist der Fang von Seehunden, Renntieren und Walfischen, die ihnen alles liefern, dessen sie an Nahrung, Kleidung und Gerätschaften bedürfen. Im Sommer, wenn die Renntiere herdenweise wandern,[106] fängt der E. seinen Bedarf mit Hilfe von Schlingen, Fallgruben, Speeren und Pfeilen. Die Felle der jungen Tiere liefern ihm warme Kleider, welche die Frauen…
pref label: Innuit
in scheme: travel!digital Thesaurus
alt label: Eskimo

Innuit
type: Label
in scheme: travel!digital Thesaurus

Eskimo
type: Label
in scheme: travel!digital Thesaurus

Chinook-Indianer
type: Concept
pref label: Chinook-Indianer
in scheme: travel!digital Thesaurus
related: Indianer
definition: Meyers Großes Konversations-Lexikon 1909: Tschinuk (engl. Chinook oder Chenook), nordamerikan. Indianervolk an der pazifischen Küste, in Oregon und Washington. Ihre Sprache wird nur noch von wenigen Individuen gesprochen, doch ist sie die Grundlage eines an der Küste bis hinauf nach Alaska verbreiteten Handelsjargons, der außer indianischen noch englische und französische Wörter enthält. Vgl. Hale, Manual of the Oregon trade language or Chinook Jargon (Lond. 1890); Boas, Chinook texts (Washingt. 1894). | Quelle: Meyers Großes Konversations-Lexikon, Band 19. Leipzig 1909, S. 779. | Permalink: http://www.zeno.org/nid/20007612230

Chinook-Indianer
type: Label
in scheme: travel!digital Thesaurus

Belgier
type: Concept
definition: Duden: Einwohnerbezeichnung | [Anm.: unvollständig: Einwohnerbezeichnung zu Belgien] | Duden: Belgien: Staat in Westeuropa | siehe auch: Meyers Großes Konversations-Lexikon 1905: Belgĭen | Quelle: Meyers Großes Konversations-Lexikon, Band 2. Leipzig 1905, S. 592-605. | Permalink: http://www.zeno.org/nid/20006309631
related match: Belgium
pref label: Belgier
in scheme: travel!digital Thesaurus

Belgier
type: Label
in scheme: travel!digital Thesaurus

fränkisch
type: Concept
preferred label: franka @tr
narrower: griechisch-fränkisch
pref label: fränkisch
in scheme: travel!digital Thesaurus
preferred label: franco @it
definition: Duden: Franken, die Franken (2) betreffend; aus Franken stammend | [Anm.: unvollständig: Franken, die Franken betreffend; von den Franken stammend, zu ihnen gehörend; in Franken gelegen] | Duden: Franken: Landschaft in Bayern und Baden-Württemberg
pref label: franco
related: Franke
pref label: franka
pref label: franc
preferred label: franc @fr

fränkisch
type: Label
hasTranslation: franc
in scheme: travel!digital Thesaurus
hasTranslation: franka
hasTranslation: franco

franc
type: Label
isTranslationOf: fränkisch
in scheme: travel!digital Thesaurus
hasTranslation: franka
hasTranslation: franco

franka
type: Label
isTranslationOf: fränkisch
hasTranslation: franc
hasTranslation: franco
in scheme: travel!digital Thesaurus

franco
type: Label
isTranslationOf: fränkisch
hasTranslation: franka
in scheme: travel!digital Thesaurus
hasTranslation: franc

Franke
type: Concept
pref label: frändji
preferred label: frändji @ar
definition: Duden: 1. Angehöriger eines westgermanischen Volksstammes | 2. Einwohnerbezeichnung zu Franken | Duden: Franken: Landschaft in Bayern und Baden-Württemberg | Meyers Großes Konversations-Lexikon 1906: Franken, das bedeutendste der Stammesherzogtümer, in die Deutschland nach dem Ausgang der karolingischen Dynastie zerfiel (s. die »Geschichtskarte von Deutschland I«). Von alters her wurde es als Kern des aus der einstigen fränkischen Monarchie erwachsenen Deutschen Reiches angesehen, weshalb auch der deutsche König, welchem Stamm er auch angehören mochte, durch die Wahl, die meist auf fränkischer Erde geschah, für seine Person das Recht der Franken (vgl. den Artikel »Frankenreich«) erhielt. Die Grenze des Herzogtums F., zu dem auf dem linken Rheinufer gegen Lothringen hin noch das Gebiet von Worms, Mainz und Speyer gehörte, zog sich auf der rechten Seite des Rheins zwischen Sachsen, Bayern und Alemannien hin; im N. ward sie ungefähr durch den Lauf der Sieg, Eder und Werra sowie durch den Thüringer Wald, im O. durch das Fichtelgebirge und die Wasserscheide zwischen Rednitz und Nab, im S. durch die Altmühl, Wernitz, den obern Kocher, die Enz und Murg bezeichnet. Es zerfiel in Francia orientalis (Ostfranken, Franconia; vgl. den Artikel »Fränkischer Kreis«), das Gebiet auf beiden Seiten des Mains, dessen Mittelpunkt Würzburg war, und Francia Rhenensis (Rheinfranken), das Land um den Rhein und insbes. die Gaue am linken Ufer dieses Flusses; als die Grenze zwischen beiden Teilen von F. kann der Spessart angesehen werden. | Zu Anfang des 10. Jahrh. wetteiferten zwei Geschlechter um die herzogliche Gewalt in F.: das Haus der Popponen oder Babenberger (s. Babenberg), deren Besitzungen in dem spätern Bamberg ihren Mittelpunkt hatten, und das Haus der Konradiner, die aus dem Niederlahngau stammten und in Ostfranken und Thüringen begütert waren. Unter Ludwig dem Kind brach zwischen beiden ein heftiger Kampf, die Babenberger Fehde (s.d.), aus, in der sich der König und die Kirche a…
pref label: Franke
in scheme: travel!digital Thesaurus
related match: Franconia

frändji
type: Label
in scheme: travel!digital Thesaurus
isTranslationOf: Franke

Franke
type: Label
in scheme: travel!digital Thesaurus
hasTranslation: frändji

Mäoner
type: Concept
definition: bdk: Einwohnerbezeichnung zu Mäonien | bdk: Mäonien: griechische Bezeichnung für Lydien | Meyers Großes Konversations-Lexikon 1907: Mäonĭen, bis ins 2. Jahrh. n. Chr. gebräuchlicher Name des östlichen Lydien in Kleinasien. | Quelle: Meyers Großes Konversations-Lexikon, Band 13. Leipzig 1908, S. 258. | Permalink: http://www.zeno.org/nid/20007049056
related match: Lydia
in scheme: travel!digital Thesaurus
related: Lyder
pref label: Mäoner

Mäoner
type: Label
in scheme: travel!digital Thesaurus

italisch
type: Concept
definition: Duden: die Italer betreffend, von den Italern stammend, zu ihnen gehörend Duden: Italer: Einwohner des antiken Italien | Brockhaus' Kleines Konversations-Lexikon 1911: Ităler, im Altertum kleines Volk auf der Südspitze Italiens, von denen der Name allmählich auf die ganze Halbinsel ausgedehnt wurde. | Quelle: Brockhaus' Kleines Konversations-Lexikon, fünfte Auflage, Band 1. Leipzig 1911., S. 878. | Permalink: http://www.zeno.org/nid/20001219545
related match: Italic peoples
in scheme: travel!digital Thesaurus
pref label: italisch

italisch
type: Label
in scheme: travel!digital Thesaurus

Beni Soleïm
type: Concept
in scheme: travel!digital Thesaurus
pref label: Beni Soleïm
definition: bdk: arabischer Nomadenstamm
related: Nomade
related: Araber

Beni Soleïm
type: Label
in scheme: travel!digital Thesaurus

Sebulon
type: Concept
definition: Meyers Großes Konversations-Lexikon 1909: Sebŭlon (hebr., »Anwohner«), Sohn Jakobs und Leas, dessen Stamm im Nordosten Palästinas, mit Kanaanitern und Phönikern vermischt, wohnte und namentlich Seehandel trieb. Tiglath-Pileser scheint S., das nur selten in der Geschichte hervorgetreten war, 734/733 mit Assyrien vereinigt zu haben. | Quelle: Meyers Großes Konversations-Lexikon, Band 18. Leipzig 1909, S. 236. | Permalink: http://www.zeno.org/nid/20007453302
pref label: Sebulon
in scheme: travel!digital Thesaurus

Sebulon
type: Label
in scheme: travel!digital Thesaurus

lykaonisch
type: Concept
related match: Lycaonia
definition: bdk: Lykaonien, die Einwohner von Lykaonien betreffend; von den Einwohnern von Lykaonien stammend, zu ihnen gehörend; in Lykaonien gelegen | bdk: Lykaonien: antike Landschaft in Kleinasien | Meyers Großes Konversations-Lexikon 1908: Lykaōnĭen, im Altertum eine Landschaft Kleinasiens, von Kappadokien, Galatien, Phrygien, Isaurien und Kilikien begrenzt, im N. eine flache Wüste, im S. bergig, unfruchtbar und nur zur Schafzucht geeignet. Hauptstadt war Ikonion. Das Volk der Lykaonier, das den Persern gegenüber sich unabhängig erhielt, dann aber den Mazedoniern und seit 25 v. Chr. den Römern untertan war, hatte seine eigne, weder arische noch semitische Sprache. S. Karte »Römisches Reich«. | Quelle: Meyers Großes Konversations-Lexikon, Band 12. Leipzig 1908, S. 896. | Permalink: http://www.zeno.org/nid/20007027885
pref label: lykaonisch
in scheme: travel!digital Thesaurus

lykaonisch
type: Label
in scheme: travel!digital Thesaurus

Französin
type: Concept
definition: Duden: weibliche Form zu Franzose (1)
pref label: Französin
in scheme: travel!digital Thesaurus
related: Franzose

Französin
type: Label
in scheme: travel!digital Thesaurus

ʿAgêl
type: Concept
related: Beduine
alt label: ʿAgêl-Beduine
alternative label: ʿAgêlât
definition: bdk: arabische Stammesgemeinschaft in Syrien
alternative label: ʿAgêl-Beduine
alternative label: ʿAgêlbeduine
alt label: ʿAgêlât
alt label: ʿAgêlbeduine
pref label: ʿAgêl
in scheme: travel!digital Thesaurus

ʿAgêl-Beduine
type: Label
in scheme: travel!digital Thesaurus
hasVariant: ʿAgêlbeduine

ʿAgêlbeduine
type: Label
in scheme: travel!digital Thesaurus
isVariantOf: ʿAgêl-Beduine

ʿAgêlât
type: Label
in scheme: travel!digital Thesaurus

ʿAgêl
type: Label
in scheme: travel!digital Thesaurus

arabisiert
type: Concept
definition: Duden: arabisieren: an die arabische Sprache und Kultur angleichen
in scheme: travel!digital Thesaurus
pref label: arabisiert
related: arabisch
related: Araber

arabisiert
type: Label
in scheme: travel!digital Thesaurus

Kureisch
type: Concept
definition: Meyers Großes Konversations-Lexikon 1907: Koreísch (Kureísch), mythischer Stammvater des arab. Stammes der Koreischiten (Kureischiten), der aus verschiedenen Stammgruppen zusammengewachsenen Einwohnerschaft von Mekka. Vgl. Omaijaden. | Quelle: Meyers Großes Konversations-Lexikon, Band 11. Leipzig 1907, S. 493. | Permalink: http://www.zeno.org/nid/20006930565
pref label: Kureisch
in scheme: travel!digital Thesaurus

Kureisch
type: Label
in scheme: travel!digital Thesaurus

osmanisch
type: Concept
alternative label: ottomanisch
preferred label: ottomane @fr
related: türkisch
pref label: osmanisch
in scheme: travel!digital Thesaurus
related: Osmane
pref label: ottomane
alt label: impériale-ottomane
alternative label: impériale-ottomane @fr
definition: Duden: die Osmanen, ihr Reich betreffend, von den Osmanen stammend, zu ihnen gehörend | [Anm.: unvollständig: das Osmanische Reich, die Osmanen betreffend; von den Osmanen stammend, zu ihnen gehörend; im Osmanischen Reich gelegen]
alt label: ottomanisch

osmanisch
type: Label
hasTranslation: ottomane
in scheme: travel!digital Thesaurus

ottomane
type: Label
isTranslationOf: osmanisch
in scheme: travel!digital Thesaurus

impériale-ottomane
type: Label
in scheme: travel!digital Thesaurus

ottomanisch
type: Label
in scheme: travel!digital Thesaurus

Onondaga
type: Concept
definition: Meyers Großes Konversations-Lexikon 1908: Onondaga, nordamerikan. Indianerstamm, der zum Bunde der Irokesen (s. d.) gehörte. Im Staate New York lebten 1898 auf einer Reservation 383 Seelen. | Quelle: Meyers Großes Konversations-Lexikon, Band 15. Leipzig 1908, S. 64. | Permalink: http://www.zeno.org/nid/20007184794
in scheme: travel!digital Thesaurus
related: Indianer
pref label: Onondaga

Onondaga
type: Label
in scheme: travel!digital Thesaurus

Turkomane
type: Concept
pref label: Turkomane
alternative label: Türkenstamm
related: Nomade
alt label: Türkenstamm
related: Türke
related match: Turkmens
definition: Duden: Turkmene: 1. Angehöriger eines Turkvolkes | 2. Einwohnerbezeichnung zu Turkmenistan | Pierer's Universal-Lexikon 1864: Turkmanen (Turkomanen, Truchmenen, eigentlich Uzen, bei den Arabern Goz), nomadische Horden von tatarischer Abstammung u. verwandt mit den Türken, sind von Körperbau mehr klein als groß, von gelblich brauner Gesichtsfarbe, langer gerader Nase, schwarzen feurigen Augen; leben schmutzig, einfach, gastfrei; sind stolz, aber auch kriechend, träge, abergläubisch, herrschsüchtig, doch auch tapfer u. gegen Wehrlose großmüthig. In China u. Buchara, in Persien, Schirwan, Daghestan, Armenien, Kleinasien, Syrien u. Afghanistan mit einzelnen Zweigen, bald mehr, bald minder zahlreich lebend, haben sie ihren Hauptsitz in Turan (s.d.), westlich u. südlich von China bis an das Kaspische Meer u. das Hochland Persiens, eine theils ganz flache, theils hügelige Sandwüste, die im Norden an das russische Gebiet der kleinen Kirgisenhorde stößt u. in ihrem Umfange auch den Ustjurt, den sogenannten Truchmenen-Isthmus zwischen Kaspischem u. Aralsee mit umfaßt (Turkmanenland). Die T. der Wüste zerfallen in neun Hauptstämme: Salar, Sarub, Ersari, Tuka (Teke) u. Sakar im Osten, Jamud, Goklan, Ata u. Tschödar im Westen, zusammen etwa 600,000. Jeder Stamm zerfällt wieder in mehre Tir (Bogen). Zum Theil leben sie ganz unabhängig (Sprichwort unter ihnen ist: Der T. ruht weder unter dem Schatten eines Baumes, noch unter dem Schutze eines Königs), zum Theil stehen sie unter dem Schutze des Khan von Chiwa u. des Schah von Persien. Sie bekennen sämmtlich den Islam u. gehören zur Secte der Sunniten. Von Dörfern u. Städten ist bei ihnen gar nicht die Rede; sie kennen nur Lager u. Filzhütten (Chirga). Sie leben ausschließlich von Viehzucht u. Raub; jeder Tir hat seine eigenen bestimmten Weideplätze. Die Frauen werden von den Eltern für Vieh erkauft u. führen ein Leben wie Sklavinnen; die Preise sind hoch, daher wohl keine Vielweiberei. Die Kinder wachsen ohne alle Zucht heran u. be…
in scheme: travel!digital Thesaurus

Turkomane
type: Label
in scheme: travel!digital Thesaurus

Türkenstamm
type: Label
in scheme: travel!digital Thesaurus

kroatisch
type: Concept
definition: Duden: 1. Kroatien, die Kroaten betreffend; von den Kroaten stammend, zu ihnen gehörend | [Anm.: unvollständig: Kroatien, die Kroaten betreffend; von den Kroaten stammend, zu ihnen gehörend; in Kroatien gelegen] | Duden: Kroatien: Staat in Südosteuropa | Meyers Großes Konversations-Lexikon 1907: Kroatien-Slawonien (kroat. Hrvatskai Slavonija, magyar. Horvát-Szlavonország, spr. hórwāt ßláwōnórßāg), Königreich, das mit der ehemaligen kroatisch-slawonischen Militärgrenze einen Bestandteil der Länder der ungarischen Krone bildet (s. die Karten »Österreich-Ungarn« und »Ungarn«). Es grenzt im W. an das Adriatische Meer, Istrien, Krain und Steiermark, im N. und O. an Ungarn und im S. an Dalmatien, Bosnien und Serbien und hat einen Flächenraum von 42,531 qkm (772,4 QM.). Hiervon nimmt das kroatische Gebiet 13,524 qkm, das slawonische 9435 qkm und die ehemalige Militärgrenze 19,571 qkm ein. In orographischer Beziehung wird das Land von der Kulpa in zwei voneinander verschiedene Gebiete geteilt, in eine nördliche, von den Ausläufern der südöstlichen Alpen durchzogene, waldreiche und fruchtbare Alpenlandschaft und in ein südliches, von kalkartigem Karstgestein erfülltes rauhes Hochland. Die Alpenausläufer dringen mit ihren schmalen und sich gegen O. zu verflachenden Höhenzügen von der krainischen und steierischen Grenze in östlicher Richtung in die von der Drau, Donau und Save begrenzte, sich allmählich verengernde Landzunge bis an die Theißmündung und werden im N. und S. von breiten, ebenen Streifen eingefaßt, die sich längs der Drau und Save hinziehen. Der 350 km lange nördliche Gebirgszug beginnt mit dem an der Grenze gegen Krain sich erhebenden Uskokengebirge (1175 m) und dem Matzelgebirge (bis 620 m), an das sich südlich das Ivančicagebirge (1061 m) und das Sljeme- oder Agramer Gebirge (1035 m), östlich das Kalnikgebirge (645 m) anschließen. Der nun folgende niedrige Zug des Bielo Vrh bildet eine Verbindung mit den südöstlichen slawonischen Berggruppen, die im Czerni Vrh …
related match: Croats
related match: Croatia
in scheme: travel!digital Thesaurus
pref label: kroatisch
narrower: ungarisch-kroatisch

kroatisch
type: Label
in scheme: travel!digital Thesaurus

Beni Hilal
type: Concept
pref label: Beni Hilal
in scheme: travel!digital Thesaurus
definition: bdk: arabischer Nomadenstamm | Pierer's Universal-Lexikon 1859: Hilal, einst mächtiges, jetzt armes arabisches Räubervolk auf der Grenze von Jemen u. Hedschaz; gehören zu den von Muhammed unbesiegten u. unbekehrten Ureinwohnern. | Quelle: Pierer's Universal-Lexikon, Band 8. Altenburg 1859, S. 372. | Permalink: http://www.zeno.org/nid/20010113827
related: Nomade
related: Araber

Beni Hilal
type: Label
in scheme: travel!digital Thesaurus

magnesisch
type: Concept
definition: bdk: Magnesia, die Magneten/Magnesier betreffend; von den Magneten/Magnesiern stammend, zu ihnen gehörend; in Magnesia gelegen
related: Magnesier
in scheme: travel!digital Thesaurus
pref label: magnesisch

Magnesier
type: Concept
related match: Magnesia (regional unit)
related match: Magnetes
pref label: Magnesier
related match: Magnesia ad Sipylum
alt label: Magneten
definition: bdk: Einwohnerbezeichnung zu Magnesia | Duden: Magnesia: Landschaft Thessaliens; heute Magnisia | Meyers Großes Konversations-Lexikon 1908: Magnesĭa, 1) östlichste, selbständige Landschaft Thessaliens (s. d.). – 2) (M. ad Sipylum) Stadt in Lydien, am nördlichen Abhang des Sipylos, berühmt durch den Sieg der Römer über Antiochos (190 v. Chr.); jetzt Manisa. – 3) Stadt in Karien (Ionien), nördlich vom Mäander und am östlichen Abhang des Thorax, angeblich Gründung des thessalischen M., eine der drei Städte, die Artaxerxes dem Themistokles schenkte (der sich gewöhnlich hier aufhielt), und berühmt durch einen Tempel der Artemis Leukophryene, dessen Trümmer beim heutigen Tekke liegen. Dieselben sowie die Agora mit dem Tempel des Zeus Sosipolis sind 1890–93 durch Humann, Heyne und Kern ausgegraben worden. Vgl. O. Kern, Die Inschriften von M. am Mäander (Berl. 1900); Humann, M. am Mäander. Bericht über die Ergebnisse der Ausgrabungen der Jahre 1891–1893 (das. 1904; die Bauwerke bearbeitet von J. Kohte, die Bildwerke von Watzinger). | Quelle: Meyers Großes Konversations-Lexikon, Band 13. Leipzig 1908, S. 80. | Permalink: http://www.zeno.org/nid/20007034245
alternative label: Magneten
in scheme: travel!digital Thesaurus

Magnesier
type: Label
in scheme: travel!digital Thesaurus

Magneten
type: Label
in scheme: travel!digital Thesaurus

magnesisch
type: Label
in scheme: travel!digital Thesaurus

Siniter
type: Concept
definition: Pierer's Universal-Lexikon 1863: Siniter (Sini), kleiner, ackerbauender kanaanitischer Volksstamm, nördlich von Tripolis zwischen den Arekitern u. Arevadikern, kamen später in Abhängigkeit von Sidon u. Aradus. Nach. ihnen scheint das ituräische Raubschloß Sinna (s.d.) benannt zu sein, wohin sich schließlich die S. flüchteten u. wo die Ituräer ihre Nachkommen waren. | Quelle: Pierer's Universal-Lexikon, Band 16. Altenburg 1863, S. 128. | Permalink: http://www.zeno.org/nid/20010937196 | Pierer's Universal-Lexikon 1863: Sinim, in der Bibel eine ferne Gegend im Süden od. im Osten von Palästina, im letztern Falle wohl so v.w. Land der Sinä (Chinesen). | Quelle: Pierer's Universal-Lexikon, Band 16. Altenburg 1863, S. 128. | Permalink: http://www.zeno.org/nid/20010937099
related match: Sinim
pref label: Siniter
in scheme: travel!digital Thesaurus

Siniter
type: Label
in scheme: travel!digital Thesaurus

dacisch
type: Concept
definition: Duden: dakisch: die Landschaft Dakien oder die Dakier betreffend | [Anm.: unvollständig: Dacien, die Dacier betreffend; von den Daciern stammend, zu ihnen gehörend; in Dacien gelegen]
pref label: dacisch
related: Dacier
in scheme: travel!digital Thesaurus

dacisch
type: Label
in scheme: travel!digital Thesaurus

Dacier
type: Concept
related match: List of ancient tribes in Thrace and Dacia
related match: Roman Dacia
definition: Duden: Daker: Einwohnerbezeichnung zu Dakien | Duden: Dakien: (im Altertum) das Land zwischen Theiß, Donau und Dnjestr | Meyers Großes Konversations-Lexikon 1905: Dacĭen (Dacia), bei den Römern Name des zwischen Theiß im W., den Karpathen im N., Donau im S., dem Dnjestr im O. gelegenen, an Getreide, Holz und Metallen (Gold) reichen Landes (s. Karte »Römisches Reich«). Seine Bewohner, thrakischer Abstammung, wurden von Herodot Agathyrsen, zu Menanders Zeit Dāer, von den Griechen Geten (die eigentlich ihre nächsten Verwandten waren), von den Römern meist Daker oder Dacier genannt und waren ihrer kriegerischen Gesinnung halber gefährliche Nachbarn Roms. Anfang des 2. vorchristlichen Jahrhunderts bestand bereits nördlich von der untern Donau ein Reich von Dakern unter einem König Rubobastes (oder Oroles), die mit den von der obern Weichsel vorstoßenden Bastarnern (s.d.) in schwere Kämpfe gerieten. König Burbista (Boirebista) erweiterte das dakische Reich zwischen 60 und 45 v. Chr. bis zum Dnjepr im O. und zur Donau im W.; sein Helfer beim innern Reformwerke warder Priester Dekaineos. Nach seinem Tode zerfiel sein großes Reich in vier, später in fünf Teile. Die Daker fielen mehrmals in Mösien, ja in Makedonien ein und mußten von Augustus und den folgenden Kaisern wiederholt zurückgetrieben werden. Domitian erkaufte nach mehrjährigen, teilweise siegreichen Kämpfen (85–89 n. Chr.) in schmählicher Weise den Frieden von dem großen König Decebalus (86–107), der D. wieder geeinigt hatte. Erst Trajan tilgte durch die Dakischen Kriege diese Schmach. 101 n. Chr. brach er gegen Decebalus auf, der das Gebiet vom Eisernen Tor bis zum Altfluß 102 an die Römer abtrat und auf eine selbständige Politik fortan verzichten wollte. Der Bruch dieser Zusage führte 105 den Kaiser, der sich seit 102 den Siegesnamen »Dacicus« beigelegt hatte, über die neuerbaute steinerne Brücke (Pons Trajani) am Eisernen Tor nochmals nach D. Die Eroberung der Hauptstadt Sarmizeq|etusa (beim heutigen Várhely im …
pref label: Dacier
in scheme: travel!digital Thesaurus

Dacier
type: Label
in scheme: travel!digital Thesaurus

Guanche
type: Concept
preferred label: guanche @es
definition: Meyers Großes Konversations-Lexikon 1907: Guanchen (Guanches, spr. ŭántsches), die ausgestorbenen Urbewohner der Kanarischen Inseln (s. d.). | Quelle: Meyers Großes Konversations-Lexikon, Band 8. Leipzig 1907, S. 479. | Permalink: http://www.zeno.org/nid/20006719015
pref label: guanche
in scheme: travel!digital Thesaurus
pref label: Guanche

guanche
type: Label
isTranslationOf: Guanche
in scheme: travel!digital Thesaurus

Guanche
type: Label
hasTranslation: guanche
in scheme: travel!digital Thesaurus

Auk-Indianer
type: Concept
definition: bdk: Ethnie im Bundesstaat Alaska
related: Indianer
related match: Taku people
in scheme: travel!digital Thesaurus
pref label: Auk-Indianer

Auk-Indianer
type: Label
in scheme: travel!digital Thesaurus

Niederländer
type: Concept
definition: Duden: Einwohnerbezeichnung | [Anm.: unvollständig: Einwohnerbezeichnung zu Niederlande] | Duden: Niederlande: Staat in Westeuropa | siehe auch: Meyers Großes Konversations-Lexikon 1908: Niederlande | Quelle: Meyers Großes Konversations-Lexikon, Band 14. Leipzig 1908, S. 632-650. | Permalink: http://www.zeno.org/nid/2000715366X
in scheme: travel!digital Thesaurus
pref label: Niederländer
related: Holländer
related match: Netherlands

Niederländer
type: Label
in scheme: travel!digital Thesaurus

kuthäisch
type: Concept
definition: bdk: Kutha, die Kuthäer betreffend; von den Kuthäern stammend, zu ihnen gehörend; in Kutha gelegen
in scheme: travel!digital Thesaurus
pref label: kuthäisch
related: Cuthäer

kuthäisch
type: Label
in scheme: travel!digital Thesaurus

Cuthäer
type: Concept
definition: bdk: Einwohnerbezeichnung zu Cutha/Kutha | Pierer's Universal-Lexikon 1860: Kutha (a. Geogr.), District Asiens, aus welchem Salmanassar Colonisten in das von ihm zerstörte Reich Israel versetzte. Durch Vermischung derselben mit den zurückgebliebenen Landeseingeborenen entstanden später die Samaritaner (s.d.), welche daher im Chaldäischen u. im Talmud Kuthim (Kuthäer) heißen, u. mehrere nicht semitische Wörter im Samaritanischen Dialekte werden deshalb gewöhnlich kuthaische genannt. Die Lage von K. ist ungewiß. | Quelle: Pierer's Universal-Lexikon, Band 9. Altenburg 1860, S. 929. | Permalink: http://www.zeno.org/nid/20010296107 | Meyers Großes Konversations-Lexikon 1907: Kutha (Kuth, baylonisch Kutu), alte babylonische Stadt (2 Kön. 17,24), heutzutage Ruinenstätte Tell Ibrahim etwa 10 engl. Meilen östlich von Babylon. Stadtgott war Nergal (s. d.), dessen Tempel Rassam 1880–81 in dem südlichen Teil des größern der beiden Trümmerhügel fand und teilweise bloßlegte. Nach dem Untergange des Reiches Israel wurden auch Einwohner aus K. nach Samarien verpflanzt; der Talmud nennt das Mischvolk der Samaritaner geradezu Kuthim (Kuthäer). | Quelle: Meyers Großes Konversations-Lexikon, Band 11. Leipzig 1907, S. 891. | Permalink: http://www.zeno.org/nid/20006960871
related match: Kutha
in scheme: travel!digital Thesaurus
pref label: Cuthäer

Cuthäer
type: Label
in scheme: travel!digital Thesaurus

marokkanisch
type: Concept
pref label: marokkanisch
in scheme: travel!digital Thesaurus
related: Marokkaner
definition: Duden: Marokko, die Marokkaner betreffend; von den Marokkanern stammend, zu ihnen gehörend | [Anm.: unvollständig: Marokko, die Marokkaner betreffend; von den Marokkanern stammend, zu ihnen gehörend; in Marokko gelegen]

marokkanisch
type: Label
in scheme: travel!digital Thesaurus

Marokkaner
type: Concept
definition: Duden: Einwohnerbezeichnung zu Marokko | Duden: Marokko: Staat in Nordwestafrika | Meyers Großes Konversations-Lexikon 1908: Marokko (von den Arabern Maghrib el Aksa, »der äußerste Westen«, oder El Gharb el Djoani genannt), Sultanat im NW. Afrikas, zwischen 27–36° nördl. Br. und 0–13° östl. L., im N. vom Mittelländischen Meer, im W. vom Atlantischen Ozean, im O. von Algerien und im S. von der Sahara begrenzt (s. Karte »Algerien, Marokko und Tunis«, im 1. Bd.). Nach der letzten Richtung hin ist die Grenze aber ganz unbestimmt. Von dem ganzen auf etwa 800,000 qkm berechneten Gebiet sind aber nur 456,000 qkm dem Sultan von M. wirklich untertan, nämlich das Beled el Machzen (»Land der Konskription«) genannte Gebiet, bestehend aus dem ehemaligen Königreich Fes mit Tanger und Tetuan, dem eigentlichen Königreich M., dem Sus an der Küste südlich vom Kap Ghir, die Oasen Tafilelt und Figig und das Land Udjda im NO. Dagegen heißen Beled es Siba die Regionen, deren verschiedene Stämme Steuern und Militärdienst verweigern und nur gelegentlich unterworfen werden: das Er Rif am Mittelmeer von Melilla bis Tetuan, die zentralen Teile des Atlas und im S. von Udjda das Territorium, dessen Mittelpunkt der Schott Tigri bildet. Tidikelt, Tuat, Gurara und andre Oasen der Sahara erkennen höchstens die religiöse Oberhoheit des Sultans an (vgl. Machzen). [...] | [Bevölkerung.] Die Zahl der Bewohner wurde von Tissot auf 12, von Rohlfs auf 6,5, von Lenz auf 8 Mill., nach den neuesten Berechnungen auf 7 Mill. geschätzt. Davon zählen die Berber (s. d.), die in Amazirghen, Schelluh (Schloh) und Kabylen zerfallen, gegen 4 Mill., die als Eroberer ins Land gekommenen Araber (s. Tafel »Afrikanische Völker I«, Fig. 3) nebst den ihnen eng verwandten, aus Spanien vertriebenen Mauren gegen 3 Mill., die aus Spanien, Portugal, Frankreich, England und Holland im 13.–15. Jahrh. vertriebenen Juden 100–150,000, die Neger (größtenteils Sklaven, die den Typus der Bevölkerung stark beeinflussen) 200,000, die Euro…
related match: Morocco
in scheme: travel!digital Thesaurus
pref label: Marokkaner
narrower: Südmarokkaner

Marokkaner
type: Label
in scheme: travel!digital Thesaurus

Südmarokkaner
type: Concept
in scheme: travel!digital Thesaurus
pref label: Südmarokkaner
definition: bdk: sie Marokkaner

Südmarokkaner
type: Label
in scheme: travel!digital Thesaurus

irisch
type: Concept
narrower: schottisch-irisch
pref label: irisch
in scheme: travel!digital Thesaurus
definition: Duden: Irland, die Iren betreffend; zu Irland gehörend, aus Irland stammend | [Anm.: unvollständig: Irland, die Iren betreffend; von den Iren stammend, zu ihnen gehörend; in Irland gelegen]
related: Irländer

irisch
type: Label
in scheme: travel!digital Thesaurus

Griechin
type: Concept
definition: Duden: weibliche Form zu Grieche
in scheme: travel!digital Thesaurus
pref label: Griechin
related: Grieche

Griechin
type: Label
in scheme: travel!digital Thesaurus

Navajo-Indianer
type: Concept
related: Indianer
in scheme: travel!digital Thesaurus
pref label: Navajo-Indianer
definition: Duden: Navajo: Angehöriger eines nordamerikanischen Indianerstammes | Meyers Großes Konversations-Lexikon 1908: Navajō (spr. -wācho), nordamerikan. Indianerstamm der Athabasken (s. d.) in Neumexiko, mit den Apatschen verwandt. Früher als kühne Räuber gefürchtet, sind sie jetzt zur Viehzucht übergegangen. 1890 lebten in der Navajo-Agentur in Neumexiko 17,204 Seelen. Ihr großes neuntägiges Winterfest schilderte Matthews: »The mountain chant, a Navajo ceremony« (Washingt. 1887). | Quelle: Meyers Großes Konversations-Lexikon, Band 14. Leipzig 1908, S. 472. | Permalink: http://www.zeno.org/nid/20007139357

Navajo-Indianer
type: Label
in scheme: travel!digital Thesaurus

Hesene
type: Concept
definition: bdk: arabische Stammesgemeinschaft in Syrien
related: Beduine
in scheme: travel!digital Thesaurus
pref label: Hesene

Hesene
type: Label
in scheme: travel!digital Thesaurus

Ruwalâ
type: Concept
definition: bdk: arabische Stammesgemeinschaft in Syrien
related: Beduine
pref label: Ruwalâ
in scheme: travel!digital Thesaurus
alt label: Ruwala
alternative label: Ruwala

Ruwalâ
type: Label
hasVariant: Ruwala
in scheme: travel!digital Thesaurus

Ruwala
type: Label
isVariantOf: Ruwalâ
in scheme: travel!digital Thesaurus

Lao
type: Concept
pref label: Lao
in scheme: travel!digital Thesaurus
definition: Meyers Großes Konversations-Lexikon 1908: Laos, Landschaft auf der hinterindischen Halbinsel (s. Karte »Französisch-Indochina«), seit 1893 größtenteils unter Schutzhoheit Frankreichs und in der Verwaltung zu Französisch-Indochina gehörig, hauptsächlich das Mekongbecken zwischen 105 und 102° östl. L. umfassend. Das französische Kolonialgebiet deckt sich mit diesen Grenzen nicht, sondern bedeutet den Landstreifen zwischen dem linken Ufer des Melong einerseits und Anam und Tongking anderseits; die Nordgrenze gegen China ist durch Vertrag vom 20. Juni 1895, die Grenze gegen die englische Interessensphäre im nördlichsten Teil des Gebiets durch Abkommen vom 15. Jan. 1896 und die erwähnte Abgrenzung gegen Siam durch den Mekong durch Friedensvertrag vom 1. Okt. 1893 geregelt. Die Organisation von Französisch-L. aus dem Jahre 1895 teilt das Gebiet in Oberlaos mit 146,800 und Unterlaos mit 108,200 qkm und schätzungsweise 250,000, bez. 355,000 Einw., so daß auf das ganze Gebiet 255,000 qkm mit 605,000 Einw. (nur 2,4 auf 1 qkm) zu rechnen sein würden. Oberlaos zerfällt in 6, Unterlaos in 8 Kommissariate, die in der Anordnung von N. nach S. heißen: Moung-hu, Vien-pukha, Hua-phan, Luang-prabang (mit der gleichnamigen Hauptstadt von ganz L.), Tran-ninh, Vien-tian; Cammon, Song-khon, Saravan, Bu-muang, Attopeu, Khong, Hung-treng, Darlac. Das Gebiet ist noch immer wenig bekannt, obgleich die Franzosen seine Erforschung neuerdings energisch in Angriff genommen haben. Der Boden ist fruchtbar und bringt reiche Ernten von Reis, Baumwolle, Indigo, Tabak und Obst. Einen großen Wert enthalten die umfangreichen Wälder des Tiekbaums, deren Ausnutzung begonnen hat, indem die Stämme auf dem Mekong bis Saigon hinabgeflößt werden. Französische Mineningenieure haben Ablagerungen von Gold (das übrigens schon seit langem von den Eingebornen in roher Weise gewonnen wurde), Zinn, Blei und Edelsteinen gefunden, und es sind schon mehrere Konzessionen an französische Minengesellschaften vergeben worden.…

Lao
type: Label
in scheme: travel!digital Thesaurus

belgisch
type: Concept
comment: Indien 1914: nur französisch
in scheme: travel!digital Thesaurus
related: Belgier
pref label: belgisch
preferred label: belge @fr
definition: Duden: Belgien, die Belgier betreffend; aus Belgien stammend | [Anm.: unvollständig: Belgien, die Belgier betreffend; von den Belgiern stammend, zu ihnen gehörend; in Belgien gelegen]
pref label: belge

belgisch
type: Label
hasTranslation: belge
in scheme: travel!digital Thesaurus

belge
type: Label
isTranslationOf: belgisch
in scheme: travel!digital Thesaurus

Hunne
type: Concept
alt label: Hunnenvolk
alternative label: Hunnenvolk
related: Nomade
definition: Duden: 1. Angehöriger eines ostasiatischen Nomadenvolks | Meyers Großes Konversations-Lexikon 1907: Hunnen, ein Volk mongolischer Rasse, jedenfalls mit den Hiung nu (Hiünjo, Hiünjün; sanskrit. Hûna, avest. Hunavô, griech. Funoi und Unoi) identisch, die schon um 1300 v. Chr. in der Geschichte des chinesischen Volkes als Grenzfeinde auftreten. Eine Art von Hunnenreich bildete sich zuerst um 1200 v. Chr. Einzelne Horden beunruhigten China namentlich 1120, 910, 880 (Schansi), 700 (Schantung), 650 (Tschili), bis 220 Kaiser Shi Hoangti die Lücken der Großen Mauer ausfüllte. Einen neuen Aufschwung nahm das Hunnenreich unter Mete (um 210–170); doch Kaiser Wu Ti vertrieb um 120 v. Chr. die H. nach der nördlichen Mongolei. Um 50 v. Chr. zerfiel das Reich der H. in einen südlichen Teil, der die chinesische Oberhoheit anerkannte, 142 n. Chr. in China ganz ausging und seit 400 seinerseits Teile des großen Reiches (das nördliche Liang und das große Hsia) beherrschte, und in einen nördlichen, der sich bis 84 n. Chr. unabhängig erhielt. Da wich der dort hausende, immer noch sehr beträchtliche Rest der H., schwer bedrängt von Chinesen und sibirischen Stämmen (z. B. dem Tungusenvolke der Sien-pe), nach dem bereits durch den Häuptling Tschitschi (gest. 36 v. Chr.) bearbeiteten Westen aus, wo er bald eine bedeutende Rolle spielen sollte. Ein Teil, die Weißen H. (Euthaliten, Ephthaliten, Hephthaliten, chines. Tin-la, nicht zu verwechseln mit dem tibetischen Nomadenvolk der Yue-tschi am Altyn Tag, das von den H. schon im 2. vorchristlichen Jahrhundert befehdet wurde und um 10 v. Chr. in Nordwestindien das »indoskythische Reich« gründete), ließ sich am Aralsee nieder, besetzte das heutige Chiwa, Balch und Badachschan (Hauptstadt Pah-ti-jan), griff seit 420 Persien heftig an (484 fiel der Sasanide Peroz gegen sie), brach, seinerseits von den Türken bedrängt, vom Tsung-ling aus 495,515 und 530 in Nordwestindien (Reich der indoskythischen Yue-tschi) ein, mischte sich allmählich stark mit den…
in scheme: travel!digital Thesaurus
pref label: Hunne

Hunnenvolk
type: Label
in scheme: travel!digital Thesaurus

Hunne
type: Label
in scheme: travel!digital Thesaurus

Girgesiter
type: Concept
definition: bdk: kanaanitischer Stamm | Pierer's Universal-Lexikon 1859: Girgasiter (Girgesiter), ein Stamm der Kananiter, nach Einigen diesseits, nach Anderen jenseits des Jordan. | Quelle: Pierer's Universal-Lexikon, Band 7. Altenburg 1859, S. 365. | Permalink: http://www.zeno.org/nid/20010011048
pref label: Girgesiter
in scheme: travel!digital Thesaurus
related: Kanaʿaniter

Girgesiter
type: Label
in scheme: travel!digital Thesaurus

Nabatäer
type: Concept
alternative label: Nebajot
alt label: Nebajot
pref label: Nabatäer
in scheme: travel!digital Thesaurus
definition: Meyers Großes Konversations-Lexikon 1907: Nabatäer (identisch mit den biblischen Nebajôth und den keilinschriftlichen Nabajâti?), semit. Stamm im Peträischen Arabien mit der Hauptstadt Petra, erscheint als ein mächtiger Zweig der ismaelitischen Araber, kriegerisch und reich durch Kamel- und Schafherden sowie als Vermittler des arabisch-indischen und ägyptisch-babylonischen Handels. Ihre ziemlich freiheitliche Staatsverfassung war monarchisch, neben dem König aber herrschte, von den Häuptlingen dazu ernannt, unter dem Namen »Bruder« ein Mitregent. In voller Geschichtlichkeit treten uns die N. erst entgegen in ihren Kämpfen mit den syrischen Königen Antigonus und Demetrius und den Makkabäern. Ihr Reich erstreckte sich in seiner Blütezeit vom älanitischen Meerbusen bis nach Damaskus. Pompejus war der erste Römer, der (63 v. Chr.) eine Expedition in ihr Gebiet sandte; unter Trajan ward dem Reich ein Ende gemacht (105 n. Chr.). Die noch vorhandenen nabatäischen Ruinen gehören zu den merkwürdigsten und prachtvollsten Überbleibseln des hellenistisch-orientalischen Stiles. Außerdem sind zahlreiche nabatäische Inschriften (in aramäischer Sprache) vorhanden. Vgl. Euting, Nabatäische Inschriften aus Arabien (Berl. 1885; mit historischen Notizen von A. v. Gutschmid), und betreffs des jüngern, zumeist von Hirten der Sinaihalbinsel herrührenden Zweiges dieser Inschriften gleichfalls Euting, Sinaitische Inschriften (Berl. 1891); ferner Schürer, Geschichte des jüdischen Volkes, Bd. 1 (3. u. 4. Aufl., Leipz. 1901). | Quelle: Meyers Großes Konversations-Lexikon, Band 14. Leipzig 1908, S. 353. | Permalink: http://www.zeno.org/nid/20007128274
related: Nomade

Nebajot
type: Label
in scheme: travel!digital Thesaurus

Nabatäer
type: Label
in scheme: travel!digital Thesaurus

niederländisch
type: Concept
definition: Duden: die Niederlande, die Niederländer betreffend; von den Niederländern stammend, zu ihnen gehörend | [Anm.: unvollständig: die Niederlande, die Niederländer betreffend; von den Niederländern stammend, zu ihnen gehörend; in den Niederlanden gelegen]
pref label: nederlandsch
related: Niederländer
pref label: niederländisch
related: holländisch
preferred label: nederlandsch @nl
narrower: niederländisch-amerikanisch
alt label: altniederländisch
in scheme: travel!digital Thesaurus
narrower: niederländisch-indisch
alternative label: altniederländisch

nederlandsch
type: Label
isTranslationOf: niederländisch
in scheme: travel!digital Thesaurus

niederländisch
type: Label
hasTranslation: nederlandsch
in scheme: travel!digital Thesaurus

altniederländisch
type: Label
in scheme: travel!digital Thesaurus

australisch
type: Concept
pref label: australian
definition: Duden: Australien, die Australier betreffend; aus Australien stammend | [Anm.: unvollständig: Australien, die Australier betreffend; von den Australiern stammend, zu ihnen gehörend; in Australien gelegen] | Duden: Australien: 1. kleinster Erdteil | 2. aus Australien (1) und einigen Inseln bestehender Staat | siehe auch: Meyers Großes Konversations-Lexikon 1905: Australien | Quelle: Meyers Großes Konversations-Lexikon, Band 2. Leipzig 1905, S. 166-175. | Permalink: http://www.zeno.org/nid/20006274307
related match: Australians
related match: Australia
in scheme: travel!digital Thesaurus
preferred label: australian @en
pref label: australisch

australian
type: Label
isTranslationOf: australisch
in scheme: travel!digital Thesaurus

australisch
type: Label
hasTranslation: australian
in scheme: travel!digital Thesaurus

Gallier
type: Concept
in scheme: travel!digital Thesaurus
pref label: Gallier
definition: Duden: Einwohnerbezeichnung | [Anm.: unvollständig: Einwohnerbezeichnung zu Gallien] | Duden: Gallien: lateinischer Name Frankreichs | Meyers Großes Konversations-Lexikon 1907: Gallĭen (Gallia), das Land der Gallier, des keltischen Hauptvolkes im Altertum (über die Ableitung des Namens vgl. Bloch, Interprétation anthropologique du mot latin Gallus, im »Bulletin de la société d'anthropologie de Paris«, 1900). G. umfaßte ungefähr das heutige Frankreich, Belgien, Stücke von Holland und Deutschland (westlich vom Rhein), den größern Teil der Schweiz und nach römischem Sprachgebrauch seit dem 4. Jahrh. v. Chr. auch das[284] jetzige Oberitalien bis zum Aesis, wohin gallische Völkerschaften eingewandert waren. Letzteres wurde als Gallia cisalpina bezeichnet, zum Unterschied von dem jenseit der Alpen gelegenen Gallia transalpina. Eine genauere Kenntnis des eigentlichen G. wurde zuerst durch Julius Cäsar gewonnen. S. die Geschichtskarten »Germanien etc.« und »Italien bis in die Zeit des Kaisers Augustus«. [...] | Quelle: Meyers Großes Konversations-Lexikon, Band 7. Leipzig 1907, S. 284-289. | Permalink: http://www.zeno.org/nid/20006649734
related match: Gaul

Gallier
type: Label
in scheme: travel!digital Thesaurus

elsaß-lothringisch
type: Concept
definition: bdk: Elsaß-Lothringen, die Elsaß-Lothringer betreffend; von den Elsaß-Lothringern stammend, zu ihnen gehörend; in Elsaß-Lothringen gelegen
in scheme: travel!digital Thesaurus
pref label: elsaß-lothringisch
related: Elsaß-Lothringer

elsaß-lothringisch
type: Label
in scheme: travel!digital Thesaurus

Amalekiter
type: Concept
pref label: Amalekiter
in scheme: travel!digital Thesaurus
definition: Meyers Großes Konversations-Lexikon 1905: Amalekīter (bibl. Amalek), altes räuberisches Beduinenvolk im SW. Palästinas, auf der Sinaihalbinsel. Seit alters mit Israel in Streit, wurden sie von Josua bei Rephidim geschlagen. Nach diesem Sieg Israels ward das Gebot 5. Mos. 25,17 ff. gegeben, die A. wegen ihrer Grausamkeit gegen Israel auszurotten. Erst Saul setzte ihren Raubzügen in zwei Feldzügen auf einige Zeit ein Ziel. David bekriegte sie von Ziklag aus und rächte die Verbrennung dieser Stadt, kämpfte auch als König noch mit ihnen. Unter Hiskia wurden die A. am Gebirge Seïr von den Simeoniten teils ausgerottet, teils vertrieben. Seitdem werden sie. in der Bibel nicht weiter erwähnt. Vgl. Nöldeke, Über die A. (Götting. 1864). | Quelle: Meyers Großes Konversations-Lexikon, Band 1. Leipzig 1905, S. 406. | Permalink: http://www.zeno.org/nid/20006219985

Amalekiter
type: Label
in scheme: travel!digital Thesaurus

Katschin
type: Concept
related match: Kachin State
pref label: Katschin
in scheme: travel!digital Thesaurus
definition: Meyers Großes Konversations-Lexikon 1907: Katschin (Kakhjen, birman. Kakhjang), Volksstamm in Indochina, in vier größern Stämmen durch Assam und Oberbirma verbreitet, mit den Birmanen verwandt, aber mit eigner Kultur, treiben etwas Ackerbau und sind geschickte Handwerker, namentlich Schmiede; Opiumballen dienen als Geld. Vgl. Scott und Nerdiman, Gazetteer of Upper Burma (Rangun 1900–01); Grammatik von Cushing (im »Journal of the Asiatic Society«, 1880); Wehrli, Beitrag zur Ethnologie der Chingpaw (Kachin) von Ober-Burma (Leiden 1904). | Quelle: Meyers Großes Konversations-Lexikon, Band 10. Leipzig 1907, S. 622-623. | Permalink: http://www.zeno.org/nid/20006879152

Katschin
type: Label
in scheme: travel!digital Thesaurus

Simcoe-Indianer
type: Concept
related match: Simcoe County
in scheme: travel!digital Thesaurus
related: Indianer
pref label: Simcoe-Indianer
definition: Meyers Großes Konversations-Lexikon 1909: Simcoe (S. Lake, spr. ßimmko lēk), See in der kanad. Provinz Ontario, 1440 qkm groß, 219 m ü. M., fließt durch den Severnfluß in die Matchedashbuchl der Georgian Bai des Huronensees ab und wird von Dampfern zwischen Barrie und Orillia befahren. | Quelle: Meyers Großes Konversations-Lexikon, Band 18. Leipzig 1909, S. 477. | Permalink: http://www.zeno.org/nid/20007478437

Simcoe-Indianer
type: Label
in scheme: travel!digital Thesaurus

Bukhâraleute
type: Concept
definition: bdk: Einwohner des Emirats von Bukhara | Duden: Buchara: Landschaft und Stadt Buchara in Usbekistan | Meyers Großes Konversations-Lexikon 1905: Bochāra (Bokhara, Buchara), einst der berühmteste Staat in Zentralasien (s. die Karten »Zentralasien« und »Persien«), vom Kaspischen Meer bis zum Bolor Tagh und zwischen 36 und 42° nördl. Br., jetzt auf 220,000 qkm zusammengeschrumpft zwischen 41–37° nördl. Br. und 62–72° östl. L., im S. von Afghanistan, sonst rings von Russisch-Zentralasien begrenzt. Der nordwestliche Teil wird erfüllt von Wüsten und Steppen, die Osthälfte ist gebirgig (Periochtau-, Darwas-, Serafschangebirge). Der Amu Darja bildet zuerst die Südgrenze, läuft dann der Südwestgrenzeparallel und nimmt den Wachsch (Surehab), Kasirnagan und Surchan auf, der Serafschan verliert sich in den Dengissee. Die Bevölkerung wird auf 1,250,000 Seelen geschätzt und bildet ein buntes Völkergemisch aus 200,000 Uzbeken (s.d.), denen der Herrscher angehört, 160,000 nomadisierenden Turkmenen, 600,000 Tadschik (s.d.), Ackerbauer, Handwerker und Händler und angesehene Beamte, denen auch die Galtschi im O. angehören, 45,000 Kirgisen (s.d.) nebst einigen Karakalpaken, 50,000 Arabern, meist Viehzüchter und Pferdehändler, 500 Hindu, einflußreich durch ihren Reichtum, 4000 Afghanen, Händler in den Städten, 4000 Juden, meist Handwerker, 40,000 Persern, meist von den Tekke-Turkmenen als Sklaven eingeschleppt, und 2000 Russen in den Garnisonen von Tschardschui und Kerki. Die Oasen Serafschan (mit der Hauptstadt B.), Schaar, Karschi und Gusar haben 90 Einw. auf 1 qkm, die westlichen Oasen am Amu Darja 63, Hissar 44, der Rest nur 2. Die Landesreligion ist der sunnitische Islam; die höchste Würde bekleidet ein Oberpriester (Achund); die fanatischen Mollas (Priester) haben große Macht. Kulturlich stehen die Bocharen den Bewohnern andrer zentralasiatischer Länder voran, doch ist die Stellung der Frauen noch schlechter als sonst in mohammedanischen Staaten. Die Sklaverei wurde durch russische…
related match: Bukhara
pref label: Bukhâraleute
in scheme: travel!digital Thesaurus

Bukhâraleute
type: Label
in scheme: travel!digital Thesaurus

Slêbi
type: Concept
definition: Meyers Großes Konversations-Lexikon 1909: Slêb, nomadischer Stamm in der Syrischen Wüste, weit zerstreut, von Aleppo bis zum Persischen Meerbusen, in Körperbildung und Lebensweise von den Arabern verschieden, vielleicht indischen Ursprungs. Sie leben besonders von der Gazellenjagd, kleiden sich in Gazellenhäute, stehen mit den Beduinen auf gutem Fuß, besitzen nur Esel, selten einige Schafe und Ziegen und sind treffliche Kenner der Wüste. Sie wandern nur familienweise, oft bloß zu zweien oder dreien umher. | Quelle: Meyers Großes Konversations-Lexikon, Band 18. Leipzig 1909, S. 542. | Permalink: http://www.zeno.org/nid/20007485751
pref label: Slêbi
related: Beduine
in scheme: travel!digital Thesaurus

Slêbi
type: Label
in scheme: travel!digital Thesaurus

baktrisch
type: Concept
related match: Bactria
narrower: indobaktrisch
narrower: griechisch-baktrisch
pref label: baktrisch
in scheme: travel!digital Thesaurus
definition: bdk: Baktrien, die Baktrer/Baktrier betreffend; von den Baktrern/Baktriern stammend, zu ihnen gehörend; in Baktrien gelegen | Duden: Baktrien: altpersische Landschaft | Meyers Großes Konversations-Lexikon 1905: Baktrĭen, Name einer alten Landschaft im Innern Asiens (s. Karte »Alexanders d. Gr. Reich«), welche die fruchtbare Talebene des Oxus zwischen dem Paropanisos im S. und den Ausläufern des Imaos (Tiënschan) im N. umfaßt, etwa die Gegend des heutigen Balch (das ursprünglich Baktra, altpers. Bachtri, hieß). Die Bewohner, Baktrer, gehörten zum arischen Völkerstamm und gründeten schon in der vormedischen Zeit allerlei staatliche Gemeinwesen, die[290] aber von Kyros um 540 unterworfen wurden; seitdem bildete B. eine Satrapie des persischen Reiches, die als Heimat der Zendreligion eine wichtige Stellung einnahm. Nach dem Sturz des persischen Reiches 330 suchte der Satrap von B., Bessos, sich zum selbständigen Herrscher zu machen, doch unterlag er Alexander d. Gr. Nach dessen Tod gehörte B. zum Neich der Seleukiden, bis der Statthalter Diodotos 256 das griechisch-baktrische Reich gründete, das auch einen Teil Indiens umfaßte, sich aber nach einem Kriege zwischen Demetrios von B. und Eukratides im Kabultal in mehrere Reiche auflöste, die von den Parthern und Indoskythen hart bedrängt wurden. Auf die griechischen Könige dieser Reiche folgte im 1. Jahrh. ein nicht griechischer König, Kadphises. Im 1. Jahrh. n. Chr. herrschte der von den Parthern abstammende König Gudopheres über den größten Teil des Reiches. Bis 200 herrschte dann die Dynastie der »Turuschkas«, bis die Herrschaft der Sasaniden diesem östlichen Rest hellenischer Kultur ein Ende machte. Nach dem Fall der Sasaniden (um 642) gehörte das Land zum arabischen Kalifat, seit dem 10. Jahrh. verschiedenen türkischen und mongolischen Dynastien, darauf den Afghanen. Im 10. Jahrh. hatten die Samaniden (s. d.), die von hier abstammen, die Stadt Balch Transoxanien einverleibt. Die Fürsten aus dem bocharischen Herrscherh…

indobaktrisch
type: Concept
definition: bdk: siehe indisch, baktrisch
related: indisch
in scheme: travel!digital Thesaurus
pref label: indobaktrisch

indobaktrisch
type: Label
in scheme: travel!digital Thesaurus

baktrisch
type: Label
in scheme: travel!digital Thesaurus

sidonisch
type: Concept
definition: Duden: Sidon, die Sidonier betreffend | [Anm.: unvollständig: Sidon, die Sidonier betreffend; von den Sidoniern stammend, zu ihnen gehörend; in Sidon gelegen] | Duden: phönizische Stadt
in scheme: travel!digital Thesaurus
pref label: sidonisch
related: Sidonier

sidonisch
type: Label
in scheme: travel!digital Thesaurus

Sidonier
type: Concept
definition: bdk: Einwohnerbezeichnung zu Sidon | Duden: Sidon: phönizische Stadt | Meyers Großes Konversations-Lexikon 1909: Sidon, alte berühmte Stadt Phönikiens, am Mittelländischen Meer, mit einem Doppelhafen, ursprünglich wohl der Mittelpunkt der nach ihr Sidonier (Çidonîm) genannten südlichen Gruppe der Phöniker; unter dem Namen Sidonier begegnen deshalb die Phöniker bei Homer. Seit dem 10. Jahrh. übte Tyros eine Vorherrschaft aus, die zu einer Rivalität um die Rolle als »Mutterstadt« führte. Auch als Vasallin der vorderasiatischen Reiche (Assyrien, Babylon) blieb S. bedeutend. In einem Aufstand gegen Asarhaddon wurde es 678 zerstört und ist wohl unter persischer Herrschaft als Gegenpunkt gegen Tyros wieder mit seinen alten Rechten begabt worden. Es empörte sich dann gegen Artaxerxes Ochos und wurde 351 von diesem zerstört. Wieder aufgebaut, ergab es sich an Alexander d. Gr., der daselbst einen Vasallenkönig einsetzte. Später stand S. abwechselnd unter ägyptischer und syrischer Botmäßigkeit, bis es dem römischen Reich einverleibt wurde. Von besonderm Interesse sind die zahlreichen Felsengräber der Umgebung von S., die bis auf die neueste Zeit, zuletzt 1887 (17 prachtvolle griechische und phönikische Marmorsarkophage, jetzt in Konstantinopel, s. Tafel »Grabmäler«, Fig. 6), herab wissenschaftlich und künstlerisch wertvolle Ausbeute geliefert haben. Jetzt Saïda (s. d. 1). Vgl. Hamdi Bei und Th. Reinach, La nécropole royale à S. (Par. 1892–96); Eiselen, S., a study in oriental history (New York 1907). | Quelle: Meyers Großes Konversations-Lexikon, Band 18. Leipzig 1909, S. 429. | Permalink: http://www.zeno.org/nid/2000747346X
alt label: Sidoniter
alternative label: Sidoniter
pref label: Sidonier
related match: Sidon
in scheme: travel!digital Thesaurus

Sidoniter
type: Label
in scheme: travel!digital Thesaurus

Sidonier
type: Label
in scheme: travel!digital Thesaurus

nepalesisch
type: Concept
alternative label: nepalisch
in scheme: travel!digital Thesaurus
definition: Duden: Nepal, die Nepaler betreffend; von den Nepalern stammend, zu ihnen gehörend | [Anm.: unvollständig: Nepal, die Nepalesen betreffend; von den Nepalesen stammend, zu ihnen gehörend; in Nepal gelegen]
pref label: nepalesisch
related: Nepalese
alt label: nepalisch

nepalesisch
type: Label
hasVariant: nepalisch
in scheme: travel!digital Thesaurus

nepalisch
type: Label
isVariantOf: nepalesisch
in scheme: travel!digital Thesaurus

Nepalese
type: Concept
definition: Duden: Einwohnerbezeichnung | [Anm.: unvollständig: Einwohnerbezeichnung zu Nepal] | Duden: Nepal: Staat in Zentralasien | Meyers Großes Konversations-Lexikon 1908: Nepal (Nipal), unabhängiges Reich im Himalaja und an dessen südlichem Abhang (s. Karte »Ostindien«), einer der Himalajastaaten (s. d.), der sich in über 700 km Länge und 125 km Breite zwischen 26°25´ und 30°17´ nördl. Br. hinzieht und im Norden von Tibet, im O. von Sikkim, im übrigen von den britisch-indischen Provinzen Bengalen und Nordwestprovinzen und Audh begrenzt wird, umfaßt 140,000 qkm mit etwa 4 Mill. Einw. Der Himalaja mit seinen höchsten Gipfeln (Kantschindschinga 8580, Gaurisankar 8840, Dhawalagiri 8180 m) begleitet N. nördlich, fast die ganze Kette reicht über die Grenze des ewigen Schnees hinaus. Nach W. setzt eine dem Hauptkamm parallele Kette die Grenz- und Wasserscheide gegen das Gebiet des Sangpo fort. Sämtliche Flüsse, unter denen Gandak und Kauriala die wichtigsten sind, fließen zum Ganges. Der Niveauunterschied zwischen den höchsten Berggipfeln und dem 20–50 km breiten, sumpfigen, dicht bewaldeten und höchst ungesunden Tarai an der Grenze gegen Britisch-Indien übersteigt 8000 m. Das Klima ist danach nicht einheitlich. Dardschiling (2107 m, Sanatorium) hat mittlere Jahresextreme von 26° und -2°. Regenmenge in Dardschiling 3060 mm, Kathmandu (1450 m) 1470 mm, Maximum Juli und August, Minimum November bis Januar. Das Klima von Kathmandu und ähnlich gelegenen Orten gleicht dem von Neapel (16,5°), das Tarai hat feuchte Hitze. Pflanzen- und Tierwelt sind im ganzen die des Himalaja (s. d.). Doch scheidet eine scharfe Vegetationsgrenze das Tarai vom Gebirge. Zu den aus Indien weit nordwärts reichen den Tierformen gehört auch der Tiger. Als einzig N. zukommend ist das Nahoor (Ovis nahoor Hodgs.) zu erwähnen. Eine eigne Schweinegattung besitzt N. gemeinsam mit Sikkim im Zwergschwein (Porcula). Von Mineralien gewinnt man besonders Eisen- und Kupfererze, verarbeitet das Metall zu allerlei Geräten…
related match: Nepal
in scheme: travel!digital Thesaurus
pref label: Nepalese
related match: Newar people

Nepalese
type: Label
in scheme: travel!digital Thesaurus

Metellit
type: Concept
definition: bdk: arabische Stammesgemeinschaft in Tunesien
pref label: Metellit
in scheme: travel!digital Thesaurus
related: Araber

Metellit
type: Label
in scheme: travel!digital Thesaurus

Ottawa-Indianergruppe
type: Concept
definition: Meyers Großes Konversations-Lexikon 1908: Ottawa, nordamerikan. Indianerstamm der Algonkin, mit den Odschibwä verwandt, wohnten früher in Kanada am Ottawa River und leben jetzt auf zwei Reservationen, am Obern See in Michigan (etwa 1000 Seelen) und im Indianerterritorium (137 Seelen). | Quelle: Meyers Großes Konversations-Lexikon, Band 15. Leipzig 1908, S. 250. | Permalink: http://www.zeno.org/nid/20007198302
in scheme: travel!digital Thesaurus
related: Indianer
pref label: Ottawa-Indianergruppe

Ottawa-Indianergruppe
type: Label
in scheme: travel!digital Thesaurus

Daniten
type: Concept
definition: bdk: Einwohnerbezeichnung zu Dan | Meyers Großes Konversations-Lexikon 1906: Dan, Stadt an der Nordgrenze Palästinas im Stamm Naphtali, Kolonie der Daniten (der Nachkommen Dans, s. folgenden Artikel), früher zu Sidon gehörig und Laïs genannt, war stets ein Sitz des Götzendienstes; jetzt Tell el Kâdi. | Quelle: Meyers Großes Konversations-Lexikon, Band 4. Leipzig 1906, S. 472. | Permalink: http://www.zeno.org/nid/20006464270
alt label: Dan
in scheme: travel!digital Thesaurus
alternative label: Dan
pref label: Daniten

Dan
type: Label
in scheme: travel!digital Thesaurus

Daniten
type: Label
in scheme: travel!digital Thesaurus

vatikanisch
type: Concept
related match: Papal States
definition: Duden: den Vatikan betreffend, dazu gehörend | Duden: Vatikan: 1. Residenz des Papstes in Rom | 2. oberste Behörde der römisch-katholischen Kirche | Duden: Vatikanstadt: Stadtstaat im Nordwesten Roms, in dem der Vatikan (1) liegt | Meyers Großes Konversations-Lexikon 1909: Vatikān, Palast des Papstes in Rom, auf dem Monte Vaticano (Vaticanus mons, bis 62 m ü. M.), im nordwestlichen Stadtteil, dem Borgo (oder Città Leonina), auf dem rechten Tiberufer gelegen (vgl. den Plan von Rom, Bd. 17). Die erste Anlage des Vatikans soll unter Papst Symmachus zu Anfang des 6. Jahrh. entstanden sein. Eugen III. (1150), Cölestin III. und Innozenz III. erweiterten den Palast, der während des »avignonesischen Exils« der Päpste verfiel. Erst nach ihrer Rückkehr (1378) wurde er päpstliche Residenz (bis 1308 war es der Lateran) und fortdauernd vergrößert, namentlich durch Nikolaus V. (1450), der unter anderm die Bibliothek, die Stanze, die Borgiagemächer errichtete, Sixtus IV. (Sixtinische Kapelle, 1473–81), Innozenz VIII. (Belvedere, 1486–92), Alexander VI. (Borgiaturm), Julius II. (Bramantes Loggien und Belvederehof), Paul III. (Cappella Paolina, 1540), Sixtus V. (jetzige Bibliothek), Clemens VIII. (neue Papstwohnung am Damasushof), Urban VIII. (Berninis Scala Regia), Pius VI. (Museumsäle beim Belvedere), Pius VII. (Braccio Nuovo), Pius IX. (Prachttreppe zum Damasushof). Der V. bildet infolgedessen einen sehr unregelmäßigen Baukomplex von ca. 55,000 qm Fläche, der in verschiedenem Niveau nördlich vom Petersplatz und der Peterskirche am Abhang des Monte Vaticano aufsteigt, dessen Rücken der päpstliche Garten bedeckt, nördlich und westlich von der Stadtmauer begrenzt. Er zählt 20 Höfe, über 200 Treppen und einige tausend Räume. Der Haupteingang ist bei dem von der Schweizergarde bewachten Bronzeportal am Petersplatz. Von hier gelangt man über die prächtige marmorne Scala Pia zum Damasushof und dem päpstlichen Wohnpalast, über, die perspektivisch sich verkürzende Scala Regia (von Bernini…
related match: Vatican City
pref label: vatikanisch
in scheme: travel!digital Thesaurus

vatikanisch
type: Label
in scheme: travel!digital Thesaurus

Morisco
type: Concept
definition: Duden: Moriske: nach der arabischen Herrschaft in Spanien zurückgebliebener Maure, der [nach außen hin] Christ war
in scheme: travel!digital Thesaurus
related: Maure
pref label: Morisco

Maure
type: Concept
definition: Duden: Angehöriger eines nordafrikanischen Mischvolkes | Meyers Großes Konversations-Lexikon 1908: Mauren (Mohren, Morisken, span. Moros), ein Mischvolk aus arabischen und andern Elementen, bildet gegenwärtig den Hauptbestandteil der Städtebevölkerung von Marokko, Algerien und Tunis und ist unter andern Verhältnissen in Senegambien und Ceylon zu finden. Ursprünglich wurde der Name M. (Mauri oder Maurusci; von dem phönikischen Mauharin, d. h. die Westlichen, nach andern von dem spätgriechischen μανρoσ, d. h. schwarz, abzuleiten) von den Alten den Bewohnern der Atlasgegenden, d. h. Berbern, gegeben; ihr Land hieß Mauretanien (s. d.). Nach den Eroberungen der Sarazenen (Araber) im 7. Jahrh. auch über diesen Teil Afrikas ging der Name M. auf die aus M. und Arabern gemischte Bevölkerung der Städte des Atlasgebiets, besonders der Küste, über, wurde jedoch, mit dem Eindringen der Araber (711) nach Spanien, dort auf diese selbst (los Moros) übertragen, während die echten, unverfälschten Nachkommen der alten M. sich in die Gebirge zurückzogen und den Namen Berber (Amazirghen) annahmen. Die Mauro-Araber brachten Wissenschaften und Künste nach Spanien. Während das übrige Europa in Barbarei versank, blühten in Cordoba, Granada und andern maurischen Städten Gelehrsamkeit und Künste, namentlich Baukunst und Dichtkunst. Nach dem Fall Granadas 1492 ging ein Teil der M. nach Afrika, die meisten aber blieben in Spanien, traten äußerlich zum Christentum über und lebten unter dem Namen Morisken als fleißige, ruhige Untertanen, bis die aus Glaubensfanatismus hervorgegangenen Bedrückungen unter Philipp II. 1568–70 einen Aufstand der Morisken in Granada hervorriefen. Über 100,000 wurden vertrieben, von den übrigen, wenige noch heute vorhandene Reste in den Gebirgen Granadas ausgenommen, verließ, als unter Philipp III. 1609 sie gleiches Schicksal traf, 1/2 Mill. Spanien und kehrte nach Afrika zurück. Vgl. Rochau, Die Moriskos in Spanien (Leipz. 1853); Dozy, Geschichte der M. in Spanien (de…
preferred label: mouro @pt
in scheme: travel!digital Thesaurus
pref label: mouro
pref label: Maure

mouro
type: Label
isTranslationOf: Maure
in scheme: travel!digital Thesaurus

Maure
type: Label
hasTranslation: mouro
in scheme: travel!digital Thesaurus

Morisco
type: Label
in scheme: travel!digital Thesaurus

Ghawârine
type: Concept
pref label: Ghawârine
alternative label: Ghawarîne-Beduine
in scheme: travel!digital Thesaurus
alternative label: Ghôr-Araber
definition: bdk: arabische Stammesgemeinschaft in Palästina | Meyers Großes Konversations-Lexikon 1907: Ghor (arab., »Senkung«), das Jordantal vom See Genezareth bis zum Toten Meer, bildet die tiefste Depression (Totes Meer -394 m) der Erde. Es ist 7–15 km breit, wird nur stellenweise von Beduinen und Fellahs bebaut, ist infolge seiner tiefen Lage sehr heiß und zeigt Anklänge zur Tropenflora. Vgl. Jordan. | Quelle: Meyers Großes Konversations-Lexikon, Band 7. Leipzig 1907, S. 821. | Permalink: http://www.zeno.org/nid/2000668131X
alt label: Ghôraraber
related: Beduine
alternative label: Ghôraraber
alt label: Ghawarîne-Beduine
alt label: Ghôr-Araber
related match: Ghor Province

Ghawârine
type: Label
in scheme: travel!digital Thesaurus

Ghôraraber
type: Label
isVariantOf: Ghôr-Araber
in scheme: travel!digital Thesaurus

Ghôr-Araber
type: Label
hasVariant: Ghôraraber
in scheme: travel!digital Thesaurus

Ghawarîne-Beduine
type: Label
in scheme: travel!digital Thesaurus

sudanisch
type: Concept
definition: Duden: sudanesisch: den Sudan, die Sudaner betreffend; aus dem Sudan stammend | Duden: Sudan: Staat im nordöstlichen Afrika | [Anm.: unvollständig: Sudan, die Sudaner betreffend; von den Sudanern stammend, zu ihnen gehörend; in Sudan gelegen] | Meyers Großes Konversations-Lexikon 1909: Sudân (Beled es S., »Land der Schwarzen«, Nigritien), der Teil des Binnenlandes von Nordafrika (s. Karten »Ägypten« und »Guinea«), der vom 5.° nördl. Br. im W. bis zum 14.°, im O. bis zum 22.° nördl. Br. reicht, zwischen Sahara, Libyscher und Nubischer Wüste (N.), den innern Bergländern Senegambiens und Guineas (W. und S.), der Nil-Kongo-Wasserscheide (S.) und Abessinien, Erythräa und Rotem Meer (O.). Bei über 5 Mill. qkm Fläche kann man das Gebiet in drei Teile: West-S. (ca. 11/2 Mill. qkm; Senegal- und Nigerländer), Mittlerer S. (die ehemaligen [175] Reiche Bornu, Adamaua, Bagirmi, Wadai; 1,5 Mill. qkm) und Ost-S. (Ägyptischer S.; über 2 Mill. qkm), oder in zwei Teile zerlegen: Hochsudân (W.) und Flachsudân (O.), getrennt etwa durch die Tsadsee-Schari-Linie, die in noch etwa 200 m Meereshöhe liegt. Der Name S. ist jetzt auf den östlichen Teil (ägyptischer S.) beschränkt. Doch kann man in Anbetracht der verhältnismäßig gleichmäßig zusammengesetzten Bevölkerung (s. unten) und der Einheitlichkeit des innern Baues das oben umschriebene Gebiet als S. weiter bezeichnen. Der Untergrund besteht aus einem Granitgebirge, das in zahlreichen Kuppen an die Oberfläche tritt, und über das Sedimentärbildungen, Sand- und Kalkstein, Diluvium- und Alluvium-Laterit gelagert sind. Das im allgemeinen hügelige (durchschnittlich 400–570 m), im W. sogar ganz ebene Land hat aber auch einige bedeutende Erhebungen, so in Dar Für (Dschebel Marrah 1830 m), in Adamaua (Gendereberge 3000, Atlantika 2700, Mendif 2000 m). Hydrographisch gehört der S. dem Gebiete des Niger und Binuë mit deren Zuflüssen, dem Tsadsee mit dem Schari und dem Nilgebiet an. Man kennt zwei Jahreszeiten: eine trockene, sehr heiße (November b…
related match: Sudan
related: Sudanneger
in scheme: travel!digital Thesaurus
pref label: sudanisch

Sudanneger
type: Concept
in scheme: travel!digital Thesaurus
pref label: Sudanneger
definition: bdk: siehe Neger | Duden: Sudan: Staat im nordöstlichen Afrika | Meyers Großes Konversations-Lexikon 1906: Sudân (Beled es S., »Land der Schwarzen«, Nigritien), der Teil des Binnenlandes von Nordafrika (s. Karten »Ägypten« und »Guinea«), der vom 5.° nördl. Br. im W. bis zum 14.°, im O. bis zum 22.° nördl. Br. reicht, zwischen Sahara, Libyscher und Nubischer Wüste (N.), den innern Bergländern Senegambiens und Guineas (W. und S.), der Nil-Kongo-Wasserscheide (S.) und Abessinien, Erythräa und Rotem Meer (O.). Bei über 5 Mill. qkm Fläche kann man das Gebiet in drei Teile: West-S. (ca. 11/2 Mill. qkm; Senegal- und Nigerländer), Mittlerer S. (die ehemaligen [175] Reiche Bornu, Adamaua, Bagirmi, Wadai; 1,5 Mill. qkm) und Ost-S. (Ägyptischer S.; über 2 Mill. qkm), oder in zwei Teile zerlegen: Hochsudân (W.) und Flachsudân (O.), getrennt etwa durch die Tsadsee-Schari-Linie, die in noch etwa 200 m Meereshöhe liegt. Der Name S. ist jetzt auf den östlichen Teil (ägyptischer S.) beschränkt. Doch kann man in Anbetracht der verhältnismäßig gleichmäßig zusammengesetzten Bevölkerung (s. unten) und der Einheitlichkeit des innern Baues das oben umschriebene Gebiet als S. weiter bezeichnen. Der Untergrund besteht aus einem Granitgebirge, das in zahlreichen Kuppen an die Oberfläche tritt, und über das Sedimentärbildungen, Sand- und Kalkstein, Diluvium- und Alluvium-Laterit gelagert sind. Das im allgemeinen hügelige (durchschnittlich 400–570 m), im W. sogar ganz ebene Land hat aber auch einige bedeutende Erhebungen, so in Dar Für (Dschebel Marrah 1830 m), in Adamaua (Gendereberge 3000, Atlantika 2700, Mendif 2000 m). Hydrographisch gehört der S. dem Gebiete des Niger und Binuë mit deren Zuflüssen, dem Tsadsee mit dem Schari und dem Nilgebiet an. Man kennt zwei Jahreszeiten: eine trockene, sehr heiße (November bis Mai) und eine Regenzeit (Juni bis Oktober), in der das Thermometer manchmal bis 0° fällt, die Flußniederungen aber zu Fieber hauchenden Sümpfen werden. Im O. herrscht Steppencha…
related match: Sudan

Sudanneger
type: Label
in scheme: travel!digital Thesaurus

sudanisch
type: Label
in scheme: travel!digital Thesaurus

singhalesisch
type: Concept
alternative label: altsinghalesisch
definition: Duden: die Singhalesen betreffend, zu ihnen gehörend | [Anm.: unvollständig: die Singhalesen betreffend; von den Singhalesen stammend, zu ihnen gehörend]
pref label: singhalesisch
alt label: altsinghalesisch
related: Singhalese
in scheme: travel!digital Thesaurus

singhalesisch
type: Label
in scheme: travel!digital Thesaurus

altsinghalesisch
type: Label
in scheme: travel!digital Thesaurus

Singhalese
type: Concept
definition: Duden: Angehöriger einer Sprach- und Völkergruppe auf Sri Lanka | Meyers Großes Konversations-Lexikon 1909: Ceylon (im Sanskrit nach dem Beinamen des arischen Eroberers Singhala [»Löwenwohnort«] oder Tamraparni, woher das griechische Taprobane, bei den Eingebornen Lankadiva, arabisch Serendib), britische Insel im Indischen Ozean, an der Südspitze von Vorderindien, von dem sie durch den Golf von Manaar und die 93 km breite Palksstraße getrennt wird, zwischen 5°55'- 9°51' nördl. Br. und 79°41'- 81°54' östl. L., von N. nach S. 445 km lang, 160–235 km breit und 65,610 qkm groß (s. das Kärtchen). C. bildete einst einen Teil des Kontinents. Jetzt zieht sich, wo Insel und Festland sich am meisten nähern, noch die sogen. Adamsbrücke (s.d.) hin. Fast das ganze nördliche Drittel der Insel ist eine prächtig bewaldete Ebene; ein breiter Gürtel von Tiefland umgibt das Bergland auch im südlichen[853] Teil, das in Ausläufern bis zur Süd- und Ostküste reicht und bei einer Länge von 95- 103, einer Breite von 75–90 km, im Durchschnitt 650 m hoch, rund 9000 qkm bedeckt. Auf der innern, 220 qkm großen Hochebene Neura Ellya erheben sich zahlreiche Gipfel, darunter der 2241 m hohe Adamspik (s.d.), der Pedrotallagalla (2538 m), der Kirigallpolla (2380 m), der Totapolla (2353 m). Zwischen den Bergen dehnen sich schöne und fruchtbare Täler aus. Die Nordküste, vor deren Nordende zahllose kleine grüne Inseln legen, und die mit Kokospalmen bedeckte Westküste sind flach, die Süd- und Ostküste steil und felsig; hier bietet der vorzügliche Hafen von Trinkomali Raum und Schutz für die größte Flolte. [...] | Die Bevölkerung, die 1823 nur 750,000 Seelen betrug, stieg bis 1901 auf 3,576,990, darunter 2,334,817 Singhalesen, 952,237 Tamulen, 224,719 Mauren (Nachkommen arabischer Abenteurer), 23,312 Eurasier, 11,207 Malaien, 9583 Europäer und 21,115 Araber, Afghanen, Weddah (s. Tafel »Asiatische Völker II«, Fig. 12), Chinesen, gefangene Buren (ca. 5000) u. a. Die Eurasier, hier Burghers genannt, sind Mi…
in scheme: travel!digital Thesaurus
pref label: Singhalese
related match: Sri Lanka

Singhalese
type: Label
in scheme: travel!digital Thesaurus

Narragansett
type: Concept
definition: Pierer's Universal-Lexikon 1860: Narragansett, 1) Bai des Atlantischen Oceans an der Küste von Rhode Island (Nordamerika); 2) ein Indianerstamm, s. Algonkiner B) a). | Quelle: Pierer's Universal-Lexikon, Band 11. Altenburg 1860, S. 681. | Permalink: http://www.zeno.org/nid/20010496076 | Pierer's Universal-Lexikon 1857: Algonkīner (Algonkinen, Algonquins), eine weitverbreitete Völkergruppe der Indianer in Nordamerika, deren angehörende Stämme od. Völker, deren 26 größere gezählt wurden, einst vom Mississippi bis südlich von der Chesapeakbai u. im Innern bis zum Cumberlandflusse u. an den Mississippi reichte; Labrador, Neu-Schottland u. Neu-Braunschweig, ein großer Theil von Canada, des Gebiets der Hudsonsbaigesellschaft u. der Vereinigten Staaten war einst od. ist noch von A-n bewohnt. Diese große Gruppe wird eingetheilt: A) östliche A.: a) Scheschatapusch u. Scoffies, an der Nordküste des St. Lorenzbusens; b) Mikmaks in Neu-Schottland u. der Westküste u. den Zuflüssen des St. Lorenzbusens; jetzt noch Reste auf Neufundland; c) Etschemins od. Canoemen, am St. John u. zwischen diesem u. dem Penobscott; d) Abenakis, am Kennebec u. Androscoggin. B) A. am Atlantischen Meere: a) Massachusetts, Narragansetts u. Mohikaner, vom Sako bis zum Hudson; alle drei waren sehr nahe mit einander sprachverwandt; die Narragansetts in Connecticut u. Rhode Island galten für die am meisten civilisirten unter den A-n; zu den Mohikanern gehörten die Pequods im östlichen Theile von Connecticut u. einem Theile von Long Island; b) Montaks, auf Long Island; c) Minsi u. Delawaren bildeten früher eine Nation, zwischen Hudson u. Susquehanna, in Neu-Jersey, den Delaware aufwärts bis zu dessen Quellen im Thalbecken des Schuylkill; d) Nanticokes, an der Ostküste der Chesapeakbai, mit den Acçomac; e) Susquehannoks, am Susquehanna; f) Powhattans, in Virginien; g) Pamlicoes, in Nordcarolina südlich bis zum Cap Hatteras, u. die Coramines, im Süden des Neuse, bis zum Cap Fear, der Südgrenze der algonkinisc…
in scheme: travel!digital Thesaurus
related: Indianer
pref label: Narragansett

Narragansett
type: Label
in scheme: travel!digital Thesaurus

Serder
type: Concept
definition: bdk: thrakischer Stamm, Völkerschaft; siehe Thraker | Duden: Thrakien: Gebiet auf der Balkanhalbinsel
in scheme: travel!digital Thesaurus
pref label: Serder
related: Thraker

Serder
type: Label
in scheme: travel!digital Thesaurus

Flathead-Indianer
type: Concept
related: Indianer
in scheme: travel!digital Thesaurus
pref label: Flathead-Indianer
definition: Meyers Großes Konversations-Lexikon 1909: Selisch (Salish oder Flatheads), nordamerikan. Indianervolk in Washington, Idaho, Montana und in Britisch-Columbia. Den Namen Flatheads (»Plattköpfe«) führen sie nach der mehr und mehr außer Gebrauch gekommenen Gewohnheit der künstlichen Verunstaltung des Schädels (s. Makrokephalie). Einschließlich der zu demselben Sprachstamme gehörigen Pend d'Oreille in Montana und der Bilkula (Bella coola) und Kowitschin in Britisch Columbia zählen sie gegen 9000 Seelen. Eine Grammatik ihrer Sprache, die in mehrere Dialekte zerfällt, verfaßte der Jesuit Mengarini, ein Wörterbuch gab Giorda heraus (1877–792 Bde.). Vgl. Smead, Land of the Flatheads (Missoula, Montana, 1905). | Quelle: Meyers Großes Konversations-Lexikon, Band 18. Leipzig 1909, S. 323. | Permalink: http://www.zeno.org/nid/2000746228X

Flathead-Indianer
type: Label
in scheme: travel!digital Thesaurus

römisch
type: Concept
alternative label: altrömisch
pref label: römisch
alternative label: frührömisch
alt label: frührömisch
related: Römer
narrower: weströmisch
definition: Duden: 1. zu Rom | 2. (Geschichte) zu Rom | [Anm.: unvollständig: Rom (bzw. das römische Reich), die Römer betreffend; von den Römern stammend, zu ihnen gehörend; in Rom (bzw. im römischen Reich) gelegen]
narrower: römisch-deutsch
narrower: punisch-römisch
alt label: altrömisch
narrower: römisch-katholisch
alternative label: spät-römisch
narrower: griechisch-römisch
narrower: afrikanisch-römisch
narrower: oströmisch
preferred label: romain @fr
narrower: römisch-jüdisch
narrower: römisch-christlich
narrower: griechisch-römisch-jüdisch
pref label: romain
alternative label: spätrömisch
in scheme: travel!digital Thesaurus
alt label: spätrömisch
alt label: spät-römisch
narrower: phönizisch-römisch
narrower: römisch-griechisch

römisch
type: Label
hasTranslation: romain
in scheme: travel!digital Thesaurus

romain
type: Label
isTranslationOf: römisch
in scheme: travel!digital Thesaurus

frührömisch
type: Label
in scheme: travel!digital Thesaurus

weströmisch
type: Concept
related match: Western Roman Empire
pref label: weströmisch
in scheme: travel!digital Thesaurus
definition: bdk: siehe römisch

weströmisch
type: Label
in scheme: travel!digital Thesaurus

altrömisch
type: Label
in scheme: travel!digital Thesaurus

afrikanisch-römisch
type: Concept
definition: bdk: siehe afrikanisch, römisch
in scheme: travel!digital Thesaurus
pref label: afrikanisch-römisch

afrikanisch-römisch
type: Label
in scheme: travel!digital Thesaurus

oströmisch
type: Concept
pref label: oströmisch
in scheme: travel!digital Thesaurus
related: byzantinisch
related: Oströmer
definition: bdk: siehe römisch, byzantinisch | Duden: Ostrom betreffend

oströmisch
type: Label
in scheme: travel!digital Thesaurus

römisch-christlich
type: Concept
definition: bdk: siehe römisch, christlich
pref label: römisch-christlich
in scheme: travel!digital Thesaurus

römisch-christlich
type: Label
in scheme: travel!digital Thesaurus

spätrömisch
type: Label
in scheme: travel!digital Thesaurus
hasVariant: spät-römisch

spät-römisch
type: Label
isVariantOf: spätrömisch
in scheme: travel!digital Thesaurus

Olmeke
type: Concept
definition: Meyers Großes Konversations-Lexikon 1908: Palenque (spr. -lénke, Nachan), Departementshauptort im N. des mexikan. Staates Chiapas, nicht weit vom Chacamas, der in den Usumacinta mündet, mit 9870 Einw. Etwa 11 km davon liegen die Ruinen des alten Huehuetlapallan (vielleicht das mythische Xibalba, die Stadt der Olmeken), die merkwürdigsten und großartigsten Baudenkmäler von Eingebornen in ganz Amerika, bestehend aus großen künstlichen Terrassen oder terrassierten abgestumpften Pyramiden aus behauenen Steinen, überragt von Bauwerken, bedeckt mit Figuren in Relief oder mit Zeichnungen und Hieroglyphen in Stuck. Der sogen. Palast steht auf einer terrassierten, abgestumpften, mit behauenen Steinen belegten Pyramide, ist 92,3 m lang, 58,5 m tief und 8,1 m hoch, hat an der breiten Seite 14, an jeder andern 11 Tore und 4 innere Höfe, geschmückt durch riesige Figuren in Basrelief von 2,9 und 3,2 m Höhe. Zwischen diesen und andern Ruinen liegen monolithische Statuen u.a. Die 1750 zufällig entdeckte, aber erst 1822 in Europa bekannt gewordene Ruinenstadt wurde von Désiré Charnay (s. d.) besucht und beschrieben. Vgl. La Rochefoucauld, P. et civilisation maya (Par. 1888). | Quelle: Meyers Großes Konversations-Lexikon, Band 15. Leipzig 1908, S. 326. | Permalink: http://www.zeno.org/nid/20007205325
pref label: Olmeke
in scheme: travel!digital Thesaurus
related: Indianer

Olmeke
type: Label
in scheme: travel!digital Thesaurus

hebräisch
type: Concept
related: Hebräer
alternative label: althebräisch
alt label: althebräisch
pref label: hebräisch
in scheme: travel!digital Thesaurus
definition: Duden: die Hebräer betreffend, zu ihnen gehörend | [Anm.: unvollständig: die Hebräer betreffend; von den Hebräern stammend, zu ihnen gehörend]

althebräisch
type: Label
in scheme: travel!digital Thesaurus

hebräisch
type: Label
in scheme: travel!digital Thesaurus

Beni Sabʿa
type: Concept
definition: bdk: arabische Stammesgemeinschaft in Syrien
in scheme: travel!digital Thesaurus
pref label: Beni Sabʿa

Beni Sabʿa
type: Label
in scheme: travel!digital Thesaurus

schweizerisch
type: Concept
preferred label: svizzero @it
definition: Duden: die Schweiz (1), die Schweizer (1) betreffend; von den Schweizern (1) stammend, zu ihnen gehörend | [Anm.: unvollständig: Schweiz, die Schweizer betreffend; von den Schweizern stammend, zu ihnen gehörend; in der Schweiz gelegen]
in scheme: travel!digital Thesaurus
alt label: schweizer
preferred label: suisse @fr
related: Schweizer
pref label: svizzero
pref label: schweizerisch
narrower: deutsch-schweizerisch
pref label: suisse
alternative label: schweizer

schweizer
type: Label
in scheme: travel!digital Thesaurus

svizzero
type: Label
isTranslationOf: schweizerisch
in scheme: travel!digital Thesaurus
hasTranslation: suisse

schweizerisch
type: Label
hasTranslation: suisse
hasTranslation: svizzero
in scheme: travel!digital Thesaurus

suisse
type: Label
isTranslationOf: schweizerisch
in scheme: travel!digital Thesaurus
hasTranslation: svizzero

deutsch-schweizerisch
type: Concept
in scheme: travel!digital Thesaurus
pref label: deutsch-schweizerisch
definition: bdk: Schweizer mit deutscher Muttersprache betreffend

deutsch-schweizerisch
type: Label
in scheme: travel!digital Thesaurus

Heviter
type: Concept
definition: Meyers Großes Konversations-Lexikon 1907: Hevīter (auch Chewiter, hebr. Chiwwi, »Dorf- oder Hofbewohner«), kanaanit. Volk in den palästinischen Gebirgstälern um Gibeon und Sichem nordwärts bis zu den Quellen des Orontes. Sie schlossen sich den Israeliten bei der Eroberung Kanaans freiwillig an und wurden verschont, aber zum Frondienst gezwungen. | Quelle: Meyers Großes Konversations-Lexikon, Band 9. Leipzig 1907, S. 298. | Permalink: http://www.zeno.org/nid/20006771106
in scheme: travel!digital Thesaurus
pref label: Heviter

Heviter
type: Label
in scheme: travel!digital Thesaurus

Yoktanide
type: Concept
related match: Joktan
alternative label: Kahtanide
pref label: Yoktanide
definition: Pierer's Universal-Lexikon 1860: Joktaniden, die alten Volksstämme, welche Jemen u. das Glückliche Arabien bewohnten u. deren Stammvater Joktan (bei den Arabern Kachtan) vor Abrahams Zeit über den Euphrat einwanderte; s.u. Arabien (Gesch.) I. Alb. Schultens Historia imperii vet. Joctanidarum in Arabia felice, Herderw. 1786. | Quelle: Pierer's Universal-Lexikon, Band 9. Altenburg 1860, S. 28. | Permalink: http://www.zeno.org/nid/20010185224
in scheme: travel!digital Thesaurus
alt label: Kahtanide

Yoktanide
type: Label
in scheme: travel!digital Thesaurus

Kahtanide
type: Label
in scheme: travel!digital Thesaurus

Heruler
type: Concept
definition: Meyers Großes Konversations-Lexikon 1907: Heruler (Heruli, Eruli), german. Volk, mit den Skiren, Turcilingern und Rugiern stammverwandt, werden zuerst um 250 genannt. Ursprünglich an der Ostsee seßhaft, wanderten sie nach Süden und beteiligten sich als Bundesgenossen fast an allen Einfällen der Goten in die östlichen Provinzen des römischen Reiches. Der Amaler Hermanrich zwang sie in blutiger Schlacht unter ostgotische Herrschaft. Dann unterwarfen sie sich den Hunnen. Nach Attilas Tode gründeten sie an der Donau ein Reich. Wilde Roheit war der Hauptcharakter dieses Volksstammes, der hartnäckig bei seinem alten Glauben beharrte und selbst Menschenopfer darbrachte, auch die Altersschwachen und Kranken zu töten pflegte. Die Hilfstruppen, die sie den römischen Feldherren schickten, halfen Odoaker 476 das weströmische Kaiserreich stürzen. Ihr König Rodulf schloß mit Theoderich d. Gr. ein Bündnis; sie wurden aber bald von den ihnen zinspflichtigen Langobarden besiegt. Der Rest des Volkes fand nach längerm Umherziehen 512 Aufnahme innerhalb der römischen Reichsgrenzen, während eine andre Abteilung in Skandinavien neben den Gauten Sitze einnahm. Jene von den Römern in Unterpannonien angesiedelten H. blieben, obwohl die Kaiser Anastasios I. und Justinian, unter denen sie das Christentum annahmen, sie öfters züchtigten, ein unbändiges Volk.[241] Als tapfere Krieger leisteten sie jedoch den Byzantinern bedeutende Dienste, besonders bei Besiegung der Wandalen in Afrika und der Ostgoten in Italien. Ihr Name verschwand bald aus der Geschichte; Marquart (»Osteuropäische und ostasiatische Streifzüge«, Leipz. 1903) bringt ihren südrussischen Zweig mit den Hrōs und Warägern des 9. Jahrh. in Verbindung. Mit den »Harlungen« der Sage haben die H. nichts zu schaffen (vgl. Panzer, Deutsche Heldensage im Breisgau, Heidelb. 1904). Vgl. auch Aschbach, Geschichte der H. und Gepiden (Frankf. 1835). | Quelle: Meyers Großes Konversations-Lexikon, Band 9. Leipzig 1907, S. 241-242. | Permalink: ht…
in scheme: travel!digital Thesaurus
pref label: Heruler

Heruler
type: Label
in scheme: travel!digital Thesaurus

mongolisch
type: Concept
related: Mongole
alternative label: mongoloid
definition: Duden: 1. die Mongolei, die Mongolen betreffend, zu ihnen gehörend | [Anm.: unvollständig: die Mongolei, die Mongolen betreffend; von den Mongolen stammend, zu ihnen gehörend; in der Mongolei gelegen]
alt label: mongoloid
narrower: mongolisch-dravidisch
in scheme: travel!digital Thesaurus
pref label: mongolisch

mongoloid
type: Label
isVariantOf: mongolisch
in scheme: travel!digital Thesaurus

mongolisch
type: Label
hasVariant: mongoloid
in scheme: travel!digital Thesaurus

Samariterin
type: Concept
related: Samaritaner
in scheme: travel!digital Thesaurus
pref label: Samariterin
definition: Duden: weibliche Form zu Samariter

Samariterin
type: Label
in scheme: travel!digital Thesaurus

Naphtalit
type: Concept
definition: Meyers Großes Konversations-Lexikon 1908: Naphtăli (hebr., »der Erkämpfte«, 1. Mos. 30, 8), Sohn Jakobs und der Bilha, der Stammvater eines der zwölf israelitischen Stämme, dessen Gebiet im NW. des Galiläischen Sees lag (s. Karte »Palästina«). Aus Kedes in N. ging der Held Barak hervor, der mit Deborah am Kampfe gegen Sisera, den Feldherrn des Kanaaniterkönigs Jabin, hervorragenden Anteil nahm. 734 wird das Gebiet Naphtalis assyrisch. | Quelle: Meyers Großes Konversations-Lexikon, Band 14. Leipzig 1908, S. 411. | Permalink: http://www.zeno.org/nid/20007134096
alternative label: Naphtali
alt label: Naphtali
pref label: Naphtalit
in scheme: travel!digital Thesaurus

Naphtali
type: Label
in scheme: travel!digital Thesaurus

Naphtalit
type: Label
in scheme: travel!digital Thesaurus

bengalisch
type: Concept
definition: Duden: 1. Bengalen, die Bengalen betreffend; aus Bengalen stammend | [Anm.: unvollständig: Bengalen, die Bengalen betreffend; von den Bengalen stammend, zu ihnen gehörend; in Bengalen gelegen]
pref label: bengal
related: Bengale
narrower: ostbengalisch
preferred label: bengal @en
pref label: bengalisch
in scheme: travel!digital Thesaurus

bengal
type: Label
isTranslationOf: bengalisch
in scheme: travel!digital Thesaurus

bengalisch
type: Label
hasTranslation: bengal
in scheme: travel!digital Thesaurus

Bengale
type: Concept
related match: Bengal
pref label: Bengale
alt label: Bengali
alternative label: Bengali
definition: Duden: 1. Einwohnerbezeichnung zu Bengalen | Duden: Bengalen: Provinz in Indien | Meyers Großes Konversations-Lexikon 1905: [632] Bengalen (Bengal), größte und volkreichste Provinz des britisch-ind. Reiches (s. Karte »Ostindien«), zwischen 19°18´-28°15´ nördl. Br. und 82–97° östl. L., grenzt im N. an die Waldlandschaft des Tarai (s. d.) und die Himalajastaaten Nepal, Sikkim und Bhutan, im O. an Assam und Birma, im S. an den Bengalischen Meerbusen, die Provinz Madras und die Zentralprovinzen, im W. an die Central India Agency und an die Nordwestprovinzen; 501,986 qkm, wovon 402,180 qkm unmittelbar unter britischer Verwaltung stehen, 99,806 qkm Lehnsstaaten sind. An das Tarai schließen sich die von den mächtigen Gewässern des Ganges und Brahmaputra mit ihren zahlreichen Nebenflüssen durchzogenen weiten Ebenen, während anderen Mündungen massenhafte Ablagerungen die 130 km landeinwärts reichenden Sunderbands (s. d.) bilden. Die Südhälfte Bengalens erfüllen zahlreiche Höhenzüge (Gama Ghats, Sargudscha-, Nelligrinberge), die im N. im Parasnath und Bharagai (1370 und 1050 m), an der Südgrenze im Tscheliatoka und Keundschur (1010 und 1060 m) ihre höchste Erhebung haben. Außer den beiden Riesenströmen sind zu nennen Gogra, Son, Gandak, Koschi, Tista, Hugli, Sabanrika und im S. Beitarki, Bramani und Mahanadi. Dort tritt auch der große Strandsee Tschilka weit ins Land hinein. Das Klima ist durchaus tropisch. Die mittlere Jahrestemperatur schwankt zwischen 27° in Orissa und 23° in Teilen von Assam; Kalkutta hat 26°, das 2180 m ü. M. gelegene Dardschiling 12° und im Winter bisweilen -5°. Die höchste in Kalkutta beobachtete Temperatur war 41°, die niedrigste 11°. Im obern B. steigt die Hitze noch bedeutend höher. Der Regenfall ist besonders im östlichen Teil außerordentlich reichlich, nach W. und S. nimmt er mehr und mehr ab. Der meiste Regen fällt zwischen Juni und Oktober, dann ist das untere B. auf Strecken von 150 km Länge, 45–60 km Breite überschwemmt. Bleibt der Regen aus, …
in scheme: travel!digital Thesaurus

Bengale
type: Label
hasVariant: Bengali
in scheme: travel!digital Thesaurus

Bengali
type: Label
isVariantOf: Bengale
in scheme: travel!digital Thesaurus

ostbengalisch
type: Concept
preferred label: eastern bengal @en
pref label: eastern bengal
definition: bdk: siehe bengalisch
pref label: ostbengalisch
alt label: eastern bengali
in scheme: travel!digital Thesaurus
alternative label: eastern bengali @en

eastern bengal
type: Label
isTranslationOf: ostbengalisch
hasVariant: eastern bengali
in scheme: travel!digital Thesaurus

ostbengalisch
type: Label
hasTranslation: eastern bengal
in scheme: travel!digital Thesaurus

eastern bengali
type: Label
isVariantOf: eastern bengal
in scheme: travel!digital Thesaurus

tamilisch
type: Concept
in scheme: travel!digital Thesaurus
related: Tamile
pref label: tamilisch
definition: Duden: die Tamilen betreffend, von ihnen stammend, zu ihnen gehörend

tamilisch
type: Label
in scheme: travel!digital Thesaurus

Gaetuler
type: Concept
related: Nomade
pref label: Gaetuler
in scheme: travel!digital Thesaurus
definition: Meyers Großes Konversations-Lexikon 1907: Gätūler (Gaetuli), im Altertum Nomadenvolk in Nordafrika, im Süden von Mauretanien und in dem westlichen Teil der Sahara wohnend, klein und von dunkler Hautfarbe, kleideten sich in Felle und lebten meist von Raub und Plünderung; doch trieb ein Teil von ihnen auch Feld- und Gartenbau. Haupterzeugnisse des Landes waren Purpur und Spargel. | Quelle: Meyers Großes Konversations-Lexikon, Band 7. Leipzig 1907, S. 388. | Permalink: http://www.zeno.org/nid/20006657443

Gaetuler
type: Label
in scheme: travel!digital Thesaurus

vorrömisch
type: Concept
related: römisch
pref label: vorrömisch
in scheme: travel!digital Thesaurus
definition: bdk: siehe römisch

vorrömisch
type: Label
in scheme: travel!digital Thesaurus

Somali
type: Concept
related match: Somali Region
definition: Duden: Angehöriger eines ostafrikanischen Volkes | Pierer's Universal-Lexikon 1863: Somauli, Volk im östlichen Theile Afrika's, ein Mischlingsvolk, welches ursprünglich wohl von den Gallas abstammt u. gleichsam eine Übergangsstufe von dem semitischen Zweige der kaukasischen Race zur Negerrace bildet. Der Körperbau ist lang u. schmal, die Hautfarbe schwarzroth, die Stirn ist hoch, aber schmal, die Nase kurz, der Mund groß, die Lippen dick, das Auge klein u. dunkel. Die Kleidung besteht in zwei nur um den Körper geschlungenen Stücken Baumwollenzeug u. Sandalen. Alle S. gehen bewaffnet mit Speer u. Schild (od. Bogen u. Pfeil) u. einem Dolchmesser. Die häuslichen Arbeiten fallen den Frauen zu. Religion ist der Islam, beschränkt sich jedoch bei allen Stämmen, welche meist an der Küste wohnen, lediglich auf einige äußere Formen. Beschäftigung ist im Inneren meist Viehzucht u. Jagd, an der Küste Handel. Die S. zerfallen in drei große Familien: die S.-Adschi, S.-Hauija u. S.-Rahhan' uin. Der zur Familie Adschi gehörige Zweig Medjertin, welcher ganz im Nordosten wohnt, gilt für den bevorzugtesten u. sein Herrscher führt den Titel Sultan. Hauptstadt der S. ist Berbera. | Quelle: Pierer's Universal-Lexikon, Band 16. Altenburg 1863, S. 271. | Permalink: http://www.zeno.org/nid/20010954252
in scheme: travel!digital Thesaurus
pref label: Somali

Somali
type: Label
in scheme: travel!digital Thesaurus

Gond
type: Concept
in scheme: travel!digital Thesaurus
pref label: Gond
definition: Meyers Großes Konversations-Lexikon 1907: Gond, der größte der drawidischen Völkerreste in Britisch-Indien, bildet die Hauptbevölkerung des waldigen Gondwana (»Land der G.«), namentlich des Striches zwischen der Wainganga, Pranhita und Godavari im W., der Indravati im O. und dem sogen. Gondwanagebirge, der Kette im S. der Narbada, im N. Jetzt ist die einstige Stammeszusammengehörigkeit der G., wodurch sie die arische Kultur im Dekhan wieder vernichteten, völlig gebrochen. Ihre Fürsten in den Waldgebirgen Orissas und den benachbarten Gauen sind gefügige Diener der englischen Regierung. Überhaupt gehen die G. in Sprache, Religion und Sitten immer mehr in den Hindu auf. Nur in den Waldgebieten haben sie sich wenig geändert, obgleich die den Naturkräften dargebrachten Menschenopfer aufgehört haben. Die Sprache, das Gondi, gehört zu den drawidischen Sprachen (s. Drawida); grammatisch wurde sie behandelt von Williamson (»Gondi grammar and vocabulary«). Die Gesamtzahl der in Britisch-Indien das Gondi Sprechenden gibt der Zensus von 1891 auf 1,380,000 an, meist in den Zentralprovinzen, weniger in Berar, Haidarabad u.a. Die Religion ist ein Dienst der Geister (s. Bhûta), der Einfluß der Priester unbegrenzt. Die Größe der G. ist durchschnittlich 161 cm, die Hautfarbe dunkel, fast schwarz, die Stirn breit, die Augen schiefgestellt, klein, tiefliegend und rötlich, die Lippen wulstig, die Haare dick, lang und schwarz, zuweilen rötlich, der Bart schwach, die Brust breit, die Schenkel lang. Die Bekleidung ist spärlich, der Schmuck desto reichlicher. Bei einem der bedeutendsten Stämme, den Moria, wird der Kopf bis auf den Wirbel geschoren, das Gesicht tätowiert. Ackerbau lieben sie nicht, sind aber als Handarbeiter beim Weg- und Bergbau sehr gesucht. Vgl. Forsyth, Highlands of Central India (3. Aufl., Lond. 1889); Dalton, Descriptive ethnology of Bengal (Kalkutta 1872); Risley, Tribes and castes of Bengal (das. 1892, 2 Bde.). | Quelle: Meyers Großes Konversations-Lexikon, Band 8. L…

Gond
type: Label
in scheme: travel!digital Thesaurus

Finnländer
type: Concept
definition: Duden: Finne: Einwohnerbezeichnung zu Finnland | Duden: Finnland: Staat in Nordeuropa | Meyers Großes Konversations-Lexikon 1906: Finnen, ein Zweig der mongolischen Rasse und des uralaltaischen Sprachstammes, dessen Ursitze im Ural und Altai lagen, und die heute noch über ganz Nordwestasien und Nordeuropa und in Europa noch weiter südlich wohnen. Man teilt den finnischen Stamm in folgende vier Familien: 1) die ugrische (Ostjaken, Wogulen, Magyaren); 2) die wolga-bulgarische (Tscheremissen und Mordwinen); 3) die permische (Permier, Syrjänen und Wotjaken); 4) die finnische im engern Sinn (europäische F., Esthen, die fast gänzlich erloschenen Liven und die Lappen). Die meisten der hierher gehörigen Völker haben schon seit grauer Vorzeit durch den Einfluß zivilisierter Völker sich als Viehzüchter und Ackerbauer an ein ansässiges Leben gewöhnt. Nur die Ostjaken und Wogulen sowie die Lappen haben ihr Renntiernomadenleben fortgesetzt. Einzelne der sinn ischen Völker haben das Christentum und mit ihm auch die Zivilisation des Abendlandes angenommen. Zwei sind auch in der Geschichte handelnd aufgetreten und haben selbständige Staaten gebildet: die Magyaren und Bulgaren (s.d.). Während aber die Bulgaren ihre Sprache und Nationalität eingebüßt und diejenige ihrer Unterworfenen, der südlichen Slawen, angenommen haben, ist es den Magyaren gelungen, beide zu behaupten. Die F. haben heute einen sehr gemischten Charakter. Während der Völkerwanderung vermischten sich türkische Völter mit ihnen; andre F., schon früher in Europa wohnhaft, erfuhren germanische und slawische Einwirkung; endlich beteiligten sich an dieser Vermischung noch nordsibirische Völker. Der Körperbau ist meist stark, die Statur aber klein, ihr Kopf fast rund, die Stirn wenig entwickelt, niedrig und gebogen, das Gesicht platt; die Backenknochen sind vorstehend, wie bei den übrigen Mongolen, die Augen meist grau und schräg gestellt; die Nase ist kurz und flach, der Mund hervortretend; die Lippen sind dick, der Nack…
in scheme: travel!digital Thesaurus
pref label: Finnländer

Finnländer
type: Label
in scheme: travel!digital Thesaurus

pontisch
type: Concept
narrower: ostpontisch
in scheme: travel!digital Thesaurus
pref label: pontisch
related: Pontier
narrower: südpontisch
definition: Duden: 1. (Geschichte) das antike Pontos betreffend, aus ihm stammend | [Anm.: unvollständig: den Pontos, die Pontier betreffend; von den Pontiern stammend, zu ihnen gehörend; im Pontos gelegen]

ostpontisch
type: Concept
in scheme: travel!digital Thesaurus
pref label: ostpontisch
definition: bdk: siehe pontisch

ostpontisch
type: Label
in scheme: travel!digital Thesaurus

pontisch
type: Label
in scheme: travel!digital Thesaurus

südpontisch
type: Concept
in scheme: travel!digital Thesaurus
pref label: südpontisch
definition: bdk: siehe pontisch

südpontisch
type: Label
in scheme: travel!digital Thesaurus

kanaanitisch
type: Concept
definition: Duden: Kanaan, die Kanaaniter betreffend; aus Kanaan stammend | [Anm.: unvollständig: Kanaan, die Kanaaniter betreffend; von den Kanaanitern stammend, zu ihnen gehörend; in Kanaan gelegen]
related: Kanaʿaniter
in scheme: travel!digital Thesaurus
pref label: kanaanitisch
alt label: kanaʿanitisch
alternative label: kanaʿanitisch

kanaanitisch
type: Label
in scheme: travel!digital Thesaurus
hasVariant: kanaʿanitisch

kanaʿanitisch
type: Label
in scheme: travel!digital Thesaurus
isVariantOf: kanaanitisch

ceylonisch
type: Concept
definition: Duden: ceylonesisch: Ceylon, die Ceylonesen betreffend; aus Ceylon stammend | [Anm.: unvollständig: Ceylon, die Ceylonesen betreffend; von den Ceylonesen stammend, zu ihnen gehörend; in Ceylon gelegen] | Duden: Ceylon: Insel im Indischen Ozean; früherer Name von Sri Lanka | Meyers Großes Konversations-Lexikon 1905: Ceylon (im Sanskrit nach dem Beinamen des arischen Eroberers Singhala [»Löwenwohnort«] oder Tamraparni, woher das griechische Taprobane, bei den Eingebornen Lankadiva, arabisch Serendib), britische Insel im Indischen Ozean, an der Südspitze von Vorderindien, von dem sie durch den Golf von Manaar und die 93 km breite Palksstraße getrennt wird, zwischen 5°55'- 9°51' nördl. Br. und 79°41'- 81°54' östl. L., von N. nach S. 445 km lang, 160–235 km breit und 65,610 qkm groß (s. das Kärtchen). C. bildete einst einen Teil des Kontinents. Jetzt zieht sich, wo Insel und Festland sich am meisten nähern, noch die sogen. Adamsbrücke (s.d.) hin. Fast das ganze nördliche Drittel der Insel ist eine prächtig bewaldete Ebene; ein breiter Gürtel von Tiefland umgibt das Bergland auch im südlichen[853] Teil, das in Ausläufern bis zur Süd- und Ostküste reicht und bei einer Länge von 95- 103, einer Breite von 75–90 km, im Durchschnitt 650 m hoch, rund 9000 qkm bedeckt. Auf der innern, 220 qkm großen Hochebene Neura Ellya erheben sich zahlreiche Gipfel, darunter der 2241 m hohe Adamspik (s.d.), der Pedrotallagalla (2538 m), der Kirigallpolla (2380 m), der Totapolla (2353 m). Zwischen den Bergen dehnen sich schöne und fruchtbare Täler aus. Die Nordküste, vor deren Nordende zahllose kleine grüne Inseln legen, und die mit Kokospalmen bedeckte Westküste sind flach, die Süd- und Ostküste steil und felsig; hier bietet der vorzügliche Hafen von Trinkomali Raum und Schutz für die größte Flolte. | Die zahlreichen Flüsse sind nur zur Regenzeit wasserreich, der bedeutendste ist der Mahavili Ganga, 330 km lang und zur Hälfte schiffbar. C. besteht in seiner Hauptmasse aus archäischen Gesteine…
related match: Sri Lanka
in scheme: travel!digital Thesaurus
pref label: ceylonisch

ceylonisch
type: Label
in scheme: travel!digital Thesaurus

Sueve
type: Concept
definition: Duden: Swebe: Angehöriger eines Verbandes westgermanischer Stämme Meyers Großes Konversations-Lexikon 1909: Suēven (Sueben, Sweben), german. Völkerbund, der die an der Elbe und Havel wohnenden, weniger von Ackerbau als von Jagd und Viehzucht lebenden kriegerischen, wanderlustigen Stämme umfaßte. Cäsar, der die nach Gallien eingedrungenen S. unter Ariovist 58 v. Chr. besiegt hatte, begreift unter diesem Namen die hinter den Ubiern und Sigambern wohnenden Germanen und berichtet, daß sie 100 Gaue mit je 10,000 streitbaren Männern gezählt, aber sich bei seinem Rheinübergang weit, nach dem Wald Bacenis, zurückgezogen hätten. Sie sollen keine festen Wohnsitze gehabt haben, sondern alljährlich zum Teil auf kriegerische Unternehmungen ausgezogen sein. Tacitus nennt das ganze östliche Germanien von der Donau bis zur Ostsee Suevia. Die Hermunduren gelten ihm als das vorderste, die Semnonen als das angesehenste, die Langobarden als das kühnste unter den suevischen Völkern. Der Dienst der Nerthus (Hertha) war allen S. gemeinschaftlich. Der Markomanne Marbod vereinigte suevische Völker unter seinem Zepter; noch zu Markaurels Zeiten werden Markomannen und Quaden als S. bezeichnet. Kern und Überrest des alten Suevenbundes waren nun die Alemannen. In der Zeit der Völkerwanderung beschränkte sich der Name S. auf die Semnonen. Ein Teil von ihnen nahm 406 an dem Zug des Radagaisus teil. 409 drangen sie mit Wandalen und Alanen[187] über die Pyrenäen und breiteten sich unter Rechila nach Süden über Lusitanien und Bätica aus. Rechilas Sohn Rechiar verlor 456 gegen den westgotischen König Theoderich II. Sieg und Leben, und sein Nachfolger Remismund erkannte die Oberhoheit des Westgoten Eurich an. König Theodemir trat vom Arianismus zum Katholizismus über. 585 ward das suevische Reich dem westgotischen einverleibt. In Deutschland hat sich der Name S. in dem der Schwaben erhalten; einen Gau Svevon südlich von der Bode gab es noch im 13. Jahrh. | Quelle: Meyers Großes Konversations-Lexikon, …
in scheme: travel!digital Thesaurus
pref label: Sueve

Sueve
type: Label
in scheme: travel!digital Thesaurus

Beni Hamîde
type: Concept
alt label: Hamide-Beduine
pref label: Beni Hamîde
alternative label: Hamîdebeduine
alternative label: Hamide-Beduine
related: Beduine
alt label: Hamîdebeduine
in scheme: travel!digital Thesaurus
definition: bdk: arabische Stammesgemeinschaft in Jordanien

Hamide-Beduine
type: Label
hasVariant: Hamîdebeduine
in scheme: travel!digital Thesaurus

Hamîdebeduine
type: Label
isVariantOf: Hamide-Beduine
in scheme: travel!digital Thesaurus

Beni Hamîde
type: Label
in scheme: travel!digital Thesaurus

Hamatiter
type: Concept
definition: bdk: kanaanitischer Stamm
related: Kanaʿaniter
in scheme: travel!digital Thesaurus
pref label: Hamatiter

Hamatiter
type: Label
in scheme: travel!digital Thesaurus

ʿAeneze
type: Concept
alternative label: ʿAeneze-Beduine
alt label: ʿAeneze-Beduine
related: Beduine
alt label: ʿAenezebeduine
definition: bdk: arabische Stammesgemeinschaft in Syrien
alternative label: ʿAenezebeduine
in scheme: travel!digital Thesaurus
pref label: ʿAeneze

ʿAeneze-Beduine
type: Label
in scheme: travel!digital Thesaurus
hasVariant: ʿAenezebeduine

ʿAenezebeduine
type: Label
in scheme: travel!digital Thesaurus
isVariantOf: ʿAeneze-Beduine

ʿAeneze
type: Label
in scheme: travel!digital Thesaurus

Raschâidebeduine
type: Concept
definition: bdk: arabische Stammesgemeinschaft in Syrien
pref label: Raschâidebeduine
related: Beduine
in scheme: travel!digital Thesaurus

Raschâidebeduine
type: Label
in scheme: travel!digital Thesaurus

galizisch
type: Concept
alternative label: galicisch
alt label: galicisch
in scheme: travel!digital Thesaurus
definition: Duden: Galizien, die Galizier betreffend; von den Galiziern stammend, zu ihnen gehörend | [Anm.: unvollständig: Galizien, die Galizier betreffend; von den Galiziern stammend, zu ihnen gehörend; in Galizien gelegen] | Duden: Galizien: historische Landschaft nördlich der Karpaten | Meyers Großes Konversations-Lexikon 1907: Galizĭen, österreich. Kronland, das als solches den Titel »Königreich G. und Lodomerien, nebst dem Großherzogtum Krakau und den Herzogtümern Auschwitz und Zator« führt, liegt zwischen 47°44' bis 50°48' nördl. Br. und 18°56' bis 26°30' östl. L., wird im N. von Rußland (Polen), im O. von Rußland (Wolhynien und Podolien) und der Bukowina, im S. von Ungarn, im W. von Österreichisch- und Preußisch-Schlesien begrenzt und umfaßt ein Areal von 78,496 qkm (1425,6 QM.). S. Karte »Ungarn, Galizien und Bukowina«. [...] | Die Bevölkerung von G. betrug 1869. 5,444,689,1880: 5,958,907,1890: 6,607,816 und Ende 1900: 7,315,939 Einw., zeigt demnach eine sehr starke Vermehrung (in der Periode 1890–1900 um 10,72 Proz.). Auf 1000 Bewohner kamen 1900: 8,7 Trauungen, 44 Lebendgeborne und 28 Gestorbene; es ergab sich sonach ein Geburtenüberschuß von 16 auf 1000 Bewohner. Unter 1000 Gebornen waren 118 unehelich und 22 Totgeborne. Die Volksdichtigkeit betrug 1900: 93 Bewohner auf 1 qkm. Die Bewohner verteilten sich 1900 auf 11,779 Ortsgemein den und Gutsgebiete und 12,421 Ortschaften mit 1,110,863 bewohnten Häusern. Hinsichtlich der Nationalität (Umgangssprache) kommen von der ein heimischen Bevölkerung Ende 1900: 54,75 Proz. auf die Polen, 42,20 Proz. auf die Ruthenen. Jene überwiegen in Westgalizien, diese in Ostgalizien. Die Polen bilden den galizischen Adel, die Städtebevölkerung und im W. auch den Bauernstand. Die Bergbewohner in den westlichen Karpathen heißen Goralen (s.d.); die ruthenischen Gebirgsbewohner heißen Bojken und Huzulen (s.d.). Außerdem wohnen in G. Deutsche (211,752, darunter viele Kolonisten, die seit Joseph II. ins Land kamen); ferner 9014 Tschechen, M…
pref label: galizisch

galicisch
type: Label
isVariantOf: galizisch
in scheme: travel!digital Thesaurus

galizisch
type: Label
hasVariant: galicisch
in scheme: travel!digital Thesaurus

Ituräer
type: Concept
pref label: Ituräer
in scheme: travel!digital Thesaurus
related match: Iturea
definition: bdk: Einwohnerbezeichnung zu Ituräa | Meyers Großes Konversations-Lexikon 1907: Ituräa, Landschaft im NO. von Palästina. Da der Name wahrscheinlich »Land der Bergbewohner« bedeutet, so ist es erklärlich, daß derselbe mehrfach vorkommt. Die Genesis nennt Ituräer als »Söhne Ismaels« und bezeichnet sie dadurch als zu den Nordarabern gehörig; ebenso Strabon und Cassius Dio. Diese sind im Dschebel Hauran zu suchen, wo die in den zahlreichen griechischen Inschriften des 1.–6. Jahrh. vorkommenden Götter- und Personennamen in der Tat arabisch sind. Häufiger wird ein von den Seleukiden unabhängiges I. in der Makkabäerzeit genannt, seitdem Aristobulos I. 107 v. Chr. es zum Teil eroberte. Dieses I. war im Antilibanon und Hermon[115] gelegen, von wo sich das räuberische, im Bogenschießen gewandte Volk unter Ptolemäus, des Mennäus Sohn, über Cölesyrien und den Libanon ausbreitete und den Handel von Damaskus, Berytos und Byblus schädigte, bis Pompejus dasselbe 66 v. Chr. unterwarf. I. kam 36 v. Chr. an Kleopatra, 23 v. Chr. wahrscheinlich durch Augustus an Herodes d. Gr.; 49 n. Chr. wurde es von Kaiser Claudius zur Provinz Syrien geschlagen. | Quelle: Meyers Großes Konversations-Lexikon, Band 10. Leipzig 1907, S. 115-116. | Permalink: http://www.zeno.org/nid/20006832881

Ituräer
type: Label
in scheme: travel!digital Thesaurus

Schan
type: Concept
in scheme: travel!digital Thesaurus
alt label: Shan-Volk
definition: Meyers Großes Konversations-Lexikon 1909: Schan (mit einheimischem Namen Thai), die am meisten ausgebreitete Gruppe der hinterindischen Volksstämme, deren Sitze sich von Assam im W. bis zur chinesischen Provinz Kwangsi im O. und von Bangkok im Süden bis in die chinesische Provinz Yünnan im N. ausdehnen, setzen sich aus Stämmen zusammen, die im Lande selbst viele verschiedene Namen tragen und so verschiedene Dialekte sprechen, daß selbst die benachbarten einander nicht verstehen. Aus der frühern Geschichte der S. ist nichts bekannt, die Kunde beginnt erst mit der Begründung des Reiches im Menamtal (Siam) im J. 1350. Im allgemeinen werden die Stämme in Oberbirma als Groß-S., die weiter gewanderten als Klein-S. bezeichnet. Außerdem unterscheidet man nach den besten Forschungen vier Zweige, einen nordwestlichen, von Assam und Manipur bis zum Irawaddi, den Birmanen sehr ähnlich; einen nördlichen (die chinesischen S.) im westlichsten Teil von Yünnan, die eigentlichen Groß-S.; einen östlichen, die Bevölkerung der Schanstaaten (s. d.) im engeren Sinn; einen südlichen in Siam und Laos. Ihre Stammzusammengehörigkeit zeigen die S. besonders in der Sprache, die mit dem Siamesischen nahe verwandt ist. Vgl. Cushing, Grammar of the Shan language (2. Aufl., Rangun 1887), Shan and English dictionary (das. 1881) und Elementary handbook (2. Aufl. 1888). Nach Merkmalen der Rasse und Sprache sind die S. mit den Chinesen näher verwandt. Sie gelten als das tüchtigste Volk Hinterindiens, sind bessere Ackerbauer als die Birmanen, je nach der Eigenart ihres Landes aber auch mehr der Viehzucht ergeben. Ihre Industrie ist gering. Die S. sind sämtlich Buddhisten, jedoch herrscht noch der Naga- (Schlangen-) Kult als Volksreligion. Aus den Wäldern liefern sie namentlich vorzügliches Tiekholz, außerdem Gummilack und Pferde auf den Markt nach Maulmain. Die Erforschung der S. hat erst in neuester Zeit Fortschritte gemacht. Literatur vgl. Schanstaaten. | Quelle: Meyers Großes Konversations-Lexikon, B…
alternative label: Shanleute
alternative label: Shan-Volk
pref label: Schan
alt label: Shanleute
alternative label: Shanvolk
alt label: Shanvolk

Shan-Volk
type: Label
isVariantOf: Shanvolk
in scheme: travel!digital Thesaurus

Shanvolk
type: Label
hasVariant: Shan-Volk
in scheme: travel!digital Thesaurus

Schan
type: Label
in scheme: travel!digital Thesaurus

Shanleute
type: Label
in scheme: travel!digital Thesaurus

kaukasisch
type: Concept
related match: Caucasian race
related match: Caucasus
definition: Duden: Kaukasien, die Kaukasier betreffend; aus Kaukasien stammend | [Anm.: unvollständig: Kaukasien, die Kaukasier betreffend; von den Kaukasiern stammend, zu ihnen gehörend; in Kaukasien gelegen] | Duden: Kaukasien: Gebiet zwischen Schwarzem Meer und Kaspischem Meer | Meyers Großes Konversations-Lexikon 1907: Kaukasien (hierzu Karte »Kaukasien«), russ. Generalgouvernement im westlichen Asien (von einigen auch zu Europa gerechnet), der Isthmus zwischen dem Asowschen und Schwarzen Meer im W., dem Kaspischen Meer im O. und beiderseits des Kaukasus. Die politische Grenze wird im N. von den Flüssen Jesa, Jegorlyk, Manytsch und Geiduk gebildet; im S. läuft sie von Astara am Kaspischen Meer in nordwestlicher Hauptrichtung bis zum Karadulinischen Posten am Araxes, folgt dann diesem Fluß bis in die Nähe des Großen Ararat und zieht wieder in nordwestlicher Hauptrichtung weiter, bis sie bei Kap Kopmusch das Schwarze Meer erreicht. Der Flächeninhalt dieses Gebietes beträgt 473,227 qkm. Die Küste des Asowschen und Schwarzen Meeres hat 1065 km, die des Kaspischen Meeres 978 km Länge; der Isthmus ist an seiner schmalsten Stelle 535 km breit. [...] | [Bevölkerung.] Nach der ersten allgemeinen Volkszählung im russischen Reich vom 28. Jan. (9. Febr.) 1897 betrug die Bevölkerung des Generalgouvernements: [...] | Auf 100 Männer kommen im ganzen Generalgouvernement 89,5 Frauen, die wenigsten im Schwarzen Meer-Gouvernement (65,5), die meisten im Kubangebiet (97,2). Die bedeutendsten Städte sind Tiflis mit 160,645, Baku mit 112,253, Jekaterinodar mit 65,697, Wladikawkas mit 43,843, Stawropol mit 41,621, Maikop mit 34,191, Jelissawetpol mit 33,090, Kutaïs mit 32,492, Eriwan mit 29,033, Batum mit 28,512, Kars mit 20,891 Einw. Ziskaukasien hat danach auf 221,447 qkm 3,725,543 Einw. (1,902,487 männlich, 1,823,056 weiblich), also 17 auf 1 qkm, Transkaukasien mit Daghestan dagegen auf 251,780 qkm 5,565,547 Einw. (2,983,743 männlich, 2,581,804 weiblich), also 22 auf 1 qkm. [...] | Nach der sei…
pref label: kaukasisch
in scheme: travel!digital Thesaurus
narrower: transkaukasisch

kaukasisch
type: Label
in scheme: travel!digital Thesaurus

transkaukasisch
type: Concept
pref label: transkaukasisch
in scheme: travel!digital Thesaurus
definition: bdk: siehe kaukasisch

transkaukasisch
type: Label
in scheme: travel!digital Thesaurus

rumänisch
type: Concept
related: Rumäne
pref label: rumänisch
definition: Duden: 1. Rumänien, die Rumänen betreffend; von den Rumänen stammend, zu ihnen gehörend | [Anm.: unvollständig: Rumänien, die Rumänen betreffend; von den Rumänen stammend, zu ihnen gehörend; in Rumänien gelegen]
in scheme: travel!digital Thesaurus

rumänisch
type: Label
in scheme: travel!digital Thesaurus

Hethiter
type: Concept
alternative label: Chetiter
alt label: Chetiter
definition: Duden: Angehöriger eines indogermanischen Kulturvolkes in Kleinasien | Meyers Großes Konversations-Lexikon 1907: Hettīter (Hethiter, bei den Ägyptern Cheta), neben Ägyptern und Babyloniern-Assyrern das dritte große Kulturvolk Vorderasiens, in den ägyptischen Denkmälern von Tuthmosis III. bis Ramses (15.–12. Jahrh.) genannt. Es zerstörte um 1350 v. Chr. das am obern Euphrat belegene Reich Mitani, dessen König Duschratta die neuerdings gefundene Korrespondenz mit Amenophis III. geführt hatte. Ramses II. lieferte den Chetas im fünften Jahr seiner Herrschaft (also um 1295) bei Kadesch eine Schlacht, die er als großen Sieg verherrlichte, die aber nicht entscheidend war, denn um 1280 kam es zwischen ihm und dem Chetiterkönig Chetasar zum Frieden und Bündnis. Die Denkmäler der H. erstrecken sich etwa von Hamath bis Karkemisch, doch bilden diese syrischen H. nur einen Zweig einer großen Völkergruppe, deren gleichartige Denkmäler durch ganz Kleinasien bis an das Ägäische Meer verstreut sind. S. auch Sendschirli. Ihre Nationalität ist noch nicht ausgemacht, da die Entzifferung der ganz eigenartigen hettitischen Bilderschrift noch nicht geglückt zu sein scheint. P. Jensen (»Hittiter und Armenier«, Straßburg 1898) glaubt nächste Verwandtschaft mit den heutigen Armeniern annehmen zu dürfen. Vgl. L. Messerschmidt, Corpus Inscriptionum Hettiticarum (in den »Mitteilungen der Vorderasiatischen Gesellschaft«, 1900; Nachtrag 1902) und Die H. (Leipz. 1902); Turajew, Zur Geschichte der H.-Frage (»Zapiski der kaiserlich russischen Archäologischen Gesellschaft«, Bd. 12, 1900); Sayce, The Hittites (3. Aufl., Lond. 1903). | Quelle: Meyers Großes Konversations-Lexikon, Band 9. Leipzig 1907, S. 285. | Permalink: http://www.zeno.org/nid/2000677010X
in scheme: travel!digital Thesaurus
pref label: Hethiter

Chetiter
type: Label
isVariantOf: Hethiter
in scheme: travel!digital Thesaurus

Hethiter
type: Label
hasVariant: Chetiter
in scheme: travel!digital Thesaurus

germanisch
type: Concept
narrower: germanisch-keltisch
definition: Duden: die Germanen betreffend, zu ihnen gehörend, von ihnen stammend [Anm.: unvollständig: Germanien, die germanen betreffend; von den Germanen stammend, zu ihnen gehörend; in Germanien gelegen]
related: Germane
in scheme: travel!digital Thesaurus
pref label: germanisch

germanisch
type: Label
in scheme: travel!digital Thesaurus

hethitisch
type: Concept
definition: Duden: 1. die Hethiter betreffend | [Anm.: unvollständig: die Hethiter betreffend; von den Hethitern stammend, zu ihnen gehörend]
pref label: hethitisch
related: Hethiter
in scheme: travel!digital Thesaurus

hethitisch
type: Label
in scheme: travel!digital Thesaurus

lydisch
type: Concept
definition: Duden: das antike kleinasiatische Lydien betreffend | [Anm.: unvollständig: Lydien, die Lyder betreffend; von den Lydern stammend, zu ihnen gehörend; in Lydien gelegen]
pref label: lydisch
related: Lyder
in scheme: travel!digital Thesaurus

lydisch
type: Label
in scheme: travel!digital Thesaurus

nichtenglisch
type: Concept
in scheme: travel!digital Thesaurus
related: englisch
definition: bdk: siehe englisch
pref label: nichtenglisch

nichtenglisch
type: Label
in scheme: travel!digital Thesaurus

Shoshone
type: Concept
pref label: Shoshone
related: Indianer
in scheme: travel!digital Thesaurus
alt label: Digger-Indianer
alternative label: Digger-Indianer
definition: Meyers Großes Konversations-Lexikon 1909: Schoschonen (Shoshonies), nordamerikan. Indianerstamm, auch Snake- oder Schlangenindianer genannt, zum uto-aztekischen Sprachstamm gehörig, in Idaho und den angrenzenden Teilen von Wyoming, Nevada und Oregon. Die S. wohnen in Dörfern mit großen, hölzernen Häusern, stehen unter erblichen Häuptlingen und zählen gegen 6000 Seelen. In neuester Zeit haben sie sich dem Ackerbau zugewandt. S. Tafel »Amerikanische Völker I«, Fig. 11. | Quelle: Meyers Großes Konversations-Lexikon, Band 18. Leipzig 1909, S. 12. | Permalink: http://www.zeno.org/nid/20007436696

Shoshone
type: Label
in scheme: travel!digital Thesaurus

Digger-Indianer
type: Label
in scheme: travel!digital Thesaurus

vorenglisch
type: Concept
in scheme: travel!digital Thesaurus
definition: bdk: siehe englisch
related: englisch
pref label: vorenglisch

vorenglisch
type: Label
in scheme: travel!digital Thesaurus

kastilisch
type: Concept
related: Kastilier
pref label: kastilisch
in scheme: travel!digital Thesaurus
definition: Duden: Kastilien betreffend | [Anm.: unvollständig: Kastilien, die Kastilier betreffend; von den Kastiliern stammend, zu ihnen gehörend; in Kastilien gelegen]

kastilisch
type: Label
in scheme: travel!digital Thesaurus

peruanisch
type: Concept
definition: Duden: Peru, die Peruaner betreffend; aus Peru stammend | [Anm.: unvollständig: Peru, die Peruaner betreffend; von den Peruanern stammend, zu ihnen gehörend; in Peru gelegen] | Duden: peru: Staat in Südamerika | Meyers Großes Konversations-Lexikon 1908: Perú (hierzu Karte »Peru, Ecuador, Kolumbien und Venezuela«), span. El Peru, Republik in Südamerika, liegt, nachdem 1883 die Provinzen Tarapacá, Arica und Tacna an Chile abgetreten wurden (s. unten »Geschichte«), zwischen 2°20´-17°55´ südl. Br. und 68°50´-81°20´ westl. L., grenzt im N. an Ecuador, im O. an Brasilien und Bolivia, im S. an Chile, im W. an den Stillen Ozean und hat offiziell 1,769,804 qkm Fläche, nach planimetrischer Ausmessung aber nur 1,137,000 qkm. [...] | Nach den im Februar 1898 mit Chile getroffenen Vereinbarungen und den seit 1894 gegenüber Ecuador aufrecht erhaltenen Ansprüchen sowie nach der Berechnung der Volkszahl von 1896 stellen sich Areal und Bevölkerung gegenwärtig wie folgt: | Danach beträgt die durchschnittliche Volksdichte nur 2,6 auf 1 qkm, in Cajamarca 14, in Ancachs und Lambayeque 10, in Huancavelica, Libertad und Lima je 9, aber in Loreto nur 0,2 auf 1 qkm. Auf die Indianer kommen 62, die Mestizen 22,4, die Weißen 12, auf Mulatten und Neger 2 sowie auf Asiaten (besonders Chinesen, seit 1898 auch Japaner) 1,6 Proz. Die Einwanderung aus Europa ist gering. Eine deutsche Kolonie besteht in Pozuzu (s. d.). | Die Indianer treten am stärksten in der Puna und der Sierra hervor. Man unterscheidet Küstenindianer und Gebirgsindianer. Sie sind im allgemeinen mittelgroß, schlank und mehr zäh als kräftig. Eine bestimmte Nationalphysiognomie läßt sich bei ihnen nicht auffinden. Sie werden in der Regel sehr alt, wenn nicht übermäßiger Genuß von Branntwein ihr Leben abkürzt. Die gesamte einheimische Bevölkerung Perus gehört (mit Ausnahme der wilden und wenig bekannten Indianer in den Ebenen des Ostens) der sogen. andoperuanischen Rasse an und zerfällt in zwei Hauptvölkerschaften: die Ketschua oder …
related match: Peru
in scheme: travel!digital Thesaurus
pref label: peruanisch

peruanisch
type: Label
in scheme: travel!digital Thesaurus

Annamit
type: Concept
definition: bdk: Einwohnerbezeichnung zu Annam | bdk: Annam: historische Region in Südostasien | Meyers Großes Konversations-Lexikon 1905: Anam (Annam, »beruhigter Süden«), ein unter franz. Protektorat stehendes Königreich in Hinterindien (s. Karte »Französisch-Hinterindien«), zwischen 17°30´ -10°30´ nördl. Br. und 106°30´ -109° östl. u., im O. vom Chinesischen Meer, im N. von Tongking, im W. von Si am und Kambodscha, im S. von Kotschinchina begrenzt, mit 135,000 qkm und (1898) 6,394,250 Einw., wovon 4000 Chinesen, 250 Europäer. | Bodenbeschaffenheit. Auf das schmale inselreiche Küstenland mit zerrissenen, doch hafenarmen Gestaden folgt ein Terrassenland, das in der die Grenze gegen Siam bildenden Wasserscheide zu Gipfeln über 2000 m emporsteigt. Die Flüsse sind unbedeutend, ausgenommen der zum Mekhong fließende Donnai. Das Klima wird durch die Meeresnähe gemäßigt, höchste Temperatur Juni bis August 37°, niedrigste Dezember bis Januar 11°. Die Regenzeit dauert von November bis April, die Trockenzeit von April bis November. Die Produkte der Pflanzenwelt sind die tropischer Länder (Reis, Baumwolle, Zimt, Gewürze, Zucker, mittelmäßiger Tee, Sesam, Kaffee, Kokosnüsse); die Bergwälder enthalten allerlei Nutzhölzer, darunter das geschätzte Aloeholz. Zur sehr reichen Tierwelt gehören: Tiger, Elefanten, Rhinozerosse, Büffel, die gezähmt zum Bestellen der Felder verwendet werden, zahlreiche Affen, Hirsche, Wildschweine, Pfauen, Papageien. Sehr stark wird der Fang der Fische und Krokodile (wegen ihres besonders geschätzten Schwanzes) betrieben. Haustiere sind kleine Pferde und Rinder, Ziegen, Schafe, besonders aber das chinesische Schwein. Der Mineralreichtum (Gold, Silber, Kupfer, Zink, Eisen, Kohle) ist groß, doch bisher noch nicht ausgebeutet. | Die Bewohner sind Indochinesen und haben sich nur noch im Gebirge rein erhalten, wo sie ziemlich unabhängig leben. Diese Muong (Myong) genannten Bergbewohner sind hellfarbiger und schlanker, aber kräftiger und mutiger als die durch Vermischung…
related match: Annam (French protectorate)
pref label: Annamit
in scheme: travel!digital Thesaurus

Annamit
type: Label
in scheme: travel!digital Thesaurus

mauretanisch
type: Concept
definition: Duden: Mauretanien, die Mauretanier betreffend; von den Mauretaniern stammend, zu ihnen gehörend | Duden: Mauretanien: Staat in Afrika | [Anm.: unvollständig: Mauretanien, die Mauretanier betreffend; von den Mauretaniern stammend, zu ihnen gehörend; in Mauretanien gelegen] | Meyers Großes Konversations-Lexikon 1908: Mauretanĭen (Mauritania), im Altertum ursprünglich der nordwestlichste, etwa dem jetzigen Marokko entsprechende Teil Afrikas, benannt nach den dort wohnenden Mauri oder Maurusii (s. Karte »Römisches Reich«). Den Römern wurden dieselben näher bekannt, als ihr König Bocchus 106 v. Chr. seinen Schwiegersohn Jugurtha an Rom auslieferte, wofür er Westnumidien ostwärts bis zum Nasavath (Wed Sahil), also den größten Teil des jetzigen Algerien, erhielt. Nach dem Tode des letzten Bocchus gab Augustus 25 v. Chr. M. an Juba II.; nachdem Caligula dessen Sohn Ptolemäus hatte umbringen lassen, machte Claudius es 42 n. Chr. zur römischen Provinz, deren Grenze ostwärts vorgerückt wurde bis zum Ampsaga (Wed el Kebir), und teilte es in zwei durch den Muluchat (Muluja) getrennte Provinzen: Mauretania Tingitana im W., den Norden des heutigen Marokko, mit der Hauptstadt Tingis (jetzt Tanger), und M. Caesariensis im O., den größten Teil von Algerien, mit der Hauptstadt Jol Cäsarea (jetzt Scherschel). Die letztere wurde durch Diokletian wieder geteilt in M. Caesariensis, den größern westlichen Teil, und M. Sitifensis, den östlichen Teil mit dem Hafen Saldä (jetzt Bougie) und der Hauptstadt Sitisi (jetzt Setif), M. Tingitana aber zu Hispania geschlagen. 429 kam M. mit Nordafrika in die Gewalt der Wandalen, wurde aber 534 von den Byzantinern und Ende des 7. Jahrh. von den Arabern erobert (Weiteres s. Marokko, Geschichte). Die Bewohner Mauretaniens (Mauri) zerfielen in eine große Anzahl von Stämmen und führten bis auf Strabons Zeit noch größtenteils ein Nomadenleben. Häufig dienten sie als berittene Söldner in den Heeren der Karthager, ihrer einheimischen Könige oder der Römer. A…
related: Nomade
in scheme: travel!digital Thesaurus
pref label: mauretanisch
related match: Mauretania

mauretanisch
type: Label
in scheme: travel!digital Thesaurus

bulgarisch
type: Concept
definition: Duden: Bulgarien, die Bulgaren betreffend; von den Bulgaren stammend, zu ihnen gehörend | [Anm.: unvollständig: Bulgarien, die Bulgaren betreffend; von den Bulgaren stammend, zu ihnen gehörend; in Bulgarien gelegen]
narrower: serbisch-bulgarisch
narrower: bulgarisch-anatolisch
related: Bulgare
narrower: südbulgarisch
in scheme: travel!digital Thesaurus
pref label: bulgarisch

südbulgarisch
type: Concept
in scheme: travel!digital Thesaurus
pref label: südbulgarisch
definition: bdk: siehe bulgarisch

südbulgarisch
type: Label
in scheme: travel!digital Thesaurus

bulgarisch
type: Label
in scheme: travel!digital Thesaurus

berberisch
type: Concept
alternative label: altberberisch
pref label: berberisch
in scheme: travel!digital Thesaurus
narrower: berberisch-phönizisch
related: Berber
definition: Duden: die Berber 1 betreffend | [Anm.: unvollständig: die Berber betreffend; von den Berbern stammend, zu ihnen gehörend]
narrower: kabylisch
alt label: altberberisch

berberisch
type: Label
in scheme: travel!digital Thesaurus

kabylisch
type: Concept
pref label: kabylisch
in scheme: travel!digital Thesaurus
pref label: kabyle
preferred label: kabyle @fr
definition: bdk: die Kabylen betreffend; von den Kabylen stammend, zu ihnen gehörend
alt label: altkabylisch
related: Kabyle
alternative label: altkabylisch

kabylisch
type: Label
hasTranslation: kabyle
in scheme: travel!digital Thesaurus

kabyle
type: Label
isTranslationOf: kabylisch
in scheme: travel!digital Thesaurus

altkabylisch
type: Label
in scheme: travel!digital Thesaurus

altberberisch
type: Label
in scheme: travel!digital Thesaurus

tibetisch
type: Concept
in scheme: travel!digital Thesaurus
pref label: tibetisch
definition: Duden: Tibet, die Tibeter betreffend; von den Tibetern stammend, zu ihnen gehörend | [Anm.: unvollständig: Tibet, die Tibeter betreffend; von den Tibetern stammend, zu ihnen gehörend; in Tibet gelegen]
narrower: tibetisch-lamaistisch
related: Tibeter

tibetisch
type: Label
in scheme: travel!digital Thesaurus

tibetisch-lamaistisch
type: Concept
in scheme: travel!digital Thesaurus
pref label: tibetisch-lamaistisch
related: Lamaismus
definition: bdk: siehe tibetisch, lamaistisch

tibetisch-lamaistisch
type: Label
in scheme: travel!digital Thesaurus

Semang
type: Concept
alternative label: Sakai
in scheme: travel!digital Thesaurus
alt label: Sakai
pref label: Semang
definition: Meyers Großes Konversations-Lexikon 1909: Semang, ein den Negrito nahe verwandter Volksstamm im Innern der Halbinsel Malakka, von ausgesprochen papuanischem Typus wie die Sakai (s. d. 1), von ihnen durch Einzelheiten in Bewaffnung, Kleidung etc., in der Sprache aber nur dialektisch verschieden. | Quelle: Meyers Großes Konversations-Lexikon, Band 18. Leipzig 1909, S. 325. | Permalink: http://www.zeno.org/nid/20007462654

Sakai
type: Label
in scheme: travel!digital Thesaurus

Semang
type: Label
in scheme: travel!digital Thesaurus

vorphönizisch
type: Concept
related: phönizisch
pref label: vorphönizisch
in scheme: travel!digital Thesaurus
definition: bdk: siehe phönizisch

vorphönizisch
type: Label
in scheme: travel!digital Thesaurus

dalmatisch
type: Concept
definition: Duden: Dalmatien, die Dalmatiner (1) betreffend | [Anm.: unvollständig: Dalmatien, die Dalmatiner betreffend; von den Dalmatinern stammend, zu ihnen gehörend; in Dalmatien gelegen]
related: Dalmatiner
in scheme: travel!digital Thesaurus
pref label: dalmatisch

dalmatisch
type: Label
in scheme: travel!digital Thesaurus

Orâon
type: Concept
in scheme: travel!digital Thesaurus
pref label: Orâon
definition: Meyers Großes Konversations-Lexikon 1908: Oráon (Uráon), ein oft zu den Drawida gerechneter, aber zu den Kolariern gehöriger Stamm im Distrikt Tschutia Nagpur der britisch-ind. Provinz Bengalen und in Assam, der sich selbst Khurakh nennt, am besten aber als Dhongar (Bergleute) bekannt ist. Als Arbeiter auf den Teepflanzungen sind die O. auch in andern Bezirken und in den britischen Kolonien zu finden. Ihre Zahl beträgt (1901) 614,501 (in Bengalen 590,627, in Assam 23,861). Sie sind sehr klein, aber wohlgebildet, von fast schwarzer Hautfarbe, großem Mund mit dicken Lippen, platter Nase, niedriger Stirn und häufig wolligem Haar, also von negerartigem Aussehen. Auch in ihrem frohsinnigen Charakter sind sie den Negern ähnlich. Die Frauen tättowieren sich auf der Stirn und beiden Schläfen wie andre Kolarier, die jungen Männer brennen sich als Angehörige einer Schlafgemeinschaft Zeichen auf den Vorderarm. Jedes Dorf hat eine große Anzahl von Schweinen neben Rindern, Schafen, Ziegen, Büffeln. Ihre Hauptnahrung besteht außer Schweinefleisch in Reis, aus dem auch ein Getränk gebraut wird. Die Namen der Stämme sind häufig der Pflanzen- oder Tierwelt entnommen, und dann darf der betreffende Gegenstand nicht gegessen werden. Die O. verehren die Sonne (Dharmi) als Schöpferin und Erhalterin und opfern ihr weiße Tiere. | Quelle: Meyers Großes Konversations-Lexikon, Band 15. Leipzig 1908, S. 94. | Permalink: http://www.zeno.org/nid/20007188064

Orâon
type: Label
in scheme: travel!digital Thesaurus

Gepide
type: Concept
definition: Duden: Angehöriger eines ostgermanischen Volkes | Meyers Großes Konversations-Lexikon 1907: Gepiden, german. Stamm der gotisch-wandalischen Völkergruppe, werden um die Mitte des 3. Jahrh. n. Chr. zuerst erwähnt. Sie saßen damals an den Mündungen der Weichsel und nötigten unter chrem kriegerischen König Fastida die benachbarten Burgundionen zur Auswanderung. Dann zogen sie mit den [618] Goten nach SO. an die untere Donau und unterwarfen sich 375 den Hunnen; ihr König Ardarich focht in der Schlacht auf den Mauriazensischen Feldern 451 mit dem Ostgotenkönig Walamir auf seiten der Hunnen. Nach Attilas Tod 453 nahmen die G. an der Erhebung gegen seinen Sohn Ellak in der großen Völkerschlacht am Fluß Netad teil, gewannen ihre Freiheit wieder und setzten sich in den Besitz Daciens, d. h. des östlichen Ungarn, Siebenbürgens und der Walachei, des Landes zwischen Donau und Aluta; die Oströmer zahlten ihnen bis auf Justinian Tribut. Als 489 der Ostgotenkönig Theoderich nach Italien zog, stellten sich ihm die G. unter ihrem König Traustila an der Ulca (wahrscheinlich der Save) vergeblich entgegen; ein Teil der G. schloß sich dem Sieger an und erscheint später im Heer Theoderichs, die Hauptmasse des Volkes blieb in Daeien zurück. Seitdem dauerte der Kampf zwischen Ostgoten und G. in den Donauländern fort, und die Grenzen zwischen beiden waren schwankend; während der letzten Kämpfe der Ostgoten gegen die Oströmer wandten sich diese gegen die G. und erweckten ihnen seit 548 neue Feinde in den Langobarden. 551 erlitt der König der G., Thorisin, eine Niederlage. 567 kam es zwischen Thorisins Nachfolger Kunimund und dem mit den Avaren verbündeten Langobardenkönig Alboin zu einer entscheidenden Schlacht, Kunimund fiel durch Alboins Hand; der Sieger vermählte sich in zweiter Ehe mit dessen erbeuteter Tochter, der sagenberühmten Rosamunde. Ein Teil der G. unterwarf sich den Avaren, ein andrer folgte den Langobarden nach Italien; später sind sie völlig verschollen. Wie die gotischen Völk…
in scheme: travel!digital Thesaurus
pref label: Gepide

Gepide
type: Label
in scheme: travel!digital Thesaurus

phrygisch
type: Concept
definition: Duden: die Phrygier, Phrygien betreffend | [Anm.: unvollständig: Phrygien, die Phrygier betreffend; von den Phrygiern stammend, zu ihnen gehörend; in Phrygien gelegen] | Duden: Phrygien: historisches Reich in Kleinasien | Meyers Großes Konversations-Lexikon 1908: Phrygĭen, im Altertum Landschaft Kleinasiens, umfaßte ursprünglich das ganze Innere der Westhälfte der Halbinsel, vom mittlern Halys (Kyzyl Irmak) im O. bis zum Quellgebiete des Hermos (Groß-P.) sowie die später zu Mysien gerechnete Südküste der Propontis bis zum Hellespont (Klein-P. oder P. am Hellespont, s. Karte »Alt-Griechenland«) und wurde später, nachdem der Nordosten 278 v. Chr. von den Galatern erobert worden und im SO. viel Land um Ikonion an Lykaonien verloren gegangen war, von Bithynien, Mysien, Lydien, Karien, Pisidien, Lykaonien und Galatien begrenzt. P. ist vorwiegend Hochebene mit teilweise tief eingeschnittenen, engen Flußtälern und vereinzelten, meist nicht hohen Gebirgen (darunter der Dindymos, jetzt Murad Dagh); Hauptflüsse sind: Hermos und Mäander im W., der [839] Thymbres (Pursak) im NO; im S. mehrere große Salzseen. Als die bedeutendsten Städte sind anzuführen im Gebiete des Mäander: Kelänä, Residenz der einheimischen Könige, dabei Apameia Kibotos, Kolossä, Laodikeia und Hierapolis; im N: Doryläon, Kotyäon, und im O. das schlachtenberühmte Ipsos. P. war reich an allerlei Produkten der Natur und des Ackerbaues. Den Goldreichtum bezeugt die dort einheimische Midassage; Marmor wurde besonders bei Synnada gebrochen, und vor allem berühmt waren die Schafe und ihre Wolle. Das Volk der Phryger ist in seine Sitze wahrscheinlich von O. her durch Armenien und Kappadokien eingewandert (Ramsay u.a. lassen sie nach Herodot und Strabon von Europa her einwandern). Schon Herodot hebt ihre Verwandtschaft mit den Armeniern hervor, und daß beide Völker verwandt und arischen Stammes sind, haben die neuern Forschungen bewiesen. Einzelne Teile der Phryger (hier Bryger genannt) drangen in vorhistorischer Zei…
related match: Phrygia
related match: List of ancient tribes in Thrace and Dacia
in scheme: travel!digital Thesaurus
related match: Phrygians
alternative label: altphrygisch
pref label: phrygisch
alt label: altphrygisch

phrygisch
type: Label
in scheme: travel!digital Thesaurus

altphrygisch
type: Label
in scheme: travel!digital Thesaurus

Simeon
type: Concept
definition: Meyers Großes Konversations-Lexikon 1909: Simeon (hebr., »Erhörung«), 1) Sohn Jakobs und der Lea, Haupt eines israelitischen Stammes, der mit dem Stamm Juda im Süden Palästinas wohnte. | 2) (Simon) Sohn des Klopas, soll nach dem Tode Jakobus' des Gerechten Vorsteher der christlichen Gemeinde in Jerusalem gewesen und unter Trajan gekreuzigt worden sein. Fest: 18. Februar. | 3) S. Stylites s. Symeon. | Quelle: Meyers Großes Konversations-Lexikon, Band 18. Leipzig 1909, S. 477. | Permalink: http://www.zeno.org/nid/20007478453
pref label: Simeon
in scheme: travel!digital Thesaurus

Simeon
type: Label
in scheme: travel!digital Thesaurus

palästinensisch
type: Concept
related match: Palestine (region)
pref label: palästinensisch
definition: Duden: Palästina, die Palästinenser betreffend, von den Palästinensern stammend, zu ihnen gehörend | [Anm.: unvollständig: Palästina, die Palästinenser betreffend; von den Palästinensern stammend, zu ihnen gehörend; in Palästina gelegen] | Duden: Palästina: Gebiet zwischen Mittelmeer und Jordan | Meyers Großes Konversations-Lexikon 1908: Palästīna (hierzu die Karte »Palästina«), griechisch-röm. Name für das hebräische Pleschet, das ursprünglich nur die Küstenebene der Philister südlich von Joppe (Jafa) bezeichnete, also mit Philistäa gleichbedeutend ist. Schon früh wurde der Name P. als geographischer Begriff auf das ganze Land der Juden ausgedehnt, und dieser Sprachgebrauch hat sich bis heute erhalten, während die Bibel Ausdrücke braucht, wie Land der Hebräer, Land Israels, Juda (nachexilisch), Jehovas Land, Heiliges Land, Land der Verheißung (Gelobtes Land) etc. Kanaan hieß nur das Westjordanland; im engern Sinne bezeichnete es Philistäa und die nördlich anstoßende phönikische Küste. Letztere beiden Gebiete gehörten jedoch nur zeitweilig zu P., dessen Westgrenze im wesentlichen mit dem Beginn des Hügellandes zusammenfällt. Die nördliche Grenze lag bei Rama (Rame) und Dan (Tell el Kadi) am Fuße des Hermon,[319] die östliche etwa unter 36° östl. L., wo sich der rötliche, ackerbaufähige Boden scharf vom östlichen Weideland der Steppe abhebt, die südliche etwa unter 311/4° nördl. Br. beim heutigen Bir es Seba'a und im Ostjordanland unter 311/2° am Fluß Arnon (Wadi Modschib). Somit beträgt die größte Breite Palästinas im S. etwa 133 km, die geringste im N. 60–70 km, die größte Länge von Bersaba bis Dan 230, vom Arnon bis Dan 200 km. Der Flächeninhalt belief sich rund auf 25,000–27,500 qkm. [...]| [Bevölkerung.] Heute wird P. gebildet durch das Mutesarristik El-Kuds oder Jerusalem, das Wilajet Beirut (nördliches Westjordanland) und das Wilajet Syrien (Ostjordanland), deren Gesamtbevölkerung, soweit jene Bezirke Teile des alten P. umfassen, höchstens 650,000 Seelen beträ…
in scheme: travel!digital Thesaurus
preferred label: palestine @en
related match: Palestinians
related match: State of Palestine
pref label: palestine

palästinensisch
type: Label
hasTranslation: palestine
in scheme: travel!digital Thesaurus

palestine
type: Label
isTranslationOf: palästinensisch
in scheme: travel!digital Thesaurus

Gibliter
type: Concept
definition: bdk: Einwohnerbezeichnung zu Gebal/Byblos | Meyers Großes Konversations-Lexikon 1905: Byblos (hebr. Gebal), uralte Stadt in Phönikien, zwischen Berytos und Tripolis, am Meer, Sitz des Adoniskultus. B., dessen Blüte vor die von Sidon fällt, hatte eigne, den Persern tributpflichtige Herrscher und gehörte in der Diadochenzeit bald zu Ägypten, bald zu Syrien. Später Sitz eines Bischofs, wurde es 1103 von den Kreuzfahrern, 1188 von Saladin, dann wieder von den Franken und endlich von den Türken genommen. Jetzt Dschebêl mit umfangreichen Nekropolen.- | Quelle: Meyers Großes Konversations-Lexikon, Band 3. Leipzig 1905, S. 668. | Permalink: http://www.zeno.org/nid/20006387772
in scheme: travel!digital Thesaurus
pref label: Gibliter
related match: Byblos

Gibliter
type: Label
in scheme: travel!digital Thesaurus

himyarisch
type: Concept
definition: bdk: Himyar, die Himyar betreffend; von den Himyar stammend, zu ihnen gehörend; in Himyar gelegen | bdk: Himyar: südarabischer Stammesverband und Königreich (im heutigen Jemen)
related: Homerite
preferred label: himyarite @fr
in scheme: travel!digital Thesaurus
pref label: himyarite
pref label: himyarisch

himyarite
type: Label
isTranslationOf: himyarisch
in scheme: travel!digital Thesaurus

himyarisch
type: Label
hasTranslation: himyarite
in scheme: travel!digital Thesaurus

ammonitisch
type: Concept
definition: bdk: die Ammoniter betreffend; von den Ammonitern stammend, zu ihnen gehörend
pref label: ammonitisch
related: Ammoniter
in scheme: travel!digital Thesaurus

ammonitisch
type: Label
in scheme: travel!digital Thesaurus

numidisch
type: Concept
preferred label: numidia @la
pref label: numidisch
related match: Numidians
related: Nomade
definition: Duden: Numidien, die Numider betreffend | [Anm.: unvollständig: Numidien, die Numider betreffend; von den Numidern stammend, zu ihnen gehörend; in Numidien gelegen] | Duden: Numidien: antikes nordafrikanisches Reich | Meyers Großes Konversations-Lexikon 1908: Numidĭen, im Altertum ein Reich in Nordafrika, das heutige Algerien begreifend, grenzte gegen Norden an das Mittelmeer, gegen O. an die römische Provinz Afrika, das frühere Gebiet von Karthago, gegen W. an Mauretanien, durch den Fluß Muluchath (Muluja) davon geschieden, und gegen S. an die Ketten des Großen Atlas, die es von dem Lande der Gätuler und dem innern Libyen trennten. Die Einwohner, Numidier (vom griech. Wort Nomaden, ihrer Lebensweise wegen), als Reiter ausgezeichnet, zerfielen in die Massäsylier und die Massylier, jene im westlichen, diese im östlichen Teil des Reiches; der Ampsaga (jetzt Wadi el-Kibir) bildete die Grenze zwischen ihnen. Zur Zeit des zweiten Punischen Krieges stand das westliche N., der bei weitem größere Teil, unter der Herrschaft des Syphax, der es mit den Römern (seit 207 v. Chr.), das östliche unter der des Masinissa, der es mit den Karthagern hielt. Als aber Syphax infolge seiner Verheiratung mit Sophonisbe, der Tochter Hasdrubals, auf die Seite der Karthager herübergezogen wurde und Masinissa vertrieb, suchte dieser Hilfe bei den Römern, die 204 unter Scipio in Afrika landeten, Syphax wiederholt besiegten und sein Reich Masinissa übertrugen. Masinissas Söhne Micipsa, Gulussa und Mastanabal teilten sich in das Erbe des Vaters; doch bemächtigte sich Micipsa wieder des ganzen Reiches und hinterließ es 119 seinen Söhnen Adherbal und Hiempsal und seinem Neffen, dem Sohn Mastanabals, Jugurtha. Nach Jugurthas Vernichtung 106 gaben die Römer den Westen an Mauretanien; den Osten verteilten sie unter die noch übrigen Glieder der königlichen Familie, von denen eins, Juba I., Hiempsals Sohn, im Bürgerkrieg auf die Seite des Pompejus trat, weshalb nach seiner Besiegung in der Schlacht bei …
in scheme: travel!digital Thesaurus
pref label: numidia
related match: Numidia

numidisch
type: Label
hasTranslation: numidia
in scheme: travel!digital Thesaurus

numidia
type: Label
isTranslationOf: numidisch
in scheme: travel!digital Thesaurus

Shawnee
type: Concept
definition: Pierer's Universal-Lexikon 1857: Algonkīner (Algonkinen, Algonquins), eine weitverbreitete Völkergruppe der Indianer in Nordamerika, deren angehörende Stämme od. Völker, deren 26 größere gezählt wurden, einst vom Mississippi bis südlich von der Chesapeakbai u. im Innern bis zum Cumberlandflusse u. an den Mississippi reichte; Labrador, Neu-Schottland u. Neu-Braunschweig, ein großer Theil von Canada, des Gebiets der Hudsonsbaigesellschaft u. der Vereinigten Staaten war einst od. ist noch von A-n bewohnt. Diese große Gruppe wird eingetheilt: A) östliche A.: a) Scheschatapusch u. Scoffies, an der Nordküste des St. Lorenzbusens; b) Mikmaks in Neu-Schottland u. der Westküste u. den Zuflüssen des St. Lorenzbusens; jetzt noch Reste auf Neufundland; c) Etschemins od. Canoemen, am St. John u. zwischen diesem u. dem Penobscott; d) Abenakis, am Kennebec u. Androscoggin. B) A. am Atlantischen Meere: a) Massachusetts, Narragansetts u. Mohikaner, vom Sako bis zum Hudson; alle drei waren sehr nahe mit einander sprachverwandt; die Narragansetts in Connecticut u. Rhode Island galten für die am meisten civilisirten unter den A-n; zu den Mohikanern gehörten die Pequods im östlichen Theile von Connecticut u. einem Theile von Long Island; b) Montaks, auf Long Island; c) Minsi u. Delawaren bildeten früher eine Nation, zwischen Hudson u. Susquehanna, in Neu-Jersey, den Delaware aufwärts bis zu dessen Quellen im Thalbecken des Schuylkill; d) Nanticokes, an der Ostküste der Chesapeakbai, mit den Acçomac; e) Susquehannoks, am Susquehanna; f) Powhattans, in Virginien; g) Pamlicoes, in Nordcarolina südlich bis zum Cap Hatteras, u. die Coramines, im Süden des Neuse, bis zum Cap Fear, der Südgrenze der algonkinischen Sprachen. C) Nördliche A.: a) Knistinos od. Krihks (Creeks), im Süden der Athabaskas, von der Hudsonsbai bis zu den Quellen des Mississtppi; b) Montagnards, am St. Lorenz, von Montreal bis zur Mündung; c) Ottáwas, früher an dem gleichnamigen Flusse in Canada, später in Michigan; d) O…
in scheme: travel!digital Thesaurus
related: Indianer
pref label: Shawnee

Shawnee
type: Label
in scheme: travel!digital Thesaurus

Chilkimeke
type: Concept
definition: bdk: vermutlich anderer Name für Chichimeken | Meyers Großes Konversations-Lexikon 1906: Chichimēken (spr. tschitschi-), sagenhaftes amerikan. Volk, das im 12. Jahrh. das Reich der Tolteken (s.d.) zerstörte und selbst ein Reich gründete, das 1431 von den Azteken überwältigt wurde. Nach neuerer Auffassung ist der Name C. (»Hundevolk«) von den Azteken für verschiedene rohe Völker gebraucht worden. | Quelle: Meyers Großes Konversations-Lexikon, Band 4. Leipzig 1906, S. 19. | Permalink: http://www.zeno.org/nid/2000641835X
pref label: Chilkimeke
in scheme: travel!digital Thesaurus
related: Indianer

Chilkimeke
type: Label
in scheme: travel!digital Thesaurus

Magog
type: Concept
definition: Duden: Gog und Magog: barbarisches Volk der Bibel, das in der Endzeit herrscht und untergeht (Offenbarung 20, 8; eigentlich der König Gog von Magog, Hesekiel 38 f.) | Meyers Großes Konversations-Lexikon 1908: Magog, Name eines Volkes (1. Mos. 10,2; Hesek. 38,2; vgl. 39,6), das unter seinem König Gog, verbündet mit Persern, Armeniern und Kimmeriern, gegen Palästina heranzieht. Wahrscheinlich ist unter M. die Gesamtheit der nördlich von den kaukasischen Gebirgen wohnenden Völker zu verstehen, von denen zu den Hebräern nur dunkle Sagen gedrungen waren. Später galten Gog und M. als Zusammenfassung aller zukünftigen Feinde des Reiches Gottes (Offenb. 20,8). Ebenso werden auch zwei kolossale Kriegerfiguren in der Guildhall zu London bezeichnet, die nach der Sage den Sieg eines sächsischen Riesen über einen Riesen von Cornwallis versinnlichen sollen. | Quelle: Meyers Großes Konversations-Lexikon, Band 13. Leipzig 1908, S. 100. | Permalink: http://www.zeno.org/nid/20007035675
pref label: Magog
in scheme: travel!digital Thesaurus
related: Gog

Magog
type: Label
in scheme: travel!digital Thesaurus

alanisch
type: Concept
related: Nomade
definition: bdk: die Alanen betreffend; von den Alanen stammend, zu ihnen gehörend | Duden: Alane: Angehöriger eines alten Nomadenvolkes | Meyers Großes Konversations-Lexikon 1905: Alānen (Alani, fälschlich Albani), kein germanisches, sondern sarmatisches Nomadenvolk in der Steppe nördlich vom Kaspischen Meer und vom Kaukasus bis zum Tanaïs, wurden 65 v. Chr. von Pompejus bekämpft, beunruhigten unter den Flaviern die römische Reichsgrenze und wurden unter Hadrian durch den Feldherrn und Militärschriftsteller Arrian im Zaum gehalten. Marcus Aurelius hielt sie mühsam in ihren Grenzen; Tacitus (275 n. Chr.) schloß mit ihnen Verträge. 370 wurden sie von den Hunnen unterworfen; ein Teil floh in den Kaukasus (Osseten), ein andrer vereinigte sich mit den Westgoten und focht mit ihnen bei Adrianopel 378 gegen Kaiser Valens; der größte Teil des Volkes schloß sich dem Zug der Hunnen an. Die A., die in Pannonien saßen, nahmen 405 an Radagais' Einfall in Italien teil, gingen mit Vandalen und Sueven über den Rhein und die Pyrenäen und gründeten 411 in Lusitanien (Portugal) ein Reich; dort unter ihrem Fürsten Addac von dem Westgoten Wallia besiegt, siedelten sie mit den Vandalen 429 nach Afrika über. Ein Teil der A. besaß unter Aëtius Valentia (Valence an der Rhône) und focht 451 bei Catalaunum mit gegen die Hunnen; andre saßen bei Orléans und in der Bretagne. Ein ebenfalls aus Gallien nach Italien vordringender Haufe A. unter Beorgus wurde 464 bei Bergamo von Ricimer geschlagen. | Quelle: Meyers Großes Konversations-Lexikon, Band 1. Leipzig 1905, S. 252. | Permalink: http://www.zeno.org/nid/20006206468
pref label: alanisch
in scheme: travel!digital Thesaurus
related match: Alans

alanisch
type: Label
in scheme: travel!digital Thesaurus

Lepcha
type: Concept
in scheme: travel!digital Thesaurus
pref label: Lepcha
definition: Meyers Großes Konversations-Lexikon 1908: Leptscha, tibet. Volksstamm im Himalaja (im Distrikt Dardschiling, in Sikkim, Bhutan und Nepal), (1901) 18,047 Köpfe stark, davon 3000 in Sikkim. Sie sind von ziemlich gefälligem Äußern, gewandt und gutartig, meist Buddhisten (Rotmützen) und nennen sich selbst Rong, die aus Osttibet eingewanderte Herrscherfamilie aber Khamba. Vgl. Mainwairing, Grammar of the Rong (Lepcha) language (Kalkutta 1876); Schott, über die Sprache des Volkes Rong oder L. in Sikkim (Berl. 1882). | Quelle: Meyers Großes Konversations-Lexikon, Band 12. Leipzig 1908, S. 433. | Permalink: http://www.zeno.org/nid/20006994547

Lepcha
type: Label
in scheme: travel!digital Thesaurus

Sabäer
type: Concept
definition: Duden: Angehöriger eines alten Volkes in Südarabien | Meyers Großes Konversations-Lexikon 1909: Sabäer (hebr. Schebâ, arab. Sab. a), Name eines alten Reiches und Volkes in Südarabien, südlich vom Gebirgslande Dschof, der Rivalen und wohl Verdränger der Minäer (s. d.). Schon im 8. Jahrh. v. Chr. erscheinen die S. unter den Assyrien tributpflichtigen Völkern, ohne daß indes die Abhängigkeit eine dauernde wurde. Die Blüte des Reiches beruhte auf dem Zwischenhandel zwischen Indien, Äthiopien und den nördlichen Ländern und spiegelt sich in der Legende von der Königin von Saba wider. Die Hauptstadt des Landes war Ma'rib (Mariaba der Alten). Dorthin unternahm 25 v. Chr. der römische Statthalter von Ägypten, Älius Gallus, einen erfolglosen Feldzug. Von der Festigkeit der Stadt zeugen ihr erfolgreicher Widerstand und die Reste ihrer Mauern, von der hohen Kultur des Landes der Bau mächtiger, noch erkennbarer Dämme für die großen Wasserbehälter oberhalb der Stadt, deren plötzlicher Durchbruch nach der arabischen Tradition ihren Untergang herbeigeführt haben soll. In Wahrheit sind Stadt und Reich seit der Ersetzung des alten Karawanenwegs durch den Seeweg um Arabien herum unter den Ptolemäern und Römern allmählich heruntergekommen, bis im 2.–3. Jahrh. n. Chr. die Himjariten (s. d.) der sabäischen Herrschaft ein Ende machten. Vgl. Glaser, Skizze der Geschichte und Geographie Arabiens,[356] Bd. 2 (Berl. 1890); Winckler im 3. Bande von Helmolts »Weltgeschichte« (Leipz. 1901); Weberin den »Mitteilungen der vorderasiatischen Gesellschaft«, Bd. 6; Schrader, Die Keilinschriften und das Alte Testament, S. 140 ff. (3. Aufl., Berl. 1902); Grimme, Mohammed (Münch. 1904). | Quelle: Meyers Großes Konversations-Lexikon, Band 17. Leipzig 1909, S. 356-357. | Permalink: http://www.zeno.org/nid/20007379099
pref label: Sabäer
in scheme: travel!digital Thesaurus

Sabäer
type: Label
in scheme: travel!digital Thesaurus

samaritanisch
type: Concept
related: Samaritaner
in scheme: travel!digital Thesaurus
pref label: samaritanisch
definition: bdk: die Samaritaner betreffend; von den Samaritaner stammend, zu ihnen gehörend

samaritanisch
type: Label
in scheme: travel!digital Thesaurus

Wuld ʿAli
type: Concept
definition: bdk: arabische Stammesgemeinschaft in Syrien
pref label: Wuld ʿAli
in scheme: travel!digital Thesaurus
related: Beduine

Wuld ʿAli
type: Label
in scheme: travel!digital Thesaurus

japanisch
type: Concept
pref label: japanese
in scheme: travel!digital Thesaurus
narrower: europäisch-japanisch
alternative label: japanesisch
pref label: japanisch
definition: Duden: Japan, die Japaner betreffend | [Anm.: unvollständig: Japan, die Japaner betreffend; von den Japanern stammend, zu ihnen gehörend; in Japan gelegen]
related: Japaner
preferred label: japanese @en
alt label: japanesisch

japanese
type: Label
isTranslationOf: japanisch
in scheme: travel!digital Thesaurus

japanisch
type: Label
hasVariant: japanesisch
hasTranslation: japanese
in scheme: travel!digital Thesaurus

japanesisch
type: Label
isVariantOf: japanisch
in scheme: travel!digital Thesaurus

europäisch-japanisch
type: Concept
in scheme: travel!digital Thesaurus
definition: bdk: siehe europäisch, japanisch
pref label: europäisch-japanisch

europäisch-japanisch
type: Label
in scheme: travel!digital Thesaurus

gallisch
type: Concept
definition: Duden: Gallien, die Gallier betreffend; von den Galliern stammend, zu ihnen gehörend | [Anm.: unvollständig: Gallien, die Gallier betreffend; von den Galliern stammend, zu ihnen gehörend; in Gallien gelegen]
related: Gallier
in scheme: travel!digital Thesaurus
pref label: gallisch

gallisch
type: Label
in scheme: travel!digital Thesaurus

benjaminitisch
type: Concept
related: Benjaminit
pref label: benjaminitisch
in scheme: travel!digital Thesaurus
definition: bdk: die Benjaminiten betreffend; von den Benjaminiten stammend, zu ihnen gehörend

benjaminitisch
type: Label
in scheme: travel!digital Thesaurus

siamesisch
type: Concept
alternative label: reinsiamesisch
in scheme: travel!digital Thesaurus
pref label: siamesisch
alt label: reinsiamesisch
related: Siamese
definition: Duden: Siam, die Siamesen betreffend | [Anm.: unvollständig: Siam, die Siamesen betreffend; von den Siamesen stammend, zu ihnen gehörend; in Siam gelegen]

siamesisch
type: Label
in scheme: travel!digital Thesaurus

reinsiamesisch
type: Label
in scheme: travel!digital Thesaurus

nichttürkisch
type: Concept
related: türkisch
pref label: nichttürkisch
in scheme: travel!digital Thesaurus
definition: bdk: siehe türkisch

nichttürkisch
type: Label
in scheme: travel!digital Thesaurus

neuseeländisch
type: Concept
definition: Duden: Neuseeland, die Neuseeländer betreffend; von den Neuseeländern stammend, zu ihnen gehörend | [Anm.: unvollständig: Neuseeland, die Neuseeländer betreffend; von den Neuseeländern stammend, zu ihnen gehörend; in Neuseeland gelegen] Duden: Neuseeland: Inselstaat im Pazifischen Ozean | Meyers Großes Konversations-Lexikon 1908: Neuseeland (engl. New Zealand; hierzu die Karte »Neuseeland«), brit. Kolonie im südlichen Stillen Ozean, bestehend aus zwei großen, zwischen 34°25´-47°17´ südl. Br. und 166°26´-178°36´ östl. L. gelegenen und durch die Cookstraße getrennten Inseln: Nordinsel (Te Ika a Maui) und Südinsel (Te Wai Punamu), nebst der kleinen Stewartinsel (Rakiura), 269,432 qkm, mit den der neuseeländischen Regierung unterstellten Chatham-, Bounty-, Aucklandsinseln, Antipodeninsel, Campbell- und Kermadekinseln sowie den Cooksinseln, Niue und Roggeveen-Archipel oder Manihiki-Inseln (s. diese Artikel), 271,166 qkm groß. [...] | Die Ureinwohner (Maori) gehören zum polynesischen Volksstamm (s. Tafel »Australier und Ozeanische Völker II«, Fig. 9) und wanderten nach ihren Überlieferungen vor 400 Jahren von Hawaiki (Samoa) ein. Sie sind gut gebaut, von mittlerer Größe, die Haut ist hellbraun, das Haar schwarz. Wörterbücher ihrer Sprache (s. Malaiischpolynesische Sprachen) lieferten W. Williams (4. Aufl., Lond. 1893), Tregear (sprachvergleichend, New Zealand 1891) und Colenso (Wellington 1898), ein Handbuch für Anfänger Williams (3. Aufl., Lond. 1882). In Bildsamkeit überragen sie die übrigen Polynesier weit; als Menschenfresser standen sie aber auch den schlimmsten Volksstämmen nicht nach. Eine staatliche Ordnung fehlte; die zahlreichen Häuptlinge waren stets in Kriege untereinander verwickelt, und die Bevölkerung ist daher sehr gesunken, wozu auch die durch Europäer eingeführten Krankheiten beitragen. Sie sind jetzt sämtlich zum Christentum bekehrt. Die in großer Zahl errichteten Schulen sind gut besucht, und nicht wenige Maori unterscheiden sich kaum von Europäern. Di…
pref label: neuseeländisch
in scheme: travel!digital Thesaurus

neuseeländisch
type: Label
in scheme: travel!digital Thesaurus

Miami
type: Concept
definition: Pierer's Universal-Lexikon 1860: Miamis, Indianerstamm im Süden des Michigan- u. Eriesees (Nordamerika), gehört zur Gruppe der Algonkiner (s.d. D) b). Ihre Sprache hat große Ähnlichkeit mit dem Chippewäischen. Die Substantiva haben eine Pluralform, gewöhnlich die Endung ke. Die Personalpronomina sind nelah ich, kelah du, ihr, kelonah wir, auelua sie. Die Possessiva werden durch Präfixe bezeichnet. Auch die Conjugation erfolgt durch Pronominal Prä- u. Suffixe, z.B. nemênê ich trinke, kimênê du trinkst, mênua er trinkt, kimênê mena wir trinken, kimênê mua ihr trinkt, menòkè sie trinken. Das Präteritum hat chaia vor sich, das Futurum hängt káté an. Die Infinitivendung ist gue. | Quelle: Pierer's Universal-Lexikon, Band 11. Altenburg 1860, S. 231. | Permalink: http://www.zeno.org/nid/20010438831
related: Indianer
in scheme: travel!digital Thesaurus
pref label: Miami

Miami
type: Label
in scheme: travel!digital Thesaurus

kyprisch
type: Concept
definition: Duden: zyprisch: Zypern, die Zyprer betreffend; aus Zypern stammend | [Anm.: unvollständig: Zypern, die Zyprer betreffend; von den Zyprern stammend, zu ihnen gehörend; auf Zypern gelegen] | Duden: Zypern: Inselstaat im Mittelmeer | Meyers Großes Konversations-Lexikon 1906: Cypern (bei den Griechen Kypros, türk. Kibris), die drittgrößte und östlichste der Mittelmeerinseln (s. Karte »Kleinasien« und das Textkärtchen auf S. 392), türkisch, aber seit 1878 unter englischer Verwaltung. Durch die Kilikische Straße von Kleinasien getrennt, aber geologisch zum Faltensystem des Taurus gehörig, liegt C. zwischen 34°33' und 35°41' nördl. Br. in der von den Küsten Syriens und Kilikiens gebildeten nordöstlichen Ecke des Mittelmeers und hat eine ungefähr rechteckige Gestalt mit einer langen, schmalen, gegen NO. gestreckten Halbinsel. Größte Länge 230, Breite 96 km, Flächeninhalt 9601 qkm (174,3 QM.). Das Innere wird von zwei parallelen Gebirgsketten von O. nach W. durchzogen. Das Kettengebirge im N. der Insel (höchste Erhebung der Kornos, 1019 m) besteht in seiner westlichen Hälfte aus steil ausgerichteten harten Kreidekalken, die von Gabbro und Serpentin, Andesit und Liparit durchsetzt werden; im N. wie im S. sind den Kalken diskordant eocäne Mergel und Nummulitenkalke sowie miocäne Sandsteine und kreideartige Kalke mit Einlagerungen von Gips angelagert. Das Massengebirge im S. der Insel (höchster Gipfel der Troodos, 1952 m) setzt sich fast ausschließlich aus Eruptivmassen (Gabbro, Diabas, Serpentin, Andesit, Liparit und Trachyt) zusammen. Die 30–40 km breite Ebene zwischen den beiden genannten Gebirgen (Mesorea) wird von pliocänen und quartären Sanden, Mergeln und Kalkbreccien, auch vulkanischen Tuffen gebildet und hat fast steppenartigen Charakter. Zwischen beiden Gebirgsreihen fließt nach O. der Pidias (Pediäos), der beträchtlichste Fluß Cyperns; die übrigen Flüsse trocknen im Sommer größtenteils aus. Trotzdem blühte C. als heilige Insel der Aphrodite, die hier aus dem Schaum …
pref label: kyprisch
alt label: cyprisch
in scheme: travel!digital Thesaurus
alternative label: cyprisch

kyprisch
type: Label
hasVariant: cyprisch
in scheme: travel!digital Thesaurus

cyprisch
type: Label
isVariantOf: kyprisch
in scheme: travel!digital Thesaurus

Seneca
type: Concept
definition: Brockhaus' Kleines Konversations-Lexikon 1911: Senĕca, Indianerstamm, zu den Irokesen gehörig, im Staate Neuyork und im Indianerterritorium. Nach ihnen benannt der Senecasee im Staate Neuyork, der durch den Seneca- und Oswegofluß in den Ontariosee abfließt; an ihm die Stadt Seneca Falls, (1900) 6519 E. | Quelle: Brockhaus' Kleines Konversations-Lexikon, fünfte Auflage, Band 2. Leipzig 1911., S. 689. | Permalink: http://www.zeno.org/nid/20001557971
in scheme: travel!digital Thesaurus
related: Indianer
pref label: Seneca

Seneca
type: Label
in scheme: travel!digital Thesaurus

Keisit
type: Concept
related: Nordaraber
pref label: Keisit
in scheme: travel!digital Thesaurus
definition: Meyers Großes Konversations-Lexikon 1907: Jemeniten hießen die Bewohner des südlichen Arabien (Jemen), zum Unterschied von den Keisiten, den nördlichen Arabern. Der alte, auf dem Gegensatz von Seßhaftigkeit und Nomadentum beruhende Zwist zwischen J. und Nordarabern dauerte im Islam (s. d.) fort. Vgl. Goldziher, Muhammedanische Studien, Bd. 1, S. 78 (Halle 1889). | Quelle: Meyers Großes Konversations-Lexikon, Band 10. Leipzig 1907, S. 223. | Permalink: http://www.zeno.org/nid/20006840043

Keisit
type: Label
in scheme: travel!digital Thesaurus

Jürüke
type: Concept
related: Nomade
pref label: Jürüke
in scheme: travel!digital Thesaurus
definition: Meyers Großes Konversations-Lexikon 1907: Jürük (»Wanderer«), Nomadenvolk in Kleinasien, das in Zelten aus dunkler Ziegenwolle lebt. Seine Hauptbeschäftigung ist Viehzucht (Dromedare, Schafe, Ziegen) und Anfertigung von Teppichen, Matten und Flechtwerk, seine Hauptnahrung besteht in Milch und Käse. Ackerbau wird wenig getrieben, dagegen eifrig gejagt. Die Tracht besteht in kurzer, brauner Filzjacke, breitem Ledergürtel, in dem Waffen stecken, dunkeln kurzen Filzhosen und im Winter Wollstrümpfen. Sie sind Mohammedaner, haben Koran, Beschneidung, Imams, Hadschis etc., feiern aber weder Ramasan noch Bairam, und ihre sittsamen, fleißigen Frauen gehen unverschleiert. Den Militärdienst scheuen sie; von den Türken werden sie mißachtet, und Heiraten zwischen beiden Völkern finden nicht statt. Sie haben sich auch eine alte Sprache bewahrt, die geheim gehalten wird. Von Gestalt mittelgroß, lang- und hochköpfig und entschieden brünett, sind sie durchaus verschieden von den turkmenischen Nomaden des östlichen Kleinasien, die von den Türken gleichfalls als J. bezeichnet werden. Nach F. v. Luschan stammen sie aus Indien oder einem seiner nordwestlichen Nachbarländer und sind nahe Verwandte der Zigeuner. Bemerkenswert ist der Brauch, die Schädel durch Binden künstlich umzugestalten. | Quelle: Meyers Großes Konversations-Lexikon, Band 10. Leipzig 1907, S. 391. | Permalink: http://www.zeno.org/nid/20006850146

Jürüke
type: Label
in scheme: travel!digital Thesaurus

Tesuque Indianer
type: Concept
related: Indianer
in scheme: travel!digital Thesaurus
pref label: Tesuque Indianer
definition: bdk: Ethnie im Bundesstaat New Mexico

Tesuque Indianer
type: Label
in scheme: travel!digital Thesaurus

Aviter
type: Concept
related: Kanaʿaniter
definition: bdk: kanaanitischer Stamm | Pierer's Universal-Lexikon 1861: Phönikien (Phönīke, Phoenicia, Kanaan) [...] Den Namen Phönikien leiteten die Alten ab entweder von Phönix (s.d. 1), od. von dem griechischen φοίνιξ, d. i. der Palmbaum od. der Purpur, ab, also Palmen- od. Purpurland. Die eigentlichen Phöniker (Kananiter, Zidonier) waren Aramäer od. Semiten u. zwar Kananiter u. sollten von den Küsten des Erythräischen Meeres, u. zwar aus Arabien od. Ägypten, od. von den Küsten des Persischen Meerbusens, od. auch von den sumpfigen Ufern des Euphrat, u. zwar lange vor den Israeliten, hier eingewandert sein. Vor ihnen wohnten die Riesenvölker der Rephaiter, Emiter, Enakiter, Aviter u.a. hier. [...] | Quelle: Pierer's Universal-Lexikon, Band 13. Altenburg 1861, S. 83-84. | Permalink: http://www.zeno.org/nid/2001063326X
in scheme: travel!digital Thesaurus
pref label: Aviter

Aviter
type: Label
in scheme: travel!digital Thesaurus

Yuma-Indianer
type: Concept
definition: Meyers Großes Konversations-Lexikon 1909: Yuma, nordamerikan. Indianervolk, welches das Tal des Colorado in Arizona, das südliche Kalifornien, die Halbinsel Kalifornien und einen Teil der Ostküste des Golfes von Kalifornien bewohnt. Zu den Y. gehören die Maricopa am Gila, die Mohawe und Cocopa am untern Colorado, die Tonto im Tontobecken u. a. Die eigentlichen Y. an der Mündung des Colorado sind ackerbautreibend und geschickt in der Verfertigung von Ton- und Flechtarbeiten. Sie wohnten früher wahrscheinlich in Zufluchtsstätten nach Art[826] der Pueblos und werden als die Erbauer zahlreicher Ruinenstätten im südlichen Arizona angesehen. In der Y.-Reservation in Kalifornien lebten 1890: 1000 Seelen. Vgl. Gatschet, Der Yuma-Sprachstamm (Berl. 1886). | Quelle: Meyers Großes Konversations-Lexikon, Band 20. Leipzig 1909, S. 826-827. | Permalink: http://www.zeno.org/nid/20007713053
in scheme: travel!digital Thesaurus
related: Indianer
pref label: Yuma-Indianer

Yuma-Indianer
type: Label
in scheme: travel!digital Thesaurus

Menâdire-Beduine
type: Concept
definition: bdk: arabische Stammesgemeinschaft in Syrien
pref label: Menâdire-Beduine
in scheme: travel!digital Thesaurus

Menâdire-Beduine
type: Label
in scheme: travel!digital Thesaurus

Ortschaft
type: Concept
narrower: El-Kántara
narrower: Trümmerstätte des römischen Thubursicum Numidarum
narrower: Brookline
narrower: Monte
narrower: Douirat
narrower: Bunarbaschi
narrower: Cintra
definition: bdk: bemerkenswerte Ortschaften, Dörfer, Städte
narrower: Djemmorah
notation: II.05
narrower: Ruinen von Mansura
narrower: Chenini
narrower: Gightis
narrower: Oase
narrower: Sidi Bou-Médine
narrower: Mustapha-Supérieur
narrower: Figig
narrower: Ruinen der Kyrenaika
top concept of: travel!digital Thesaurus

El-Kántara
type: Concept
in scheme: travel!digital Thesaurus
pref label: El-Kántara
definition: bdk: besondere Attraktion

El-Kántara
type: Label
in scheme: travel!digital Thesaurus

Trümmerstätte des römischen Thubursicum Numidarum
type: Concept
in scheme: travel!digital Thesaurus
pref label: Trümmerstätte des römischen Thubursicum Numidarum
definition: bdk: besondere Attraktion

Trümmerstätte des römischen Thubursicum Numidarum
type: Label
in scheme: travel!digital Thesaurus

Brookline
type: Concept
in scheme: travel!digital Thesaurus
pref label: Brookline
definition: bdk: besondere Attraktion

Brookline
type: Label
in scheme: travel!digital Thesaurus

Monte
type: Concept
related match: Las Palmas
related match: Monte (Funchal)
in scheme: travel!digital Thesaurus
pref label: Monte
definition: bdk: besondere Attraktion

Monte
type: Label
in scheme: travel!digital Thesaurus

Douirat
type: Concept
in scheme: travel!digital Thesaurus
pref label: Douirat
definition: bdk: besondere Attraktion

Douirat
type: Label
in scheme: travel!digital Thesaurus

Bunarbaschi
type: Concept
related match: Troy
related match: Bursa
in scheme: travel!digital Thesaurus
pref label: Bunarbaschi
definition: bdk: besondere Attraktion

Bunarbaschi
type: Label
in scheme: travel!digital Thesaurus

Cintra
type: Concept
in scheme: travel!digital Thesaurus
pref label: Cintra
definition: bdk: besondere Attraktion

Cintra
type: Label
in scheme: travel!digital Thesaurus

Djemmorah
type: Concept
in scheme: travel!digital Thesaurus
pref label: Djemmorah
definition: bdk: besondere Attraktion

Djemmorah
type: Label
in scheme: travel!digital Thesaurus

Ruinen von Mansura
type: Concept
definition: bdk: Profanbau | Duden: Ruine: stehen gebliebene Reste eines zum [größeren] Teil zerstörten oder verfallenen [historischen] Bauwerkes | Meyers Großes Konversations-Lexikon 1909: Ruine (lat., franz.), Getrümmer, Reste eines verfallenen oder zerstörten Bauwerkes; überhaupt etwas Zerfallendes. Ruinen von Burgen, Klöstern, Kapellen etc. gereichen oft einer Gegend zum Schmuck, besonders wenn sie auf Anhöhen stehen oder mit Schlingpflanzen und andern Gewächsen (die aber zu ihrer weitern Zerstörung beitragen) bewachsen sind. Im 18. Jahrh. errichtete man in Parkanlagen nicht selten künstliche Ruinen, um eine malerische Wirkung und Landschaftsstimmung zu erzielen (s. Tafel »Gartenkunst II«, Fig. 5). | Quelle: Meyers Großes Konversations-Lexikon, Band 17. Leipzig 1909, S. 246. | Permalink: http://www.zeno.org/nid/20007374100
related match: Mansourah, Algeria
alternative label: Mansura
in scheme: travel!digital Thesaurus
pref label: Ruinen von Mansura
alt label: Mansura

Ruinen von Mansura
type: Label
in scheme: travel!digital Thesaurus

Mansura
type: Label
in scheme: travel!digital Thesaurus

Chenini
type: Concept
in scheme: travel!digital Thesaurus
pref label: Chenini
definition: bdk: besondere Attraktion

Chenini
type: Label
in scheme: travel!digital Thesaurus

Gightis
type: Concept
definition: bdk: Profanbau, Sakralbau
related match: Medenine Governorate
in scheme: travel!digital Thesaurus
pref label: Gightis

Gightis
type: Label
in scheme: travel!digital Thesaurus

Oase
type: Concept
related match: El Oued
narrower: Palmenoase
related match: El Kantara
in scheme: travel!digital Thesaurus
related match: Touggourt
related match: Gabès
related match: Nefta, Tunisia
related match: Gafsa
narrower: Küstenoase
pref label: Oase
definition: bdk: besondere Attraktion | Duden: Stelle mit einer Quelle, mit Wasser und üppiger Vegetation inmitten einer Wüste | Meyers Großes Konversations-Lexikon 1908: Oāsen (griech.; altägypt. Uit, kopt. Uah, »Station«, arab. Wāh, griech. Uasis, Auasis), in Wüsten, besonders in Nordafrika, vorkommende kulturfähige Landstriche in Vertiefungen zwischen Höhenzügen, bewässert durch kleinen, aus spärlichem Regenwasser angesammelten Bach (See) oder durch Quellen aus der umgebenden Hochfläche. Diese Wasseransammlungen bedingen die Bewohnbarkeit der O. und rufen rege Vegetation hervor. Der Charakterbaum der O. Nordafrikas, die Dattelpalme, bildet große zusammenhängende Waldungen, die ihr Entstehen der Kultur verdanken, ebenso wie auch beschränkter Ackerbau erst durch künstliche Bewässerung des Bodens möglich geworden ist. Der Zustand der O. vor der Kultur läßt sich nicht mehr nachweisen. Die Flora der nordafrikanischen O. entspricht derjenigen der Sahara; wie in den Wadis (den tiefern Einschnitten des Wüstenplateaus) nur zur Regenzeit, so entwickelt sich in den O. fortdauernd eine lebhaft grüne Grasdecke, auf der neben Dorngebüschen die Zwergpalme (Chamaerops humilis), der Tamariskenbaum (Tamarix africana) und Pistazien wachsen, wo große Büsche von Zizyphus spina Christi, hohes Ginstergesträuch (Retama), Kruziferen und Kapparidazeen mit großen gefärbten Blumen den Hauptbestandteil der Vegetation bilden. Die O. bilden für die Karawanen, deren Richtung sie bestimmen, unentbehrliche Ruhepunkte, wo sie Wasser und Proviant aufnehmen. Die Karawanenstraßen haben daher seit ältesten Zeiten ihre Richtung beibehalten. Schon im Altertum berühmt (zum Teil auch Verbannungsorte) waren die Oase des Jupiter Ammon (jetzt Oase von Siwah) und die westlichere Oase Audschila sowie die sogen. Kleine (Farafrah und Bacharieh) und Große Oase (Chargeh und Dachel). Die Franzosen haben seit 1856 in Algerien durch Anlage artesischer Brunnen neue O. geschaffen. Große Oasenlandschaften sind Fessan, Tuat, Tibesti…
related match: Tozeur

Palmenoase
type: Concept
related match: Oasis
related match: Bou Saâda
related match: El M'Ghair
pref label: Palmenoase
in scheme: travel!digital Thesaurus
definition: bdk: besondere Attraktion
related match: Moghrar

Palmenoase
type: Label
in scheme: travel!digital Thesaurus

Küstenoase
type: Concept
in scheme: travel!digital Thesaurus
pref label: Küstenoase
related match: Oasis
definition: bdk: besondere Attraktion

Küstenoase
type: Label
in scheme: travel!digital Thesaurus

Oase
type: Label
in scheme: travel!digital Thesaurus

Sidi Bou-Médine
type: Concept
related match: Tlemcen
in scheme: travel!digital Thesaurus
pref label: Sidi Bou-Médine
definition: bdk: besondere Attraktion

Sidi Bou-Médine
type: Label
in scheme: travel!digital Thesaurus

Mustapha-Supérieur
type: Concept
related match: Algiers
in scheme: travel!digital Thesaurus
pref label: Mustapha-Supérieur
definition: bdk: besondere Attraktion

Mustapha-Supérieur
type: Label
in scheme: travel!digital Thesaurus

Figig
type: Concept
in scheme: travel!digital Thesaurus
pref label: Figig
definition: bdk: besondere Attraktion

Figig
type: Label
in scheme: travel!digital Thesaurus

Ruinen der Kyrenaika
type: Concept
definition: Duden: Ruine: stehen gebliebene Reste eines zum [größeren] Teil zerstörten oder verfallenen [historischen] Bauwerkes | Duden: Cyrenaika: Landschaft in Nordafrika | Meyers Großes Konversations-Lexikon 1907: Kyrene, im Altertum mächtige Stadt in Kyrenaika (s. d.), 631 v. Chr. gegründet, 80 Stadien vom Meere gelegen, Geburtsort der Philosophen Aristippos und Karneades und des Dichters Kallimachos. Die Juden machten unter den Ptolemäern ein Viertel der Einwohner aus. Ausgedehnte Ruinen, Gurena genannt. | Quelle: Meyers Großes Konversations-Lexikon, Band 11. Leipzig 1907, S. 905. | Permalink: http://www.zeno.org/nid/20006962440 | Meyers Großes Konversations-Lexikon 1909: Ruine (lat., franz.), Getrümmer, Reste eines verfallenen oder zerstörten Bauwerkes; überhaupt etwas Zerfallendes. Ruinen von Burgen, Klöstern, Kapellen etc. gereichen oft einer Gegend zum Schmuck, besonders wenn sie auf Anhöhen stehen oder mit Schlingpflanzen und andern Gewächsen (die aber zu ihrer weitern Zerstörung beitragen) bewachsen sind. Im 18. Jahrh. errichtete man in Parkanlagen nicht selten künstliche Ruinen, um eine malerische Wirkung und Landschaftsstimmung zu erzielen (s. Tafel »Gartenkunst II«, Fig. 5). | Quelle: Meyers Großes Konversations-Lexikon, Band 17. Leipzig 1909, S. 246. | Permalink: http://www.zeno.org/nid/20007374100
in scheme: travel!digital Thesaurus
pref label: Ruinen der Kyrenaika

Ruinen der Kyrenaika
type: Label
in scheme: travel!digital Thesaurus

Natur
type: Concept
narrower: Rambler’s Rest
narrower: Ocklawaha
narrower: Grotto
narrower: Tiger Hill
narrower: Green Mountain
narrower: Signal Peak
narrower: Inspiration Point
narrower: Boccados Corregos
narrower: Front
narrower: Adirondack Mountains
narrower: Columbia River
narrower: Lake Pontchartrain
narrower: High Rock
narrower: Oberes Geiserbecken
narrower: Pichola-See
narrower: Narragansett Bay
narrower: Galta-Paß
narrower: Currecanti Needle
narrower: Punch Bowl
narrower: Table Rock
narrower: Cayuga Lake
narrower: Twin Lakes
narrower: Golf von Korinth
narrower: Greylock
narrower: Fountain Geyser
narrower: San Ysidro
narrower: Cliff Heights
narrower: James Peak
narrower: Bore Ghât
narrower: Grand Flume
narrower: Jarmûktal
narrower: Mount Marcy oder Tahawus
narrower: Cruz alta
narrower: Karmel
narrower: Wakulla Spring
narrower: Lama Passage
narrower: Penang Hills
narrower: El Capitan
narrower: Lake Pepin
narrower: Mirror Lake
narrower: Ausable Chasm
narrower: Margareteninsel
narrower: San Francisco Bay
narrower: Mohawk-Tal
narrower: Storm King oder Butter Mountain
top concept of: travel!digital Thesaurus
narrower: Mackinac Island
narrower: Giantess
narrower: Plymouth Rock
narrower: Sunset Point
narrower: Manitou Park
narrower: Mount Ascutney
narrower: Adamspik
narrower: Lake George
narrower: Straße von Gibraltar
narrower: Djerid
narrower: Yellowstone National Park
narrower: Cascade Lakes
narrower: Puget Sound
narrower: Squam Lake
narrower: Kroumirie
narrower: Look Out Mountain
narrower: Wallface
narrower: Great Salt Lake
narrower: Djebel Bou-Kornin
narrower: Schwabenberg
narrower: Hoyo von Chorro
narrower: Teháchapi Pass
narrower: Schlucht
narrower: Bambusallee
notation: II.04
narrower: Lake Minnetonka
narrower: Hetch Hetchy
narrower: Somes Sound
narrower: Mount Abu
narrower: Petrified Forest
narrower: Tuscarora Gap
narrower: Prospect Point
narrower: Ute Pass

Rambler’s Rest
type: Concept
pref label: Rambler’s Rest
in scheme: travel!digital Thesaurus
definition: bdk: besondere Attraktion
related match: Niagara Falls

Rambler’s Rest
type: Label
in scheme: travel!digital Thesaurus

Ocklawaha
type: Concept
narrower: Gate of the Ocklawaha
pref label: Ocklawaha
in scheme: travel!digital Thesaurus
definition: bdk: besondere Attraktion

Gate of the Ocklawaha
type: Concept
related match: Ocklawaha River
pref label: Gate of the Ocklawaha
in scheme: travel!digital Thesaurus
definition: bdk: besondere Attraktion

Gate of the Ocklawaha
type: Label
in scheme: travel!digital Thesaurus

Ocklawaha
type: Label
in scheme: travel!digital Thesaurus

Grotto
type: Concept
pref label: Grotto
in scheme: travel!digital Thesaurus
definition: bdk: besondere Attraktion

Grotto
type: Label
in scheme: travel!digital Thesaurus

Tiger Hill
type: Concept
in scheme: travel!digital Thesaurus
pref label: Tiger Hill
definition: bdk: besondere Attraktion

Tiger Hill
type: Label
in scheme: travel!digital Thesaurus

Green Mountain
type: Concept
in scheme: travel!digital Thesaurus
pref label: Green Mountain
definition: bdk: besondere Attraktion

Green Mountain
type: Label
in scheme: travel!digital Thesaurus

Signal Peak
type: Concept
pref label: Signal Peak
in scheme: travel!digital Thesaurus
definition: bdk: besondere Attraktion

Signal Peak
type: Label
in scheme: travel!digital Thesaurus

Inspiration Point
type: Concept
related match: Niagara Falls
in scheme: travel!digital Thesaurus
related match: Yosemite National Park
pref label: Inspiration Point
related match: Inspiration Point
definition: bdk: besondere Attraktion

Inspiration Point
type: Label
in scheme: travel!digital Thesaurus

Boccados Corregos
type: Concept
pref label: Boccados Corregos
in scheme: travel!digital Thesaurus
related match: Madeira
definition: bdk: besondere Attraktion

Boccados Corregos
type: Label
in scheme: travel!digital Thesaurus

Front
type: Concept
pref label: Front
in scheme: travel!digital Thesaurus
definition: bdk: besondere Attraktion
related match: Delaware Park–Front Park System
related match: Buffalo, New York

Front
type: Label
in scheme: travel!digital Thesaurus

Adirondack Mountains
type: Concept
pref label: Adirondack Mountains
in scheme: travel!digital Thesaurus
definition: bdk: besondere Attraktion

Adirondack Mountains
type: Label
in scheme: travel!digital Thesaurus

Columbia River
type: Concept
pref label: Columbia River
in scheme: travel!digital Thesaurus
definition: bdk: besondere Attraktion
related match: Portland (Oregon)

Columbia River
type: Label
in scheme: travel!digital Thesaurus

Lake Pontchartrain
type: Concept
pref label: Lake Pontchartrain
in scheme: travel!digital Thesaurus
definition: bdk: besondere Attraktion

Lake Pontchartrain
type: Label
in scheme: travel!digital Thesaurus

High Rock
type: Concept
pref label: High Rock
in scheme: travel!digital Thesaurus
definition: bdk: besondere Attraktion
related match: Shenandoah Valley

High Rock
type: Label
in scheme: travel!digital Thesaurus

Oberes Geiserbecken
type: Concept
related match: Geothermal areas of Yellowstone
pref label: Oberes Geiserbecken
in scheme: travel!digital Thesaurus
definition: bdk: besondere Attraktion

Oberes Geiserbecken
type: Label
in scheme: travel!digital Thesaurus

Pichola-See
type: Concept
in scheme: travel!digital Thesaurus
pref label: Pichola-See
definition: bdk: besondere Attraktion

Pichola-See
type: Label
in scheme: travel!digital Thesaurus

Narragansett Bay
type: Concept
in scheme: travel!digital Thesaurus
pref label: Narragansett Bay
definition: bdk: besondere Attraktion

Narragansett Bay
type: Label
in scheme: travel!digital Thesaurus

Galta-Paß
type: Concept
in scheme: travel!digital Thesaurus
pref label: Galta-Paß
related match: Galtaji
definition: bdk: besondere Attraktion

Galta-Paß
type: Label
in scheme: travel!digital Thesaurus

Currecanti Needle
type: Concept
pref label: Currecanti Needle
in scheme: travel!digital Thesaurus
definition: bdk: besondere Attraktion

Currecanti Needle
type: Label
in scheme: travel!digital Thesaurus

Punch Bowl
type: Concept
related match: Geothermal areas of Yellowstone
pref label: Punch Bowl
in scheme: travel!digital Thesaurus
definition: bdk: besondere Attraktion

Punch Bowl
type: Label
in scheme: travel!digital Thesaurus

Table Rock
type: Concept
pref label: Table Rock
in scheme: travel!digital Thesaurus
definition: bdk: besondere Attraktion

Table Rock
type: Label
in scheme: travel!digital Thesaurus

Cayuga Lake
type: Concept
pref label: Cayuga Lake
in scheme: travel!digital Thesaurus
definition: bdk: besondere Attraktion

Cayuga Lake
type: Label
in scheme: travel!digital Thesaurus

Twin Lakes
type: Concept
pref label: Twin Lakes
in scheme: travel!digital Thesaurus
definition: bdk: besondere Attraktion

Twin Lakes
type: Label
in scheme: travel!digital Thesaurus

Golf von Korinth
type: Concept
pref label: Golf von Korinth
in scheme: travel!digital Thesaurus
definition: bdk: besondere Attraktion

Golf von Korinth
type: Label
in scheme: travel!digital Thesaurus

Greylock
type: Concept
in scheme: travel!digital Thesaurus
pref label: Greylock
definition: bdk: besondere Attraktion

Greylock
type: Label
in scheme: travel!digital Thesaurus

Fountain Geyser
type: Concept
pref label: Fountain Geyser
in scheme: travel!digital Thesaurus
definition: bdk: besondere Attraktion

Fountain Geyser
type: Label
in scheme: travel!digital Thesaurus

San Ysidro
type: Concept
pref label: San Ysidro
in scheme: travel!digital Thesaurus
definition: bdk: besondere Attraktion

San Ysidro
type: Label
in scheme: travel!digital Thesaurus

Cliff Heights
type: Concept
related match: Spokane, Washington
pref label: Cliff Heights
in scheme: travel!digital Thesaurus
definition: bdk: besondere Attraktion

Cliff Heights
type: Label
in scheme: travel!digital Thesaurus

James Peak
type: Concept
pref label: James Peak
in scheme: travel!digital Thesaurus
definition: bdk: besondere Attraktion

James Peak
type: Label
in scheme: travel!digital Thesaurus

Bore Ghât
type: Concept
in scheme: travel!digital Thesaurus
pref label: Bore Ghât
definition: bdk: besondere Attraktion

Bore Ghât
type: Label
in scheme: travel!digital Thesaurus

Grand Flume
type: Concept
pref label: Grand Flume
in scheme: travel!digital Thesaurus
definition: bdk: besondere Attraktion
related match: Ausable Chasm (New York)

Grand Flume
type: Label
in scheme: travel!digital Thesaurus

Jarmûktal
type: Concept
pref label: Jarmûktal
in scheme: travel!digital Thesaurus
definition: bdk: besondere Attraktion

Jarmûktal
type: Label
in scheme: travel!digital Thesaurus

Mount Marcy oder Tahawus
type: Concept
alternative label: Mount Marcy
alt label: Mount Marcy
pref label: Mount Marcy oder Tahawus
in scheme: travel!digital Thesaurus
definition: bdk: besondere Attraktion

Mount Marcy
type: Label
in scheme: travel!digital Thesaurus

Mount Marcy oder Tahawus
type: Label
in scheme: travel!digital Thesaurus

Cruz alta
type: Concept
pref label: Cruz alta
in scheme: travel!digital Thesaurus
related match: Sintra
definition: bdk: besondere Attraktion

Cruz alta
type: Label
in scheme: travel!digital Thesaurus

Karmel
type: Concept
pref label: Karmel
in scheme: travel!digital Thesaurus
definition: bdk: besondere Attraktion

Karmel
type: Label
in scheme: travel!digital Thesaurus

Wakulla Spring
type: Concept
pref label: Wakulla Spring
in scheme: travel!digital Thesaurus
definition: bdk: besondere Attraktion

Wakulla Spring
type: Label
in scheme: travel!digital Thesaurus

Lama Passage
type: Concept
pref label: Lama Passage
in scheme: travel!digital Thesaurus
definition: bdk: besondere Attraktion

Lama Passage
type: Label
in scheme: travel!digital Thesaurus

Penang Hills
type: Concept
in scheme: travel!digital Thesaurus
pref label: Penang Hills
definition: bdk: besondere Attraktion

Penang Hills
type: Label
in scheme: travel!digital Thesaurus

El Capitan
type: Concept
pref label: El Capitan
in scheme: travel!digital Thesaurus
definition: bdk: besondere Attraktion

El Capitan
type: Label
in scheme: travel!digital Thesaurus

Lake Pepin
type: Concept
pref label: Lake Pepin
in scheme: travel!digital Thesaurus
definition: bdk: besondere Attraktion

Lake Pepin
type: Label
in scheme: travel!digital Thesaurus

Mirror Lake
type: Concept
pref label: Mirror Lake
in scheme: travel!digital Thesaurus
definition: bdk: besondere Attraktion

Mirror Lake
type: Label
in scheme: travel!digital Thesaurus

Ausable Chasm
type: Concept
pref label: Ausable Chasm
in scheme: travel!digital Thesaurus
definition: bdk: besondere Attraktion

Ausable Chasm
type: Label
in scheme: travel!digital Thesaurus

Margareteninsel
type: Concept
alternative label: Margareten-Insel
in scheme: travel!digital Thesaurus
pref label: Margareteninsel
alt label: Margareten-Insel
definition: bdk: besondere Attraktion

Margareteninsel
type: Label
hasVariant: Margareten-Insel
in scheme: travel!digital Thesaurus

Margareten-Insel
type: Label
isVariantOf: Margareteninsel
in scheme: travel!digital Thesaurus

San Francisco Bay
type: Concept
alternative label: Bucht von San Francisco
alt label: Bucht von San Francisco
pref label: San Francisco Bay
in scheme: travel!digital Thesaurus
definition: bdk: besondere Attraktion

Bucht von San Francisco
type: Label
in scheme: travel!digital Thesaurus

San Francisco Bay
type: Label
in scheme: travel!digital Thesaurus

Mohawk-Tal
type: Concept
pref label: Mohawk-Tal
in scheme: travel!digital Thesaurus
definition: bdk: besondere Attraktion

Mohawk-Tal
type: Label
in scheme: travel!digital Thesaurus

Storm King oder Butter Mountain
type: Concept
in scheme: travel!digital Thesaurus
pref label: Storm King oder Butter Mountain
definition: bdk: besondere Attraktion

Storm King oder Butter Mountain
type: Label
in scheme: travel!digital Thesaurus

Mackinac Island
type: Concept
pref label: Mackinac Island
in scheme: travel!digital Thesaurus
definition: bdk: besondere Attraktion

Mackinac Island
type: Label
in scheme: travel!digital Thesaurus

Giantess
type: Concept
pref label: Giantess
in scheme: travel!digital Thesaurus
definition: bdk: besondere Attraktion

Giantess
type: Label
in scheme: travel!digital Thesaurus

Plymouth Rock
type: Concept
in scheme: travel!digital Thesaurus
pref label: Plymouth Rock
definition: bdk: besondere Attraktion

Plymouth Rock
type: Label
in scheme: travel!digital Thesaurus

Sunset Point
type: Concept
in scheme: travel!digital Thesaurus
pref label: Sunset Point
definition: bdk: besondere Attraktion
related match: Mount Abu

Sunset Point
type: Label
in scheme: travel!digital Thesaurus

Manitou Park
type: Concept
pref label: Manitou Park
in scheme: travel!digital Thesaurus
definition: bdk: besondere Attraktion

Manitou Park
type: Label
in scheme: travel!digital Thesaurus

Mount Ascutney
type: Concept
in scheme: travel!digital Thesaurus
pref label: Mount Ascutney
definition: bdk: besondere Attraktion

Mount Ascutney
type: Label
in scheme: travel!digital Thesaurus

Adamspik
type: Concept
in scheme: travel!digital Thesaurus
pref label: Adamspik
definition: bdk: besondere Attraktion

Adamspik
type: Label
in scheme: travel!digital Thesaurus

Lake George
type: Concept
pref label: Lake George
in scheme: travel!digital Thesaurus
definition: bdk: besondere Attraktion

Lake George
type: Label
in scheme: travel!digital Thesaurus

Straße von Gibraltar
type: Concept
pref label: Straße von Gibraltar
in scheme: travel!digital Thesaurus
definition: bdk: besondere Attraktion

Straße von Gibraltar
type: Label
in scheme: travel!digital Thesaurus

Djerid
type: Concept
pref label: Djerid
in scheme: travel!digital Thesaurus
definition: bdk: besondere Attraktion

Djerid
type: Label
in scheme: travel!digital Thesaurus

Yellowstone National Park
type: Concept
pref label: Yellowstone National Park
in scheme: travel!digital Thesaurus
definition: bdk: besondere Attraktion

Yellowstone National Park
type: Label
in scheme: travel!digital Thesaurus

Cascade Lakes
type: Concept
pref label: Cascade Lakes
in scheme: travel!digital Thesaurus
definition: bdk: besondere Attraktion
related match: Adirondack Mountains

Cascade Lakes
type: Label
in scheme: travel!digital Thesaurus

Puget Sound
type: Concept
pref label: Puget Sound
in scheme: travel!digital Thesaurus
definition: bdk: besondere Attraktion

Puget Sound
type: Label
in scheme: travel!digital Thesaurus

Squam Lake
type: Concept
in scheme: travel!digital Thesaurus
pref label: Squam Lake
definition: bdk: besondere Attraktion

Squam Lake
type: Label
in scheme: travel!digital Thesaurus

Kroumirie
type: Concept
pref label: Kroumirie
in scheme: travel!digital Thesaurus
definition: bdk: besondere Attraktion

Kroumirie
type: Label
in scheme: travel!digital Thesaurus

Look Out Mountain
type: Concept
pref label: Look Out Mountain
in scheme: travel!digital Thesaurus
definition: bdk: besondere Attraktion

Look Out Mountain
type: Label
in scheme: travel!digital Thesaurus

Wallface
type: Concept
pref label: Wallface
in scheme: travel!digital Thesaurus
definition: bdk: besondere Attraktion
related match: Adirondack Mountains

Wallface
type: Label
in scheme: travel!digital Thesaurus

Great Salt Lake
type: Concept
pref label: Great Salt Lake
in scheme: travel!digital Thesaurus
definition: bdk: besondere Attraktion

Great Salt Lake
type: Label
in scheme: travel!digital Thesaurus

Djebel Bou-Kornin
type: Concept
alternative label: Djebel Bou-Kournine
pref label: Djebel Bou-Kornin
in scheme: travel!digital Thesaurus
alt label: Djebel Bou-Kournine
definition: bdk: besondere Attraktion

Djebel Bou-Kornin
type: Label
hasVariant: Djebel Bou-Kournine
in scheme: travel!digital Thesaurus

Djebel Bou-Kournine
type: Label
isVariantOf: Djebel Bou-Kornin
in scheme: travel!digital Thesaurus

Schwabenberg
type: Concept
in scheme: travel!digital Thesaurus
pref label: Schwabenberg
related match: Budapest Cog-wheel Railway
related match: Budapest
definition: bdk: besondere Attraktion

Schwabenberg
type: Label
in scheme: travel!digital Thesaurus

Hoyo von Chorro
type: Concept
pref label: Hoyo von Chorro
in scheme: travel!digital Thesaurus
related match: Málaga
definition: bdk: besondere Attraktion

Hoyo von Chorro
type: Label
in scheme: travel!digital Thesaurus

Teháchapi Pass
type: Concept
pref label: Teháchapi Pass
in scheme: travel!digital Thesaurus
definition: bdk: besondere Attraktion

Teháchapi Pass
type: Label
in scheme: travel!digital Thesaurus

Schlucht
type: Concept
narrower: Gôkteik-Schlucht
narrower: großer Cañon des Yellowstone
narrower: erster Cañon des Yellowstone
narrower: Tolteken-Schlucht
narrower: Animas Cañon
narrower: Tilatouschlucht
narrower: Plattekill Clove
narrower: Seldjaschlucht
narrower: Gibbon Cañon
narrower: Castle oder Price River Cañon
narrower: Boulder Cañon
narrower: Bear River Cañon
in scheme: travel!digital Thesaurus
pref label: Schlucht
narrower: großer Cañon des Colorado
narrower: Cheyenne Cañons
related match: El Kantara
narrower: Barranco del Infierno
narrower: Metlac-Schlucht
narrower: Yakima Cañon
narrower: Hopper
narrower: Comanche Cañon
narrower: Cañon des Grand River
narrower: Cañon des Tuólumne
narrower: Granite oder Eleven Mile Cañon
narrower: Rhumelschlucht
narrower: Stony Clove
narrower: Ogden River Cañon
narrower: Black Cañon oder die Große Schlucht des Gunnison
narrower: großer Cañon des Arkansas
narrower: Schlucht des Brandywine
narrower: Weber Cañon
narrower: Clear Creek Cañon
definition: bdk: besondere Attraktion
narrower: Barranco de Tejeda
narrower: Barranca del Infiernillo
narrower: Cañon des Gold Creek
narrower: Echo-Schlucht
narrower: Middle oder Yankee Jim Cañon
narrower: Kaaterskill Clove
narrower: Lake Fork Cañon
narrower: Uncompaghre Cañon
narrower: Echo Cañon
narrower: El-Ourit
narrower: Platte Cañon
narrower: Schlucht des Guadalevin
narrower: Tuckerman’s Ravine
narrower: Tamasopo Cañon
narrower: Rocky Cañon
narrower: Sage’s Ravine
narrower: South Cañon

Gôkteik-Schlucht
type: Concept
in scheme: travel!digital Thesaurus
pref label: Gôkteik-Schlucht
related match: Goteik viaduct
related match: Chine
definition: bdk: besondere Attraktion

Gôkteik-Schlucht
type: Label
in scheme: travel!digital Thesaurus

großer Cañon des Yellowstone
type: Concept
pref label: großer Cañon des Yellowstone
in scheme: travel!digital Thesaurus
definition: bdk: besondere Attraktion

großer Cañon des Yellowstone
type: Label
in scheme: travel!digital Thesaurus

erster Cañon des Yellowstone
type: Concept
related match: Yellowstone National Park
pref label: erster Cañon des Yellowstone
in scheme: travel!digital Thesaurus
definition: bdk: besondere Attraktion

erster Cañon des Yellowstone
type: Label
in scheme: travel!digital Thesaurus

Tolteken-Schlucht
type: Concept
related match: Los Pinos River
related match: Cumbres and Toltec Scenic Railroad
pref label: Tolteken-Schlucht
in scheme: travel!digital Thesaurus
definition: bdk: besondere Attraktion

Tolteken-Schlucht
type: Label
in scheme: travel!digital Thesaurus

Animas Cañon
type: Concept
pref label: Animas Cañon
in scheme: travel!digital Thesaurus
definition: bdk: besondere Attraktion

Animas Cañon
type: Label
in scheme: travel!digital Thesaurus

Tilatouschlucht
type: Concept
related match: Tilatou
pref label: Tilatouschlucht
in scheme: travel!digital Thesaurus
related match: Chine
definition: bdk: besondere Attraktion

Tilatouschlucht
type: Label
in scheme: travel!digital Thesaurus

Plattekill Clove
type: Concept
in scheme: travel!digital Thesaurus
pref label: Plattekill Clove
definition: bdk: besondere Attraktion

Plattekill Clove
type: Label
in scheme: travel!digital Thesaurus

Seldjaschlucht
type: Concept
in scheme: travel!digital Thesaurus
pref label: Seldjaschlucht
related match: Chine
definition: bdk: besondere Attraktion

Seldjaschlucht
type: Label
in scheme: travel!digital Thesaurus

Gibbon Cañon
type: Concept
pref label: Gibbon Cañon
in scheme: travel!digital Thesaurus
definition: bdk: besondere Attraktion

Gibbon Cañon
type: Label
in scheme: travel!digital Thesaurus

Castle oder Price River Cañon
type: Concept
pref label: Castle oder Price River Cañon
in scheme: travel!digital Thesaurus
definition: bdk: besondere Attraktion

Castle oder Price River Cañon
type: Label
in scheme: travel!digital Thesaurus

Boulder Cañon
type: Concept
pref label: Boulder Cañon
in scheme: travel!digital Thesaurus
definition: bdk: besondere Attraktion

Boulder Cañon
type: Label
in scheme: travel!digital Thesaurus

Bear River Cañon
type: Concept
related match: Wasatch Range
pref label: Bear River Cañon
in scheme: travel!digital Thesaurus
definition: bdk: besondere Attraktion

Bear River Cañon
type: Label
in scheme: travel!digital Thesaurus

Schlucht
type: Label
in scheme: travel!digital Thesaurus

großer Cañon des Colorado
type: Concept
pref label: großer Cañon des Colorado
in scheme: travel!digital Thesaurus
definition: bdk: besondere Attraktion

großer Cañon des Colorado
type: Label
in scheme: travel!digital Thesaurus

Cheyenne Cañons
type: Concept
pref label: Cheyenne Cañons
in scheme: travel!digital Thesaurus
definition: bdk: besondere Attraktion

Cheyenne Cañons
type: Label
in scheme: travel!digital Thesaurus

Barranco del Infierno
type: Concept
pref label: Barranco del Infierno
in scheme: travel!digital Thesaurus
definition: bdk: besondere Attraktion

Barranco del Infierno
type: Label
in scheme: travel!digital Thesaurus

Metlac-Schlucht
type: Concept
pref label: Metlac-Schlucht
in scheme: travel!digital Thesaurus
definition: bdk: besondere Attraktion
related match: Córdoba, Veracruz

Metlac-Schlucht
type: Label
in scheme: travel!digital Thesaurus

Yakima Cañon
type: Concept
pref label: Yakima Cañon
in scheme: travel!digital Thesaurus
definition: bdk: besondere Attraktion

Yakima Cañon
type: Label
in scheme: travel!digital Thesaurus

Hopper
type: Concept
in scheme: travel!digital Thesaurus
pref label: Hopper
definition: bdk: besondere Attraktion
related match: Mount Greylock

Hopper
type: Label
in scheme: travel!digital Thesaurus

Comanche Cañon
type: Concept
related match: Embudo, New Mexico
pref label: Comanche Cañon
in scheme: travel!digital Thesaurus
definition: bdk: besondere Attraktion

Comanche Cañon
type: Label
in scheme: travel!digital Thesaurus

Cañon des Grand River
type: Concept
related match: Colorado River
related match: Grand Junction, Colorado
pref label: Cañon des Grand River
in scheme: travel!digital Thesaurus
definition: bdk: besondere Attraktion

Cañon des Grand River
type: Label
in scheme: travel!digital Thesaurus

Cañon des Tuólumne
type: Concept
pref label: Cañon des Tuólumne
in scheme: travel!digital Thesaurus
definition: bdk: besondere Attraktion

Cañon des Tuólumne
type: Label
in scheme: travel!digital Thesaurus

Granite oder Eleven Mile Cañon
type: Concept
pref label: Granite oder Eleven Mile Cañon
in scheme: travel!digital Thesaurus
definition: bdk: besondere Attraktion

Granite oder Eleven Mile Cañon
type: Label
in scheme: travel!digital Thesaurus

Rhumelschlucht
type: Concept
in scheme: travel!digital Thesaurus
pref label: Rhumelschlucht
related match: Constantine Province
related match: Chine
definition: bdk: besondere Attraktion

Rhumelschlucht
type: Label
in scheme: travel!digital Thesaurus

Stony Clove
type: Concept
in scheme: travel!digital Thesaurus
pref label: Stony Clove
definition: bdk: besondere Attraktion

Stony Clove
type: Label
in scheme: travel!digital Thesaurus

Ogden River Cañon
type: Concept
pref label: Ogden River Cañon
in scheme: travel!digital Thesaurus
definition: bdk: besondere Attraktion

Ogden River Cañon
type: Label
in scheme: travel!digital Thesaurus

Black Cañon oder die Große Schlucht des Gunnison
type: Concept
pref label: Black Cañon oder die Große Schlucht des Gunnison
in scheme: travel!digital Thesaurus
definition: bdk: besondere Attraktion

Black Cañon oder die Große Schlucht des Gunnison
type: Label
in scheme: travel!digital Thesaurus

großer Cañon des Arkansas
type: Concept
related match: Arkansas River
related match: Royal Gorge
pref label: großer Cañon des Arkansas
in scheme: travel!digital Thesaurus
definition: bdk: besondere Attraktion

großer Cañon des Arkansas
type: Label
in scheme: travel!digital Thesaurus

Schlucht des Brandywine
type: Concept
pref label: Schlucht des Brandywine
in scheme: travel!digital Thesaurus
definition: bdk: besondere Attraktion

Schlucht des Brandywine
type: Label
in scheme: travel!digital Thesaurus

Weber Cañon
type: Concept
pref label: Weber Cañon
in scheme: travel!digital Thesaurus
definition: bdk: besondere Attraktion

Weber Cañon
type: Label
in scheme: travel!digital Thesaurus

Clear Creek Cañon
type: Concept
pref label: Clear Creek Cañon
in scheme: travel!digital Thesaurus
definition: bdk: besondere Attraktion

Clear Creek Cañon
type: Label
in scheme: travel!digital Thesaurus

Barranco de Tejeda
type: Concept
pref label: Barranco de Tejeda
in scheme: travel!digital Thesaurus
related match: Tejeda
definition: bdk: besondere Attraktion

Barranco de Tejeda
type: Label
in scheme: travel!digital Thesaurus

Barranca del Infiernillo
type: Concept
pref label: Barranca del Infiernillo
in scheme: travel!digital Thesaurus
definition: bdk: besondere Attraktion
related match: Orizaba

Barranca del Infiernillo
type: Label
in scheme: travel!digital Thesaurus

Cañon des Gold Creek
type: Concept
pref label: Cañon des Gold Creek
in scheme: travel!digital Thesaurus
definition: bdk: besondere Attraktion

Cañon des Gold Creek
type: Label
in scheme: travel!digital Thesaurus

Echo-Schlucht
type: Concept
in scheme: travel!digital Thesaurus
pref label: Echo-Schlucht
definition: bdk: besondere Attraktion
related match: Bar Harbor, Maine

Echo-Schlucht
type: Label
in scheme: travel!digital Thesaurus

Middle oder Yankee Jim Cañon
type: Concept
related match: Yellowstone National Park
pref label: Middle oder Yankee Jim Cañon
in scheme: travel!digital Thesaurus
definition: bdk: besondere Attraktion

Middle oder Yankee Jim Cañon
type: Label
in scheme: travel!digital Thesaurus

Kaaterskill Clove
type: Concept
in scheme: travel!digital Thesaurus
pref label: Kaaterskill Clove
definition: bdk: besondere Attraktion

Kaaterskill Clove
type: Label
in scheme: travel!digital Thesaurus

Lake Fork Cañon
type: Concept
pref label: Lake Fork Cañon
in scheme: travel!digital Thesaurus
definition: bdk: besondere Attraktion

Lake Fork Cañon
type: Label
in scheme: travel!digital Thesaurus

Uncompaghre Cañon
type: Concept
pref label: Uncompaghre Cañon
in scheme: travel!digital Thesaurus
definition: bdk: besondere Attraktion

Uncompaghre Cañon
type: Label
in scheme: travel!digital Thesaurus

Echo Cañon
type: Concept
related match: Wasatch Range
pref label: Echo Cañon
in scheme: travel!digital Thesaurus
definition: bdk: besondere Attraktion

Echo Cañon
type: Label
in scheme: travel!digital Thesaurus

El-Ourit
type: Concept
pref label: El-Ourit
in scheme: travel!digital Thesaurus
definition: bdk: besondere Attraktion

El-Ourit
type: Label
in scheme: travel!digital Thesaurus

Platte Cañon
type: Concept
pref label: Platte Cañon
in scheme: travel!digital Thesaurus
definition: bdk: besondere Attraktion

Platte Cañon
type: Label
in scheme: travel!digital Thesaurus

Schlucht des Guadalevin
type: Concept
related match: Ronda
related match: Guadalevín
in scheme: travel!digital Thesaurus
pref label: Schlucht des Guadalevin
related match: Chine
definition: bdk: besondere Attraktion

Schlucht des Guadalevin
type: Label
in scheme: travel!digital Thesaurus

Tuckerman’s Ravine
type: Concept
pref label: Tuckerman’s Ravine
in scheme: travel!digital Thesaurus
definition: bdk: besondere Attraktion

Tuckerman’s Ravine
type: Label
in scheme: travel!digital Thesaurus

Tamasopo Cañon
type: Concept
pref label: Tamasopo Cañon
in scheme: travel!digital Thesaurus
definition: bdk: besondere Attraktion
related match: Tamasopo

Tamasopo Cañon
type: Label
in scheme: travel!digital Thesaurus

Rocky Cañon
type: Concept
related match: Gallatin River
pref label: Rocky Cañon
in scheme: travel!digital Thesaurus
definition: bdk: besondere Attraktion

Rocky Cañon
type: Label
in scheme: travel!digital Thesaurus

Sage’s Ravine
type: Concept
in scheme: travel!digital Thesaurus
pref label: Sage’s Ravine
definition: bdk: besondere Attraktion
related match: Mount Washington, Massachusetts

Sage’s Ravine
type: Label
in scheme: travel!digital Thesaurus

South Cañon
type: Concept
pref label: South Cañon
in scheme: travel!digital Thesaurus
definition: bdk: besondere Attraktion

South Cañon
type: Label
in scheme: travel!digital Thesaurus

Bambusallee
type: Concept
pref label: Bambusallee
in scheme: travel!digital Thesaurus
related match: Algiers
definition: bdk: besondere Attraktion

Bambusallee
type: Label
in scheme: travel!digital Thesaurus

Lake Minnetonka
type: Concept
pref label: Lake Minnetonka
in scheme: travel!digital Thesaurus
definition: bdk: besondere Attraktion

Lake Minnetonka
type: Label
in scheme: travel!digital Thesaurus

Hetch Hetchy
type: Concept
pref label: Hetch Hetchy
in scheme: travel!digital Thesaurus
definition: bdk: besondere Attraktion

Hetch Hetchy
type: Label
in scheme: travel!digital Thesaurus

Somes Sound
type: Concept
in scheme: travel!digital Thesaurus
pref label: Somes Sound
definition: bdk: besondere Attraktion

Somes Sound
type: Label
in scheme: travel!digital Thesaurus

Mount Abu
type: Concept
in scheme: travel!digital Thesaurus
pref label: Mount Abu
definition: bdk: besondere Attraktion

Mount Abu
type: Label
in scheme: travel!digital Thesaurus

Petrified Forest
type: Concept
pref label: Petrified Forest
in scheme: travel!digital Thesaurus
definition: bdk: besondere Attraktion

Petrified Forest
type: Label
in scheme: travel!digital Thesaurus

Tuscarora Gap
type: Concept
pref label: Tuscarora Gap
in scheme: travel!digital Thesaurus
definition: bdk: besondere Attraktion
related match: Tuscarora Mountain

Tuscarora Gap
type: Label
in scheme: travel!digital Thesaurus

Prospect Point
type: Concept
pref label: Prospect Point
in scheme: travel!digital Thesaurus
definition: bdk: besondere Attraktion
related match: Delaware Water Gap National Recreation Area

Prospect Point
type: Label
in scheme: travel!digital Thesaurus

Ute Pass
type: Concept
pref label: Ute Pass
in scheme: travel!digital Thesaurus
definition: bdk: besondere Attraktion

Ute Pass
type: Label
in scheme: travel!digital Thesaurus

Otsego Lake
type: Concept
in scheme: travel!digital Thesaurus
pref label: Otsego Lake
definition: bdk: besondere Attraktion

Otsego Lake
type: Label
in scheme: travel!digital Thesaurus

Arch Rock
type: Concept
pref label: Arch Rock
in scheme: travel!digital Thesaurus
definition: bdk: besondere Attraktion
related match: Mackinac Island

Arch Rock
type: Label
in scheme: travel!digital Thesaurus

Lehigh Valley
type: Concept
pref label: Lehigh Valley
in scheme: travel!digital Thesaurus
definition: bdk: besondere Attraktion

Lehigh Valley
type: Label
in scheme: travel!digital Thesaurus

Obsidianfelsen
type: Concept
related match: Obsidian
definition: bdk: besondere Attraktion | Duden: Obsidian: dunkles, viel Kieselsäure enthaltendes, glasiges Gestein
pref label: Obsidianfelsen
in scheme: travel!digital Thesaurus

Obsidianfelsen
type: Label
in scheme: travel!digital Thesaurus

Höhlen
type: Concept
narrower: Howe’s Cave
in scheme: travel!digital Thesaurus
narrower: Cave of the Winds
narrower: Wyandotte-Höhle
related match: Constantine Province
narrower: Mammuth-Höhle von Kentucky
narrower: Luray-Höhle
definition: bdk: besondere Attraktion | Duden: größerer hohler Raum, Hohlraum besonders im Gestein oder in der Erde
pref label: Höhlen
narrower: Weyer Cave

Howe’s Cave
type: Concept
in scheme: travel!digital Thesaurus
pref label: Howe’s Cave
definition: bdk: besondere Attraktion

Howe’s Cave
type: Label
in scheme: travel!digital Thesaurus

Cave of the Winds
type: Concept
pref label: Cave of the Winds
in scheme: travel!digital Thesaurus
definition: bdk: besondere Attraktion

Cave of the Winds
type: Label
in scheme: travel!digital Thesaurus

Wyandotte-Höhle
type: Concept
pref label: Wyandotte-Höhle
in scheme: travel!digital Thesaurus
definition: bdk: besondere Attraktion

Wyandotte-Höhle
type: Label
in scheme: travel!digital Thesaurus

Mammuth-Höhle von Kentucky
type: Concept
pref label: Mammuth-Höhle von Kentucky
in scheme: travel!digital Thesaurus
definition: bdk: besondere Attraktion

Mammuth-Höhle von Kentucky
type: Label
in scheme: travel!digital Thesaurus

Luray-Höhle
type: Concept
pref label: Luray-Höhle
in scheme: travel!digital Thesaurus
definition: bdk: besondere Attraktion

Luray-Höhle
type: Label
in scheme: travel!digital Thesaurus

Höhlen
type: Label
in scheme: travel!digital Thesaurus

Weyer Cave
type: Concept
pref label: Weyer Cave
in scheme: travel!digital Thesaurus
definition: bdk: besondere Attraktion

Weyer Cave
type: Label
in scheme: travel!digital Thesaurus

Big Trees of Santa Cruz
type: Concept
pref label: Big Trees of Santa Cruz
in scheme: travel!digital Thesaurus
definition: bdk: besondere Attraktion
related match: Santa Cruz, California
related match: Santa Cruz, Big Trees and Pacific Railway

Big Trees of Santa Cruz
type: Label
in scheme: travel!digital Thesaurus

Sabbath Bay Point
type: Concept
pref label: Sabbath Bay Point
in scheme: travel!digital Thesaurus
definition: bdk: besondere Attraktion
related match: Lake George (New York)

Sabbath Bay Point
type: Label
in scheme: travel!digital Thesaurus

Calaveras Grove
type: Concept
pref label: Calaveras Grove
in scheme: travel!digital Thesaurus
definition: bdk: besondere Attraktion

Calaveras Grove
type: Label
in scheme: travel!digital Thesaurus

Dünenkette
type: Concept
pref label: Dünenkette
in scheme: travel!digital Thesaurus
related match: Sétif Province
definition: bdk: besondere Attraktion | Duden: Düne: durch den Wind aufgeschütteter Sandhügel oder -wall | Meyers Großes Konversations-Lexikon 1906: Dünen sind durch den Wind aufgehäufte wallartige Hügel von Flugsand im Binnenland (Sahara, Ägyptische Wüste, Banat, in kleinem Maßstab auch die Norddeutsche Tiefebene), besonders aber (Seestrandsdünen) an flachen, sandigen Küsten der Meere. Diese finden sich an der preußischen und russischen Ostseeküste, auf den Inseln Ösel und Dagö; an der Nordsee im W. von Holstein, Schleswig und Jütland, auf Sylt, Föhr, Helgoland, Norderney, Borkum; an der Westküste von Frankreich, in Ägypten, an der Südküste Australiens, in Florida etc. Nach v. Tillo nehmen die Dünenlandschaften 7 Proz. der gesamten Landoberfläche ein. Die D. sind oft sehr ausgedehnt; an der Ostsee gibt es D. von mehr als 45 km Länge, im südlichen Frankreich zwischen den Mündungen des Adour und der Gironde sogar solche von mehr als 230 km Länge und 5 km Breite. Die D. sind meist 10–15 m, in vielen Fällen 30–40, in einzelnen (Sahara) 100, ja 180 m hoch. Die dem Wind oder dem Meer zugekehrte Seite der D. ist konvex und ziemlich flach geböscht (5–15° geneigt), während an der gegenüberliegenden, im Windschatten gelegenen Seite sich ein steiler Absturz (unter etwa 30°) befindet, an den sich weiter nach unten ein schwächer geneigter, meist konkaver Abfall anschließt. Der Seewind treibt den bei Ebbe trocken gelegten Sand vor sich her und hebt ihn in die Höhe, bis bei schwächer werdendem Sturm die Sandkörner durch ihr eignes Gewicht sinken und sich im natürlichen Böschungswinkel absetzen, ein Prozeß, den Fig. 1 erläutern soll. Bei recht typischer Entwickelung kann man drei Dünenreihen unterscheiden: die Vordüne, die das vom Meere geförderte Material zunächst empfängt; die hinter dieser liegende hohe Düne, die den Flugsand später aufnimmt und sich infolgedessen allmählich erhöht; endlich die Innendüne, niedrigeres, hinter der hohen Düne liegendes Gehügel, das sich aus jenen Sandmassen b…

Dünenkette
type: Label
in scheme: travel!digital Thesaurus

Montañas de las Cañadas
type: Concept
pref label: Montañas de las Cañadas
in scheme: travel!digital Thesaurus
related match: Teide
related match: Teide National Park
definition: bdk: besondere Attraktion

Montañas de las Cañadas
type: Label
in scheme: travel!digital Thesaurus

Strelitziengruppe
type: Concept
related match: Botanical Garden Hamma
pref label: Strelitziengruppe
in scheme: travel!digital Thesaurus
definition: bdk: besondere Attraktion

Strelitziengruppe
type: Label
in scheme: travel!digital Thesaurus

Bucht von Palermo
type: Concept
pref label: Bucht von Palermo
in scheme: travel!digital Thesaurus
related match: Palermo
definition: bdk: besondere Attraktion

Bucht von Palermo
type: Label
in scheme: travel!digital Thesaurus

Djebel Chenoua
type: Concept
pref label: Djebel Chenoua
in scheme: travel!digital Thesaurus
definition: bdk: besondere Attraktion

Djebel Chenoua
type: Label
in scheme: travel!digital Thesaurus

Devil’s Slide
type: Concept
pref label: Devil’s Slide
in scheme: travel!digital Thesaurus
definition: bdk: besondere Attraktion

Devil’s Slide
type: Label
in scheme: travel!digital Thesaurus

Keene Valley
type: Concept
in scheme: travel!digital Thesaurus
pref label: Keene Valley
definition: bdk: besondere Attraktion
related match: Keene, New York

Keene Valley
type: Label
in scheme: travel!digital Thesaurus

Caesar’s Head
type: Concept
related match: Caesars Head State Park
pref label: Caesar’s Head
in scheme: travel!digital Thesaurus
definition: bdk: besondere Attraktion

Caesar’s Head
type: Label
in scheme: travel!digital Thesaurus

Bald Head Cliff
type: Concept
in scheme: travel!digital Thesaurus
pref label: Bald Head Cliff
definition: bdk: besondere Attraktion
related match: Bald Head, Maine

Bald Head Cliff
type: Label
in scheme: travel!digital Thesaurus

Talaga Bodas
type: Concept
in scheme: travel!digital Thesaurus
pref label: Talaga Bodas
definition: bdk: besondere Attraktion

Talaga Bodas
type: Label
in scheme: travel!digital Thesaurus

Wilson Peak
type: Concept
pref label: Wilson Peak
in scheme: travel!digital Thesaurus
definition: bdk: besondere Attraktion

Wilson Peak
type: Label
in scheme: travel!digital Thesaurus

St. Dimitrihügel
type: Concept
related match: Beirut
pref label: St. Dimitrihügel
in scheme: travel!digital Thesaurus
definition: bdk: besondere Attraktion

St. Dimitrihügel
type: Label
in scheme: travel!digital Thesaurus

Mud Cauldron oder Schlammgeiser
type: Concept
related match: Geothermal areas of Yellowstone
pref label: Mud Cauldron oder Schlammgeiser
in scheme: travel!digital Thesaurus
definition: bdk: besondere Attraktion

Mud Cauldron oder Schlammgeiser
type: Label
in scheme: travel!digital Thesaurus

Havana Glen
type: Concept
pref label: Havana Glen
in scheme: travel!digital Thesaurus
definition: bdk: besondere Attraktion
related match: Watkins Glen, New York

Havana Glen
type: Label
in scheme: travel!digital Thesaurus

Innenbucht von Tunis
type: Concept
in scheme: travel!digital Thesaurus
pref label: Innenbucht von Tunis
related match: Tunis
definition: bdk: besondere Attraktion

Innenbucht von Tunis
type: Label
in scheme: travel!digital Thesaurus

Great Bend
type: Concept
pref label: Great Bend
in scheme: travel!digital Thesaurus
definition: bdk: besondere Attraktion
related match: Sacramento River

Great Bend
type: Label
in scheme: travel!digital Thesaurus

Cypress Point
type: Concept
pref label: Cypress Point
in scheme: travel!digital Thesaurus
definition: bdk: besondere Attraktion
related match: Monterey, California

Cypress Point
type: Label
in scheme: travel!digital Thesaurus

Prismatic Lake
type: Concept
pref label: Prismatic Lake
in scheme: travel!digital Thesaurus
definition: bdk: besondere Attraktion

Prismatic Lake
type: Label
in scheme: travel!digital Thesaurus

South oder Half Dome
type: Concept
pref label: South oder Half Dome
in scheme: travel!digital Thesaurus
definition: bdk: besondere Attraktion

South oder Half Dome
type: Label
in scheme: travel!digital Thesaurus

Overlook
type: Concept
in scheme: travel!digital Thesaurus
pref label: Overlook
definition: bdk: besondere Attraktion

Overlook
type: Label
in scheme: travel!digital Thesaurus

Fels von Trichinopoly
type: Concept
in scheme: travel!digital Thesaurus
pref label: Fels von Trichinopoly
related match: Tiruchirappalli
definition: bdk: besondere Attraktion

Fels von Trichinopoly
type: Label
in scheme: travel!digital Thesaurus

Emerald Pool
type: Concept
related match: Yosemite National Park
related match: Emerald Spring
pref label: Emerald Pool
in scheme: travel!digital Thesaurus
definition: bdk: besondere Attraktion

Emerald Pool
type: Label
in scheme: travel!digital Thesaurus

Mokattamgebirge
type: Concept
pref label: Mokattamgebirge
in scheme: travel!digital Thesaurus
definition: bdk: besondere Attraktion

Mokattamgebirge
type: Label
in scheme: travel!digital Thesaurus

Lake Skaneateles
type: Concept
pref label: Lake Skaneateles
in scheme: travel!digital Thesaurus
definition: bdk: besondere Attraktion

Lake Skaneateles
type: Label
in scheme: travel!digital Thesaurus

South Park
type: Concept
pref label: South Park
in scheme: travel!digital Thesaurus
definition: bdk: besondere Attraktion

South Park
type: Label
in scheme: travel!digital Thesaurus

Rock Pond
type: Concept
pref label: Rock Pond
in scheme: travel!digital Thesaurus
definition: bdk: besondere Attraktion
related match: Adirondack Mountains

Rock Pond
type: Label
in scheme: travel!digital Thesaurus

Monument Mountain
type: Concept
in scheme: travel!digital Thesaurus
pref label: Monument Mountain
definition: bdk: besondere Attraktion

Monument Mountain
type: Label
in scheme: travel!digital Thesaurus

Pico Serrado
type: Concept
related match: Madeira
pref label: Pico Serrado
in scheme: travel!digital Thesaurus
definition: bdk: besondere Attraktion

Pico Serrado
type: Label
in scheme: travel!digital Thesaurus

Highlands
type: Concept
in scheme: travel!digital Thesaurus
pref label: Highlands
definition: bdk: besondere Attraktion

Highlands
type: Label
in scheme: travel!digital Thesaurus

Garganta de Güimar
type: Concept
pref label: Garganta de Güimar
in scheme: travel!digital Thesaurus
related match: Gran Canaria
definition: bdk: besondere Attraktion

Garganta de Güimar
type: Label
in scheme: travel!digital Thesaurus

Wyoming-Thal
type: Concept
pref label: Wyoming-Thal
in scheme: travel!digital Thesaurus
definition: bdk: besondere Attraktion

Wyoming-Thal
type: Label
in scheme: travel!digital Thesaurus

Glacier Bay
type: Concept
pref label: Glacier Bay
in scheme: travel!digital Thesaurus
definition: bdk: besondere Attraktion

Glacier Bay
type: Label
in scheme: travel!digital Thesaurus

Pico de Vandama
type: Concept
pref label: Pico de Vandama
in scheme: travel!digital Thesaurus
definition: bdk: besondere Attraktion

Pico de Vandama
type: Label
in scheme: travel!digital Thesaurus

Gate of the Rocky Mountains
type: Concept
pref label: Gate of the Rocky Mountains
in scheme: travel!digital Thesaurus
definition: bdk: besondere Attraktion

Gate of the Rocky Mountains
type: Label
in scheme: travel!digital Thesaurus

Chicago Lakes
type: Concept
pref label: Chicago Lakes
in scheme: travel!digital Thesaurus
definition: bdk: besondere Attraktion

Chicago Lakes
type: Label
in scheme: travel!digital Thesaurus

Bett Mahinda's
type: Concept
in scheme: travel!digital Thesaurus
pref label: Bett Mahinda's
related match: Mihintale
related match: Mahinda (Buddhist monk)
definition: bdk: besondere Attraktion

Bett Mahinda's
type: Label
in scheme: travel!digital Thesaurus

Cathedral Rocks
type: Concept
pref label: Cathedral Rocks
in scheme: travel!digital Thesaurus
definition: bdk: besondere Attraktion
related match: Ausable Chasm (New York)

Cathedral Rocks
type: Label
in scheme: travel!digital Thesaurus

Monts des Ksour
type: Concept
pref label: Monts des Ksour
in scheme: travel!digital Thesaurus
definition: bdk: besondere Attraktion

Monts des Ksour
type: Label
in scheme: travel!digital Thesaurus

Uferwege
type: Concept
related match: Béjaïa Province
pref label: Uferwege
in scheme: travel!digital Thesaurus
definition: bdk: besondere Attraktion

Uferwege
type: Label
in scheme: travel!digital Thesaurus

Noon Mark
type: Concept
pref label: Noon Mark
in scheme: travel!digital Thesaurus
definition: bdk: besondere Attraktion
related match: Keene, New York
related match: Adirondack Mountains

Noon Mark
type: Label
in scheme: travel!digital Thesaurus

Gate of the Mountains
type: Concept
pref label: Gate of the Mountains
in scheme: travel!digital Thesaurus
definition: bdk: besondere Attraktion

Gate of the Mountains
type: Label
in scheme: travel!digital Thesaurus

Naturbrücke von Virginien
type: Concept
pref label: Naturbrücke von Virginien
in scheme: travel!digital Thesaurus
definition: bdk: besondere Attraktion

Naturbrücke von Virginien
type: Label
in scheme: travel!digital Thesaurus

Johnstone Strait
type: Concept
pref label: Johnstone Strait
in scheme: travel!digital Thesaurus
definition: bdk: besondere Attraktion

Johnstone Strait
type: Label
in scheme: travel!digital Thesaurus

Riverside Geyser
type: Concept
pref label: Riverside Geyser
in scheme: travel!digital Thesaurus
definition: bdk: besondere Attraktion

Riverside Geyser
type: Label
in scheme: travel!digital Thesaurus

World's End
type: Concept
related match: Horton Plains National Park
in scheme: travel!digital Thesaurus
pref label: World's End
definition: bdk: besondere Attraktion

World's End
type: Label
in scheme: travel!digital Thesaurus

San Luis Valley
type: Concept
pref label: San Luis Valley
in scheme: travel!digital Thesaurus
definition: bdk: besondere Attraktion

San Luis Valley
type: Label
in scheme: travel!digital Thesaurus

Eagle Lake
type: Concept
in scheme: travel!digital Thesaurus
pref label: Eagle Lake
definition: bdk: besondere Attraktion

Eagle Lake
type: Label
in scheme: travel!digital Thesaurus

Lake Chautauqua
type: Concept
pref label: Lake Chautauqua
in scheme: travel!digital Thesaurus
definition: bdk: besondere Attraktion

Lake Chautauqua
type: Label
in scheme: travel!digital Thesaurus

Bosporus
type: Concept
pref label: Bosporus
in scheme: travel!digital Thesaurus
definition: bdk: besondere Attraktion

Bosporus
type: Label
in scheme: travel!digital Thesaurus

Upper Saranac Lake
type: Concept
pref label: Upper Saranac Lake
in scheme: travel!digital Thesaurus
definition: bdk: besondere Attraktion

Upper Saranac Lake
type: Label
in scheme: travel!digital Thesaurus

Malabar Hill
type: Concept
in scheme: travel!digital Thesaurus
pref label: Malabar Hill
definition: bdk: besondere Attraktion

Malabar Hill
type: Label
in scheme: travel!digital Thesaurus

Lone Mountain
type: Concept
pref label: Lone Mountain
in scheme: travel!digital Thesaurus
definition: bdk: besondere Attraktion

Lone Mountain
type: Label
in scheme: travel!digital Thesaurus

Scenerie
type: Concept
pref label: Scenerie
in scheme: travel!digital Thesaurus
definition: bdk: besondere Attraktion
related match: Puget Sound
related match: List of Puget Sound steamboats

Scenerie
type: Label
in scheme: travel!digital Thesaurus

Mount Quirauk
type: Concept
pref label: Mount Quirauk
in scheme: travel!digital Thesaurus
definition: bdk: besondere Attraktion

Mount Quirauk
type: Label
in scheme: travel!digital Thesaurus

Old Faithful
type: Concept
pref label: Old Faithful
in scheme: travel!digital Thesaurus
definition: bdk: besondere Attraktion

Old Faithful
type: Label
in scheme: travel!digital Thesaurus

Rambodda-Paß
type: Concept
in scheme: travel!digital Thesaurus
pref label: Rambodda-Paß
related match: Ramboda Falls
definition: bdk: besondere Attraktion

Rambodda-Paß
type: Label
in scheme: travel!digital Thesaurus

Purgatory
type: Concept
in scheme: travel!digital Thesaurus
pref label: Purgatory
definition: bdk: besondere Attraktion
related match: Newport, Rhode Island

Purgatory
type: Label
in scheme: travel!digital Thesaurus

Splendid Geyser
type: Concept
pref label: Splendid Geyser
in scheme: travel!digital Thesaurus
definition: bdk: besondere Attraktion

Splendid Geyser
type: Label
in scheme: travel!digital Thesaurus

Gedeh
type: Concept
in scheme: travel!digital Thesaurus
pref label: Gedeh
related match: Grand Gedeh County
definition: bdk: besondere Attraktion

Gedeh
type: Label
in scheme: travel!digital Thesaurus

Cimarron
type: Concept
pref label: Cimarron
in scheme: travel!digital Thesaurus
definition: bdk: besondere Attraktion

Cimarron
type: Label
in scheme: travel!digital Thesaurus

Flume
type: Concept
pref label: Flume
in scheme: travel!digital Thesaurus
definition: bdk: besondere Attraktion
related match: Franconia Notch State Park

Flume
type: Label
in scheme: travel!digital Thesaurus

Gran Curral
type: Concept
alternative label: Curral das Freiras
pref label: Gran Curral
in scheme: travel!digital Thesaurus
alt label: Curral das Freiras
definition: bdk: besondere Attraktion

Gran Curral
type: Label
in scheme: travel!digital Thesaurus

Curral das Freiras
type: Label
in scheme: travel!digital Thesaurus

White Spot
type: Concept
pref label: White Spot
in scheme: travel!digital Thesaurus
definition: bdk: besondere Attraktion
related match: Reading, Pennsylvania

White Spot
type: Label
in scheme: travel!digital Thesaurus

Champion Spouting Spring
type: Concept
pref label: Champion Spouting Spring
in scheme: travel!digital Thesaurus
definition: bdk: besondere Attraktion
related match: Saratoga Springs, New York

Champion Spouting Spring
type: Label
in scheme: travel!digital Thesaurus

Strandweg
type: Concept
related match: Opatija
pref label: Strandweg
in scheme: travel!digital Thesaurus
definition: bdk: besondere Attraktion

Strandweg
type: Label
in scheme: travel!digital Thesaurus

Djebel Zaccar Gharbi
type: Concept
pref label: Djebel Zaccar Gharbi
in scheme: travel!digital Thesaurus
related match: Zuccabar
related match: Miliana
definition: bdk: besondere Attraktion

Djebel Zaccar Gharbi
type: Label
in scheme: travel!digital Thesaurus

Golf von Bougie
type: Concept
pref label: Golf von Bougie
in scheme: travel!digital Thesaurus
related match: Béjaïa
definition: bdk: besondere Attraktion

Golf von Bougie
type: Label
in scheme: travel!digital Thesaurus

Bromo
type: Concept
in scheme: travel!digital Thesaurus
pref label: Bromo
definition: bdk: besondere Attraktion

Bromo
type: Label
in scheme: travel!digital Thesaurus

Stromschnellen
type: Concept
in scheme: travel!digital Thesaurus
narrower: Lachine Rapids
pref label: rapids
narrower: Cascades
preferred label: rapids @en
narrower: Canadische Stromschnellen
definition: bdk: besondere Attraktion
comment: Nordamerika 1893: nur englisch
related match: Ausable Chasm (New York)
narrower: Long Sault Rapids
narrower: Whirlpool Rapids
pref label: Stromschnellen

Lachine Rapids
type: Concept
pref label: Lachine Rapids
in scheme: travel!digital Thesaurus
definition: bdk: besondere Attraktion

Lachine Rapids
type: Label
in scheme: travel!digital Thesaurus

rapids
type: Label
isTranslationOf: Stromschnellen
in scheme: travel!digital Thesaurus

Stromschnellen
type: Label
hasTranslation: rapids
in scheme: travel!digital Thesaurus

Cascades
type: Concept
pref label: Cascades
in scheme: travel!digital Thesaurus
definition: bdk: besondere Attraktion
related match: Les Coteaux, Quebec
related match: Saint Lawrence River

Cascades
type: Label
in scheme: travel!digital Thesaurus

Canadische Stromschnellen
type: Concept
pref label: Canadische Stromschnellen
in scheme: travel!digital Thesaurus
definition: bdk: besondere Attraktion
related match: Three Sisters Islands (New York)

Canadische Stromschnellen
type: Label
in scheme: travel!digital Thesaurus

Long Sault Rapids
type: Concept
in scheme: travel!digital Thesaurus
pref label: Long Sault Rapids
definition: bdk: besondere Attraktion

Long Sault Rapids
type: Label
in scheme: travel!digital Thesaurus

Whirlpool Rapids
type: Concept
alternative label: Whirlpool
alt label: Whirlpool
pref label: Whirlpool Rapids
in scheme: travel!digital Thesaurus
definition: bdk: besondere Attraktion

Whirlpool
type: Label
in scheme: travel!digital Thesaurus

Whirlpool Rapids
type: Label
in scheme: travel!digital Thesaurus

Kalksinter-Terrasse
type: Concept
pref label: Kalksinter-Terrasse
in scheme: travel!digital Thesaurus
definition: bdk: besondere Attraktion

Kalksinter-Terrasse
type: Label
in scheme: travel!digital Thesaurus

Lake Winnepesaukee oder Winnipiseogee
type: Concept
in scheme: travel!digital Thesaurus
pref label: Lake Winnepesaukee oder Winnipiseogee
definition: bdk: besondere Attraktion

Lake Winnepesaukee oder Winnipiseogee
type: Label
in scheme: travel!digital Thesaurus

Vinte e Cinco Fontes
type: Concept
pref label: Vinte e Cinco Fontes
in scheme: travel!digital Thesaurus
definition: bdk: besondere Attraktion

Vinte e Cinco Fontes
type: Label
in scheme: travel!digital Thesaurus

Mount McIntyre
type: Concept
pref label: Mount McIntyre
in scheme: travel!digital Thesaurus
definition: bdk: besondere Attraktion

Mount McIntyre
type: Label
in scheme: travel!digital Thesaurus

Grande Ronde Thal
type: Concept
pref label: Grande Ronde Thal
in scheme: travel!digital Thesaurus
definition: bdk: besondere Attraktion

Grande Ronde Thal
type: Label
in scheme: travel!digital Thesaurus

Cruz de Taganana
type: Concept
pref label: Cruz de Taganana
in scheme: travel!digital Thesaurus
related match: Macizo de Anaga
definition: bdk: besondere Attraktion

Cruz de Taganana
type: Label
in scheme: travel!digital Thesaurus

Goat Island
type: Concept
pref label: Goat Island
in scheme: travel!digital Thesaurus
definition: bdk: besondere Attraktion

Goat Island
type: Label
in scheme: travel!digital Thesaurus

Grandes Falaises
type: Concept
pref label: Grandes Falaises
in scheme: travel!digital Thesaurus
related match: Béjaïa
definition: bdk: besondere Attraktion

Grandes Falaises
type: Label
in scheme: travel!digital Thesaurus

Ribeiro da Metade
type: Concept
related match: Madeira
in scheme: travel!digital Thesaurus
pref label: Ribeiro da Metade
definition: bdk: besondere Attraktion

Ribeiro da Metade
type: Label
in scheme: travel!digital Thesaurus

Anse des Aiguades
type: Concept
pref label: Anse des Aiguades
in scheme: travel!digital Thesaurus
related match: Gouraya National Park
related match: Béjaïa Province
definition: bdk: besondere Attraktion

Anse des Aiguades
type: Label
in scheme: travel!digital Thesaurus

Bucht von Algier
type: Concept
pref label: Bucht von Algier
in scheme: travel!digital Thesaurus
related match: Algiers
definition: bdk: besondere Attraktion

Bucht von Algier
type: Label
in scheme: travel!digital Thesaurus

Grenville Channel
type: Concept
pref label: Grenville Channel
in scheme: travel!digital Thesaurus
definition: bdk: besondere Attraktion

Grenville Channel
type: Label
in scheme: travel!digital Thesaurus

Châmundi Hill
type: Concept
related: Hinduismus
in scheme: travel!digital Thesaurus
pref label: Châmundi Hill
definition: bdk: besondere Attraktion

Châmundi Hill
type: Label
in scheme: travel!digital Thesaurus

Dalles of the St. Croix
type: Concept
related match: Interstate Park
pref label: Dalles of the St. Croix
in scheme: travel!digital Thesaurus
definition: bdk: besondere Attraktion

Dalles of the St. Croix
type: Label
in scheme: travel!digital Thesaurus

Cloud’s Rest
type: Concept
pref label: Cloud’s Rest
in scheme: travel!digital Thesaurus
definition: bdk: besondere Attraktion

Cloud’s Rest
type: Label
in scheme: travel!digital Thesaurus

Geyser Springs
type: Concept
pref label: Geyser Springs
in scheme: travel!digital Thesaurus
definition: bdk: besondere Attraktion
related match: Cloverdale, California

Geyser Springs
type: Label
in scheme: travel!digital Thesaurus

Water Gap
type: Concept
pref label: Water Gap
in scheme: travel!digital Thesaurus
definition: bdk: besondere Attraktion

Water Gap
type: Label
in scheme: travel!digital Thesaurus

Grand
type: Concept
pref label: Grand
in scheme: travel!digital Thesaurus
definition: bdk: besondere Attraktion

Grand
type: Label
in scheme: travel!digital Thesaurus

Queen Victoria Niagara Falls Park
type: Concept
in scheme: travel!digital Thesaurus
pref label: Queen Victoria Niagara Falls Park
definition: bdk: besondere Attraktion

Queen Victoria Niagara Falls Park
type: Label
in scheme: travel!digital Thesaurus

Snow Arch
type: Concept
in scheme: travel!digital Thesaurus
pref label: Snow Arch
definition: bdk: besondere Attraktion
related match: Mount Washington (New Hampshire)
related match: Tuckerman Ravine

Snow Arch
type: Label
in scheme: travel!digital Thesaurus

Pain de Sucre
type: Concept
related match: Béjaïa
pref label: Pain de Sucre
in scheme: travel!digital Thesaurus
definition: bdk: besondere Attraktion

Pain de Sucre
type: Label
in scheme: travel!digital Thesaurus

Anâ Sâgar
type: Concept
in scheme: travel!digital Thesaurus
pref label: Anâ Sâgar
definition: bdk: besondere Attraktion

Anâ Sâgar
type: Label
in scheme: travel!digital Thesaurus

Echo Lake
type: Concept
in scheme: travel!digital Thesaurus
pref label: Echo Lake
definition: bdk: besondere Attraktion
related match: Profile House

Echo Lake
type: Label
in scheme: travel!digital Thesaurus

Lake Tahoe
type: Concept
pref label: Lake Tahoe
in scheme: travel!digital Thesaurus
definition: bdk: besondere Attraktion

Lake Tahoe
type: Label
in scheme: travel!digital Thesaurus

Djurdjurakette
type: Concept
pref label: Djurdjurakette
in scheme: travel!digital Thesaurus
definition: bdk: besondere Attraktion

Djurdjurakette
type: Label
in scheme: travel!digital Thesaurus

Lake Placid
type: Concept
pref label: Lake Placid
in scheme: travel!digital Thesaurus
definition: bdk: besondere Attraktion

Lake Placid
type: Label
in scheme: travel!digital Thesaurus

Washington Lake
type: Concept
pref label: Washington Lake
in scheme: travel!digital Thesaurus
definition: bdk: besondere Attraktion

Washington Lake
type: Label
in scheme: travel!digital Thesaurus

Mount Chocorua
type: Concept
in scheme: travel!digital Thesaurus
pref label: Mount Chocorua
definition: bdk: besondere Attraktion

Mount Chocorua
type: Label
in scheme: travel!digital Thesaurus

Lallaa Khedidja
type: Concept
pref label: Lallaa Khedidja
in scheme: travel!digital Thesaurus
definition: bdk: besondere Attraktion

Lallaa Khedidja
type: Label
in scheme: travel!digital Thesaurus

Hickory Gap
type: Concept
related match: Hickory Nut Falls
pref label: Hickory Gap
in scheme: travel!digital Thesaurus
definition: bdk: besondere Attraktion

Hickory Gap
type: Label
in scheme: travel!digital Thesaurus

Pillars of Hercules
type: Concept
related match: Multnomah County, Oregon
pref label: Pillars of Hercules
in scheme: travel!digital Thesaurus
definition: bdk: besondere Attraktion

Pillars of Hercules
type: Label
in scheme: travel!digital Thesaurus

See von Kandy
type: Concept
in scheme: travel!digital Thesaurus
pref label: See von Kandy
definition: bdk: besondere Attraktion

See von Kandy
type: Label
in scheme: travel!digital Thesaurus

Ojai-Thal
type: Concept
pref label: Ojai-Thal
in scheme: travel!digital Thesaurus
definition: bdk: besondere Attraktion
related match: Ojai, California

Ojai-Thal
type: Label
in scheme: travel!digital Thesaurus

Paint Pots
type: Concept
pref label: Paint Pots
in scheme: travel!digital Thesaurus
definition: bdk: besondere Attraktion

Paint Pots
type: Label
in scheme: travel!digital Thesaurus

Barrage de Perrégaux
type: Concept
pref label: Barrage de Perrégaux
in scheme: travel!digital Thesaurus
related match: Mohammadia, Mascara
definition: bdk: besondere Attraktion

Barrage de Perrégaux
type: Label
in scheme: travel!digital Thesaurus

Watkins Glen
type: Concept
pref label: Watkins Glen
in scheme: travel!digital Thesaurus
definition: bdk: besondere Attraktion

Watkins Glen
type: Label
in scheme: travel!digital Thesaurus

Pictured Rocks
type: Concept
pref label: Pictured Rocks
in scheme: travel!digital Thesaurus
definition: bdk: besondere Attraktion

Pictured Rocks
type: Label
in scheme: travel!digital Thesaurus

Tuólumne Meadows
type: Concept
pref label: Tuólumne Meadows
in scheme: travel!digital Thesaurus
definition: bdk: besondere Attraktion

Tuólumne Meadows
type: Label
in scheme: travel!digital Thesaurus

Thunder Cliff
type: Concept
in scheme: travel!digital Thesaurus
pref label: Thunder Cliff
definition: bdk: besondere Attraktion
related match: Somes Sound

Thunder Cliff
type: Label
in scheme: travel!digital Thesaurus

Pangerango
type: Concept
related match: Mount Pangrango
in scheme: travel!digital Thesaurus
pref label: Pangerango
definition: bdk: besondere Attraktion

Pangerango
type: Label
in scheme: travel!digital Thesaurus

Mount Diablo
type: Concept
pref label: Mount Diablo
in scheme: travel!digital Thesaurus
definition: bdk: besondere Attraktion

Mount Diablo
type: Label
in scheme: travel!digital Thesaurus

Greenwood Lake
type: Concept
pref label: Greenwood Lake
in scheme: travel!digital Thesaurus
definition: bdk: besondere Attraktion

Greenwood Lake
type: Label
in scheme: travel!digital Thesaurus

Veta Pass
type: Concept
pref label: Veta Pass
in scheme: travel!digital Thesaurus
definition: bdk: besondere Attraktion

Veta Pass
type: Label
in scheme: travel!digital Thesaurus

Catskills
type: Concept
in scheme: travel!digital Thesaurus
pref label: Catskills
definition: bdk: besondere Attraktion

Catskills
type: Label
in scheme: travel!digital Thesaurus

Put-in-Bay Islands
type: Concept
pref label: Put-in-Bay Islands
in scheme: travel!digital Thesaurus
definition: bdk: besondere Attraktion

Put-in-Bay Islands
type: Label
in scheme: travel!digital Thesaurus

Morning Glory Spring
type: Concept
pref label: Morning Glory Spring
in scheme: travel!digital Thesaurus
definition: bdk: besondere Attraktion

Morning Glory Spring
type: Label
in scheme: travel!digital Thesaurus

Zedernwald von Teniet el-Haâd
type: Concept
related match: Théniet El Had National Park
pref label: Zedernwald von Teniet el-Haâd
in scheme: travel!digital Thesaurus
definition: bdk: besondere Attraktion

Zedernwald von Teniet el-Haâd
type: Label
in scheme: travel!digital Thesaurus

Golf von Genua
type: Concept
pref label: Golf von Genua
in scheme: travel!digital Thesaurus
related match: Ligurian Sea
definition: bdk: besondere Attraktion

Golf von Genua
type: Label
in scheme: travel!digital Thesaurus

Mount Equinox
type: Concept
in scheme: travel!digital Thesaurus
pref label: Mount Equinox
definition: bdk: besondere Attraktion

Mount Equinox
type: Label
in scheme: travel!digital Thesaurus

Eagle Peak
type: Concept
pref label: Eagle Peak
in scheme: travel!digital Thesaurus
definition: bdk: besondere Attraktion

Eagle Peak
type: Label
in scheme: travel!digital Thesaurus

Berkshire Hills
type: Concept
in scheme: travel!digital Thesaurus
pref label: Berkshire Hills
definition: bdk: besondere Attraktion

Berkshire Hills
type: Label
in scheme: travel!digital Thesaurus

Lehigh Water Gap
type: Concept
pref label: Lehigh Water Gap
in scheme: travel!digital Thesaurus
definition: bdk: besondere Attraktion

Lehigh Water Gap
type: Label
in scheme: travel!digital Thesaurus

Kühles Tal
type: Concept
in scheme: travel!digital Thesaurus
pref label: Kühles Tal
related match: Rózsadomb
related match: Budapest
definition: bdk: besondere Attraktion

Kühles Tal
type: Label
in scheme: travel!digital Thesaurus

Penha d’ Aguia
type: Concept
related match: Madeira
pref label: Penha d’ Aguia
in scheme: travel!digital Thesaurus
definition: bdk: besondere Attraktion

Penha d’ Aguia
type: Label
in scheme: travel!digital Thesaurus

Lake Champlain
type: Concept
pref label: Lake Champlain
in scheme: travel!digital Thesaurus
definition: bdk: besondere Attraktion

Lake Champlain
type: Label
in scheme: travel!digital Thesaurus

Monte Pellegrino
type: Concept
pref label: Monte Pellegrino
in scheme: travel!digital Thesaurus
definition: bdk: besondere Attraktion

Monte Pellegrino
type: Label
in scheme: travel!digital Thesaurus

Talmulde von Icod
type: Concept
related match: Icod de los Vinos
pref label: Talmulde von Icod
in scheme: travel!digital Thesaurus
definition: bdk: besondere Attraktion

Talmulde von Icod
type: Label
in scheme: travel!digital Thesaurus

Pinal de la Guancha
type: Concept
related match: Gran Canaria
pref label: Pinal de la Guancha
in scheme: travel!digital Thesaurus
definition: bdk: besondere Attraktion

Pinal de la Guancha
type: Label
in scheme: travel!digital Thesaurus

Cabo Girão
type: Concept
pref label: Cabo Girão
in scheme: travel!digital Thesaurus
definition: bdk: besondere Attraktion

Cabo Girão
type: Label
in scheme: travel!digital Thesaurus

Djebel Metlili
type: Concept
pref label: Djebel Metlili
in scheme: travel!digital Thesaurus
related match: Metlili
definition: bdk: besondere Attraktion

Djebel Metlili
type: Label
in scheme: travel!digital Thesaurus

Mount Moosilauke
type: Concept
in scheme: travel!digital Thesaurus
pref label: Mount Moosilauke
definition: bdk: besondere Attraktion

Mount Moosilauke
type: Label
in scheme: travel!digital Thesaurus

Saluda Gap
type: Concept
pref label: Saluda Gap
in scheme: travel!digital Thesaurus
definition: bdk: besondere Attraktion

Saluda Gap
type: Label
in scheme: travel!digital Thesaurus

Discovery Passage
type: Concept
pref label: Discovery Passage
in scheme: travel!digital Thesaurus
definition: bdk: besondere Attraktion

Discovery Passage
type: Label
in scheme: travel!digital Thesaurus

Giant Geyser
type: Concept
pref label: Giant Geyser
in scheme: travel!digital Thesaurus
definition: bdk: besondere Attraktion

Giant Geyser
type: Label
in scheme: travel!digital Thesaurus

Thalghât
type: Concept
in scheme: travel!digital Thesaurus
pref label: Thalghât
definition: bdk: besondere Attraktion

Thalghât
type: Label
in scheme: travel!digital Thesaurus

Mount Desert
type: Concept
in scheme: travel!digital Thesaurus
pref label: Mount Desert
definition: bdk: besondere Attraktion

Mount Desert
type: Label
in scheme: travel!digital Thesaurus

Mariposa Grove of Big Trees
type: Concept
pref label: Mariposa Grove of Big Trees
in scheme: travel!digital Thesaurus
definition: bdk: besondere Attraktion

Mariposa Grove of Big Trees
type: Label
in scheme: travel!digital Thesaurus

St. Vincenz-Kap
type: Concept
pref label: St. Vincenz-Kap
in scheme: travel!digital Thesaurus
definition: bdk: besondere Attraktion

St. Vincenz-Kap
type: Label
in scheme: travel!digital Thesaurus

Bocca dos Namorados
type: Concept
pref label: Bocca dos Namorados
in scheme: travel!digital Thesaurus
related match: Madeira
definition: bdk: besondere Attraktion

Bocca dos Namorados
type: Label
in scheme: travel!digital Thesaurus

Council Chamber
type: Concept
pref label: Council Chamber
in scheme: travel!digital Thesaurus
definition: bdk: besondere Attraktion

Council Chamber
type: Label
in scheme: travel!digital Thesaurus

Sunset Rock
type: Concept
in scheme: travel!digital Thesaurus
pref label: Sunset Rock
definition: bdk: besondere Attraktion
related match: Overlook Mountain

Sunset Rock
type: Label
in scheme: travel!digital Thesaurus

Mount Shasta
type: Concept
pref label: Mount Shasta
in scheme: travel!digital Thesaurus
definition: bdk: besondere Attraktion

Mount Shasta
type: Label
in scheme: travel!digital Thesaurus

Glacier Point
type: Concept
pref label: Glacier Point
in scheme: travel!digital Thesaurus
definition: bdk: besondere Attraktion

Glacier Point
type: Label
in scheme: travel!digital Thesaurus

Morning Glory
type: Concept
pref label: Morning Glory
in scheme: travel!digital Thesaurus
definition: bdk: besondere Attraktion

Morning Glory
type: Label
in scheme: travel!digital Thesaurus

Quinsigamond Lake
type: Concept
in scheme: travel!digital Thesaurus
pref label: Quinsigamond Lake
definition: bdk: besondere Attraktion

Quinsigamond Lake
type: Label
in scheme: travel!digital Thesaurus

Freshwater Lake
type: Concept
in scheme: travel!digital Thesaurus
pref label: Freshwater Lake
related match: Colombo
definition: bdk: besondere Attraktion

Freshwater Lake
type: Label
in scheme: travel!digital Thesaurus

Sunshine Pool
type: Concept
related match: Geothermal areas of Yellowstone
pref label: Sunshine Pool
in scheme: travel!digital Thesaurus
definition: bdk: besondere Attraktion

Sunshine Pool
type: Label
in scheme: travel!digital Thesaurus

Mount Lafayette
type: Concept
in scheme: travel!digital Thesaurus
pref label: Mount Lafayette
definition: bdk: besondere Attraktion

Mount Lafayette
type: Label
in scheme: travel!digital Thesaurus

Fall
type: Concept
narrower: Bridal Veil Fall
narrower: Tower Falls
narrower: Ripley oder Sylvan Glade Falls
narrower: Multnomah
narrower: Kaaterskill-Fälle
narrower: Juanacatlan-Fälle
related match: Spokane Falls
narrower: Bashbish Falls
pref label: Fall
narrower: Canadischer oder Hufeisen Fall
narrower: Haines’s Falls
narrower: großer oder unterer Yellowstone-Fall
narrower: Vernal-Fall
definition: bdk: [Wasser]fall | bdk: besondere Attraktion
narrower: große Shoshone-Fälle
narrower: Silver Cascade
narrower: Milldam Falls
in scheme: travel!digital Thesaurus
narrower: Arethusa Falls
narrower: Middle Gardiner Falls
narrower: Chilnooalna Falls
narrower: Minnehah-Fälle
narrower: Sherman Falls
narrower: Silver Apron
narrower: Yosemite-Fälle
related match: Rochester, New York
narrower: Cumberland-Fällen
narrower: Rainbow oder Birmingham Falls
narrower: High Falls
narrower: Amerikanischer Fall
narrower: Plattekill-Fälle
narrower: oberer Fall
narrower: Fälle des Mohawk
narrower: Crystal Cascade
narrower: Georgianna oder Harvard Falls
narrower: Tallulah-Fälle
narrower: Diamond Cascade
narrower: Rainbow Falls
narrower: große Potomacfälle
narrower: Nevada-Fall
narrower: Fälle des Housatonic
narrower: Wasserfall des Risco
narrower: Trenton-Fälle
narrower: Gibbon-Fälle
narrower: Portage Falls
narrower: Glen Ellis Falls
narrower: Taughanic Fall
narrower: Centre Fall
narrower: Niagara-Fälle
narrower: Virginiafälle

Bridal Veil Fall
type: Concept
pref label: Bridal Veil Fall
in scheme: travel!digital Thesaurus
definition: bdk: besondere Attraktion

Bridal Veil Fall
type: Label
in scheme: travel!digital Thesaurus

Tower Falls
type: Concept
pref label: Tower Falls
in scheme: travel!digital Thesaurus
definition: bdk: besondere Attraktion

Tower Falls
type: Label
in scheme: travel!digital Thesaurus

Ripley oder Sylvan Glade Falls
type: Concept
in scheme: travel!digital Thesaurus
pref label: Ripley oder Sylvan Glade Falls
definition: bdk: besondere Attraktion
related match: Crawford Notch

Ripley oder Sylvan Glade Falls
type: Label
in scheme: travel!digital Thesaurus

Multnomah
type: Concept
pref label: Multnomah
in scheme: travel!digital Thesaurus
definition: bdk: besondere Attraktion

Multnomah
type: Label
in scheme: travel!digital Thesaurus

Kaaterskill-Fälle
type: Concept
in scheme: travel!digital Thesaurus
pref label: Kaaterskill-Fälle
definition: bdk: besondere Attraktion

Kaaterskill-Fälle
type: Label
in scheme: travel!digital Thesaurus

Juanacatlan-Fälle
type: Concept
pref label: Juanacatlan-Fälle
in scheme: travel!digital Thesaurus
definition: bdk: besondere Attraktion

Juanacatlan-Fälle
type: Label
in scheme: travel!digital Thesaurus

Bashbish Falls
type: Concept
in scheme: travel!digital Thesaurus
pref label: Bashbish Falls
definition: bdk: besondere Attraktion

Bashbish Falls
type: Label
in scheme: travel!digital Thesaurus

Fall
type: Label
in scheme: travel!digital Thesaurus

Canadischer oder Hufeisen Fall
type: Concept
pref label: Canadischer oder Hufeisen Fall
in scheme: travel!digital Thesaurus
definition: bdk: besondere Attraktion

Canadischer oder Hufeisen Fall
type: Label
in scheme: travel!digital Thesaurus

Haines’s Falls
type: Concept
in scheme: travel!digital Thesaurus
pref label: Haines’s Falls
definition: bdk: besondere Attraktion

Haines’s Falls
type: Label
in scheme: travel!digital Thesaurus

großer oder unterer Yellowstone-Fall
type: Concept
in scheme: travel!digital Thesaurus
pref label: großer oder unterer Yellowstone-Fall
definition: bdk: besondere Attraktion

großer oder unterer Yellowstone-Fall
type: Label
in scheme: travel!digital Thesaurus

Vernal-Fall
type: Concept
pref label: Vernal-Fall
in scheme: travel!digital Thesaurus
definition: bdk: besondere Attraktion

Vernal-Fall
type: Label
in scheme: travel!digital Thesaurus

große Shoshone-Fälle
type: Concept
pref label: große Shoshone-Fälle
in scheme: travel!digital Thesaurus
definition: bdk: besondere Attraktion

große Shoshone-Fälle
type: Label
in scheme: travel!digital Thesaurus

Silver Cascade
type: Concept
in scheme: travel!digital Thesaurus
pref label: Silver Cascade
definition: bdk: besondere Attraktion
related match: Crawford Notch

Silver Cascade
type: Label
in scheme: travel!digital Thesaurus

Milldam Falls
type: Concept
in scheme: travel!digital Thesaurus
definition: bdk: besondere Attraktion
pref label: Milldam Falls
related match: Mohawk Valley
related match: Utica, New York

Milldam Falls
type: Label
in scheme: travel!digital Thesaurus

Arethusa Falls
type: Concept
in scheme: travel!digital Thesaurus
pref label: Arethusa Falls
definition: bdk: besondere Attraktion

Arethusa Falls
type: Label
in scheme: travel!digital Thesaurus

Middle Gardiner Falls
type: Concept
related match: Yellowstone Falls
pref label: Middle Gardiner Falls
in scheme: travel!digital Thesaurus
definition: bdk: besondere Attraktion

Middle Gardiner Falls
type: Label
in scheme: travel!digital Thesaurus

Chilnooalna Falls
type: Concept
pref label: Chilnooalna Falls
in scheme: travel!digital Thesaurus
definition: bdk: besondere Attraktion

Chilnooalna Falls
type: Label
in scheme: travel!digital Thesaurus

Minnehah-Fälle
type: Concept
pref label: Minnehah-Fälle
in scheme: travel!digital Thesaurus
definition: bdk: besondere Attraktion

Minnehah-Fälle
type: Label
in scheme: travel!digital Thesaurus

Sherman Falls
type: Concept
pref label: Sherman Falls
in scheme: travel!digital Thesaurus
definition: bdk: besondere Attraktion

Sherman Falls
type: Label
in scheme: travel!digital Thesaurus

Silver Apron
type: Concept
pref label: Silver Apron
in scheme: travel!digital Thesaurus
definition: bdk: besondere Attraktion
related match: Vernal Fall

Silver Apron
type: Label
in scheme: travel!digital Thesaurus

Yosemite-Fälle
type: Concept
narrower: oberer Yosemite-Fall
pref label: Yosemite-Fälle
in scheme: travel!digital Thesaurus
definition: bdk: besondere Attraktion

oberer Yosemite-Fall
type: Concept
pref label: oberer Yosemite-Fall
in scheme: travel!digital Thesaurus
definition: bdk: besondere Attraktion

oberer Yosemite-Fall
type: Label
in scheme: travel!digital Thesaurus

Yosemite-Fälle
type: Label
in scheme: travel!digital Thesaurus

Cumberland-Fällen
type: Concept
pref label: Cumberland-Fällen
in scheme: travel!digital Thesaurus
definition: bdk: besondere Attraktion

Cumberland-Fällen
type: Label
in scheme: travel!digital Thesaurus

Rainbow oder Birmingham Falls
type: Concept
pref label: Rainbow oder Birmingham Falls
in scheme: travel!digital Thesaurus
definition: bdk: besondere Attraktion
related match: Ausable Chasm (New York)

Rainbow oder Birmingham Falls
type: Label
in scheme: travel!digital Thesaurus

High Falls
type: Concept
pref label: High Falls
in scheme: travel!digital Thesaurus
definition: bdk: besondere Attraktion
related match: Mohawk Valley
related match: Utica, New York

High Falls
type: Label
in scheme: travel!digital Thesaurus

Amerikanischer Fall
type: Concept
pref label: Amerikanischer Fall
in scheme: travel!digital Thesaurus
definition: bdk: besondere Attraktion

Amerikanischer Fall
type: Label
in scheme: travel!digital Thesaurus

Plattekill-Fälle
type: Concept
pref label: Plattekill-Fälle
in scheme: travel!digital Thesaurus
definition: bdk: besondere Attraktion
related match: Platte Clove

Plattekill-Fälle
type: Label
in scheme: travel!digital Thesaurus

oberer Fall
type: Concept
pref label: oberer Fall
in scheme: travel!digital Thesaurus
definition: bdk: besondere Attraktion

oberer Fall
type: Label
in scheme: travel!digital Thesaurus

Fälle des Mohawk
type: Concept
in scheme: travel!digital Thesaurus
pref label: Fälle des Mohawk
definition: bdk: besondere Attraktion
related match: Mohawk River

Fälle des Mohawk
type: Label
in scheme: travel!digital Thesaurus

Crystal Cascade
type: Concept
in scheme: travel!digital Thesaurus
pref label: Crystal Cascade
definition: bdk: besondere Attraktion
related match: Ellis River (New Hampshire)

Crystal Cascade
type: Label
in scheme: travel!digital Thesaurus

Georgianna oder Harvard Falls
type: Concept
in scheme: travel!digital Thesaurus
pref label: Georgianna oder Harvard Falls
definition: bdk: besondere Attraktion
related match: Franconia Notch State Park

Georgianna oder Harvard Falls
type: Label
in scheme: travel!digital Thesaurus

Tallulah-Fälle
type: Concept
pref label: Tallulah-Fälle
in scheme: travel!digital Thesaurus
definition: bdk: besondere Attraktion

Tallulah-Fälle
type: Label
in scheme: travel!digital Thesaurus

Diamond Cascade
type: Concept
pref label: Diamond Cascade
in scheme: travel!digital Thesaurus
definition: bdk: besondere Attraktion
related match: Vernal Fall

Diamond Cascade
type: Label
in scheme: travel!digital Thesaurus

Rainbow Falls
type: Concept
pref label: Rainbow Falls
in scheme: travel!digital Thesaurus
definition: bdk: besondere Attraktion

Rainbow Falls
type: Label
in scheme: travel!digital Thesaurus

große Potomacfälle
type: Concept
pref label: große Potomacfälle
in scheme: travel!digital Thesaurus
definition: bdk: besondere Attraktion

große Potomacfälle
type: Label
in scheme: travel!digital Thesaurus

Nevada-Fall
type: Concept
pref label: Nevada-Fall
in scheme: travel!digital Thesaurus
definition: bdk: besondere Attraktion

Nevada-Fall
type: Label
in scheme: travel!digital Thesaurus

Fälle des Housatonic
type: Concept
in scheme: travel!digital Thesaurus
pref label: Fälle des Housatonic
definition: bdk: besondere Attraktion
related match: Housatonic River

Fälle des Housatonic
type: Label
in scheme: travel!digital Thesaurus

Wasserfall des Risco
type: Concept
pref label: Wasserfall des Risco
in scheme: travel!digital Thesaurus
definition: bdk: besondere Attraktion

Wasserfall des Risco
type: Label
in scheme: travel!digital Thesaurus

Trenton-Fälle
type: Concept
pref label: Trenton-Fälle
in scheme: travel!digital Thesaurus
definition: bdk: besondere Attraktion

Trenton-Fälle
type: Label
in scheme: travel!digital Thesaurus

Gibbon-Fälle
type: Concept
pref label: Gibbon-Fälle
in scheme: travel!digital Thesaurus
definition: bdk: besondere Attraktion

Gibbon-Fälle
type: Label
in scheme: travel!digital Thesaurus

Portage Falls
type: Concept
pref label: Portage Falls
in scheme: travel!digital Thesaurus
definition: bdk: besondere Attraktion
related match: Genesee River

Portage Falls
type: Label
in scheme: travel!digital Thesaurus

Glen Ellis Falls
type: Concept
in scheme: travel!digital Thesaurus
pref label: Glen Ellis Falls
definition: bdk: besondere Attraktion
related match: Ellis River (New Hampshire)

Glen Ellis Falls
type: Label
in scheme: travel!digital Thesaurus

Taughanic Fall
type: Concept
pref label: Taughanic Fall
in scheme: travel!digital Thesaurus
definition: bdk: besondere Attraktion

Taughanic Fall
type: Label
in scheme: travel!digital Thesaurus

Centre Fall
type: Concept
pref label: Centre Fall
in scheme: travel!digital Thesaurus
definition: bdk: besondere Attraktion
related match: Niagara Falls

Centre Fall
type: Label
in scheme: travel!digital Thesaurus

Niagara-Fälle
type: Concept
alternative label: Niagarafälle
alt label: Niagarafälle
pref label: Niagara-Fälle
in scheme: travel!digital Thesaurus
definition: bdk: besondere Attraktion

Niagarafälle
type: Label
isVariantOf: Niagara-Fälle
in scheme: travel!digital Thesaurus

Niagara-Fälle
type: Label
hasVariant: Niagarafälle
in scheme: travel!digital Thesaurus

Virginiafälle
type: Concept
pref label: Virginiafälle
in scheme: travel!digital Thesaurus
definition: bdk: besondere Attraktion

Virginiafälle
type: Label
in scheme: travel!digital Thesaurus

Mount Lincoln
type: Concept
pref label: Mount Lincoln
in scheme: travel!digital Thesaurus
definition: bdk: besondere Attraktion

Mount Lincoln
type: Label
in scheme: travel!digital Thesaurus

Piks von Teneriffa
type: Concept
pref label: Piks von Teneriffa
in scheme: travel!digital Thesaurus
definition: bdk: besondere Attraktion

Piks von Teneriffa
type: Label
in scheme: travel!digital Thesaurus

Golf von Oran
type: Concept
in scheme: travel!digital Thesaurus
pref label: Golf von Oran
related match: Oran
definition: bdk: besondere Attraktion

Golf von Oran
type: Label
in scheme: travel!digital Thesaurus

Lake Mahkeenac
type: Concept
in scheme: travel!digital Thesaurus
pref label: Lake Mahkeenac
definition: bdk: besondere Attraktion

Lake Mahkeenac
type: Label
in scheme: travel!digital Thesaurus

Unteres Geiserbecken
type: Concept
related match: Geothermal areas of Yellowstone
pref label: Unteres Geiserbecken
in scheme: travel!digital Thesaurus
definition: bdk: besondere Attraktion

Unteres Geiserbecken
type: Label
in scheme: travel!digital Thesaurus

Muir-Gletscher
type: Concept
pref label: Muir-Gletscher
in scheme: travel!digital Thesaurus
definition: bdk: besondere Attraktion

Muir-Gletscher
type: Label
in scheme: travel!digital Thesaurus

Pico Ruivo do Paul
type: Concept
related match: Madeira
pref label: Pico Ruivo do Paul
in scheme: travel!digital Thesaurus
definition: bdk: besondere Attraktion

Pico Ruivo do Paul
type: Label
in scheme: travel!digital Thesaurus

Pend d’Oreille
type: Concept
pref label: Pend d’Oreille
in scheme: travel!digital Thesaurus
definition: bdk: besondere Attraktion

Pend d’Oreille
type: Label
in scheme: travel!digital Thesaurus

Berthoud Pass
type: Concept
in scheme: travel!digital Thesaurus
pref label: Berthoud Pass
definition: bdk: besondere Attraktion

Berthoud Pass
type: Label
in scheme: travel!digital Thesaurus

Sentinel
type: Concept
pref label: Sentinel
in scheme: travel!digital Thesaurus
definition: bdk: besondere Attraktion
related match: Ausable Chasm (New York)

Sentinel
type: Label
in scheme: travel!digital Thesaurus

Blocksberg
type: Concept
in scheme: travel!digital Thesaurus
pref label: Blocksberg
definition: bdk: besondere Attraktion

Blocksberg
type: Label
in scheme: travel!digital Thesaurus

Pagos
type: Concept
pref label: Pagos
in scheme: travel!digital Thesaurus
related match: İzmir
definition: bdk: besondere Attraktion

Pagos
type: Label
in scheme: travel!digital Thesaurus

Urwald
type: Concept
related match: Tenerife
narrower: Urwald von Agua Garcia
in scheme: travel!digital Thesaurus
pref label: Urwald
definition: bdk: besondere Attraktion

Urwald von Agua Garcia
type: Concept
related match: Tenerife
in scheme: travel!digital Thesaurus
pref label: Urwald von Agua Garcia
definition: bdk: besondere Attraktion

Urwald von Agua Garcia
type: Label
in scheme: travel!digital Thesaurus

Urwald
type: Label
in scheme: travel!digital Thesaurus

Balcony
type: Concept
pref label: Balcony
in scheme: travel!digital Thesaurus
definition: bdk: besondere Attraktion
related match: Adirondack Mountains
related match: Keene, New York

Balcony
type: Label
in scheme: travel!digital Thesaurus

North Park
type: Concept
pref label: North Park
in scheme: travel!digital Thesaurus
definition: bdk: besondere Attraktion

North Park
type: Label
in scheme: travel!digital Thesaurus

Col de Sfa
type: Concept
pref label: Col de Sfa
in scheme: travel!digital Thesaurus
related match: Biskra
definition: bdk: besondere Attraktion

Col de Sfa
type: Label
in scheme: travel!digital Thesaurus

Pointe Pescade
type: Concept
in scheme: travel!digital Thesaurus
pref label: Pointe Pescade
definition: bdk: besondere Attraktion

Pointe Pescade
type: Label
in scheme: travel!digital Thesaurus

Indian River
type: Concept
pref label: Indian River
in scheme: travel!digital Thesaurus
definition: bdk: besondere Attraktion

Indian River
type: Label
in scheme: travel!digital Thesaurus

Cumberland Gap
type: Concept
pref label: Cumberland Gap
in scheme: travel!digital Thesaurus
definition: bdk: besondere Attraktion

Cumberland Gap
type: Label
in scheme: travel!digital Thesaurus

Fitzhugh Sound
type: Concept
pref label: Fitzhugh Sound
in scheme: travel!digital Thesaurus
definition: bdk: besondere Attraktion

Fitzhugh Sound
type: Label
in scheme: travel!digital Thesaurus

Lake Memphremagog
type: Concept
in scheme: travel!digital Thesaurus
pref label: Lake Memphremagog
definition: bdk: besondere Attraktion

Lake Memphremagog
type: Label
in scheme: travel!digital Thesaurus

Great Head
type: Concept
in scheme: travel!digital Thesaurus
pref label: Great Head
definition: bdk: besondere Attraktion
related match: Great Head Trail

Great Head
type: Label
in scheme: travel!digital Thesaurus

Wagon Wheel Gap
type: Concept
related match: Wagon Wheel Gap Railroad Station
pref label: Wagon Wheel Gap
in scheme: travel!digital Thesaurus
definition: bdk: besondere Attraktion

Wagon Wheel Gap
type: Label
in scheme: travel!digital Thesaurus

Observatory Hill
type: Concept
in scheme: travel!digital Thesaurus
pref label: Observatory Hill
definition: bdk: besondere Attraktion

Observatory Hill
type: Label
in scheme: travel!digital Thesaurus

Yosemite Valley
type: Concept
pref label: Yosemite Valley
in scheme: travel!digital Thesaurus
definition: bdk: besondere Attraktion

Yosemite Valley
type: Label
in scheme: travel!digital Thesaurus

Dalles des Wisconsin
type: Concept
related match: Wisconsin Rapids, Wisconsin
pref label: Dalles des Wisconsin
in scheme: travel!digital Thesaurus
definition: bdk: besondere Attraktion

Dalles des Wisconsin
type: Label
in scheme: travel!digital Thesaurus

Lower Saranac Lake
type: Concept
pref label: Lower Saranac Lake
in scheme: travel!digital Thesaurus
definition: bdk: besondere Attraktion

Lower Saranac Lake
type: Label
in scheme: travel!digital Thesaurus

Trempealeau Island
type: Concept
related match: Trempealeau, Wisconsin
related match: Trempealeau National Wildlife Refuge
pref label: Trempealeau Island
in scheme: travel!digital Thesaurus
definition: bdk: besondere Attraktion

Trempealeau Island
type: Label
in scheme: travel!digital Thesaurus

Mandalay Hill
type: Concept
in scheme: travel!digital Thesaurus
pref label: Mandalay Hill
definition: bdk: besondere Attraktion

Mandalay Hill
type: Label
in scheme: travel!digital Thesaurus

Seal Rocks
type: Concept
related match: Monterey, California
pref label: Seal Rocks
in scheme: travel!digital Thesaurus
definition: bdk: besondere Attraktion

Seal Rocks
type: Label
in scheme: travel!digital Thesaurus

Split Rock
type: Concept
pref label: Split Rock Mountain
definition: bdk: besondere Attraktion
in scheme: travel!digital Thesaurus
label: Split Rock Mountain
related match: Split Rock Wildway

Split Rock Mountain
type: Label
in scheme: travel!digital Thesaurus

Beehive
type: Concept
pref label: Beehive
in scheme: travel!digital Thesaurus
definition: bdk: besondere Attraktion

Beehive
type: Label
in scheme: travel!digital Thesaurus

Cap of Liberty
type: Concept
pref label: Cap of Liberty
in scheme: travel!digital Thesaurus
definition: bdk: besondere Attraktion

Cap of Liberty
type: Label
in scheme: travel!digital Thesaurus

Nantasket Beach
type: Concept
in scheme: travel!digital Thesaurus
pref label: Nantasket Beach
definition: bdk: besondere Attraktion

Nantasket Beach
type: Label
in scheme: travel!digital Thesaurus

Sonnenuntergang
type: Concept
in scheme: travel!digital Thesaurus
pref label: Sonnenuntergang
definition: bdk: besondere Attraktion
related match: Maidan (Kolkata)

Sonnenuntergang
type: Label
in scheme: travel!digital Thesaurus

Kessel
type: Concept
definition: bdk: besondere Attraktion
related match: Franconia Notch State Park
pref label: pool
in scheme: travel!digital Thesaurus
comment: Nordamerika 1893: nur englisch
pref label: Kessel
preferred label: pool @en

pool
type: Label
isTranslationOf: Kessel
in scheme: travel!digital Thesaurus

Kessel
type: Label
hasTranslation: pool
in scheme: travel!digital Thesaurus

Sapphire Pool
type: Concept
related match: Geothermal areas of Yellowstone
pref label: Sapphire Pool
in scheme: travel!digital Thesaurus
definition: bdk: besondere Attraktion

Sapphire Pool
type: Label
in scheme: travel!digital Thesaurus

Lake of the Thousand Islands
type: Concept
pref label: Lake of the Thousand Islands
in scheme: travel!digital Thesaurus
definition: bdk: besondere Attraktion
related match: Thousand Islands
related match: Saint Lawrence River

Lake of the Thousand Islands
type: Label
in scheme: travel!digital Thesaurus

Formationen oder Terrassen
type: Concept
related match: Mammoth Hot Springs
pref label: Formationen oder Terrassen
in scheme: travel!digital Thesaurus
definition: bdk: besondere Attraktion

Formationen oder Terrassen
type: Label
in scheme: travel!digital Thesaurus

Seneca-See
type: Concept
pref label: Seneca-See
in scheme: travel!digital Thesaurus
definition: bdk: besondere Attraktion

Seneca-See
type: Label
in scheme: travel!digital Thesaurus

Austin Bluffs
type: Concept
pref label: Austin Bluffs
in scheme: travel!digital Thesaurus
definition: bdk: besondere Attraktion

Austin Bluffs
type: Label
in scheme: travel!digital Thesaurus

Mount Holyoke
type: Concept
in scheme: travel!digital Thesaurus
pref label: Mount Holyoke
definition: bdk: besondere Attraktion

Mount Holyoke
type: Label
in scheme: travel!digital Thesaurus

Grande-Porte
type: Concept
pref label: Grande-Porte
in scheme: travel!digital Thesaurus
related match: Constantine Province
definition: bdk: besondere Attraktion

Grande-Porte
type: Label
in scheme: travel!digital Thesaurus

Saratoga Lake
type: Concept
pref label: Saratoga Lake
in scheme: travel!digital Thesaurus
definition: bdk: besondere Attraktion

Saratoga Lake
type: Label
in scheme: travel!digital Thesaurus

Straße von Bonifacio
type: Concept
pref label: Straße von Bonifacio
in scheme: travel!digital Thesaurus
definition: bdk: besondere Attraktion

Straße von Bonifacio
type: Label
in scheme: travel!digital Thesaurus

Djebel Zaghouan
type: Concept
pref label: Djebel Zaghouan
in scheme: travel!digital Thesaurus
definition: bdk: besondere Attraktion

Djebel Zaghouan
type: Label
in scheme: travel!digital Thesaurus

Golf von Castiglione
type: Concept
pref label: Golf von Castiglione
in scheme: travel!digital Thesaurus
related match: Bou Ismaïl
definition: bdk: besondere Attraktion

Golf von Castiglione
type: Label
in scheme: travel!digital Thesaurus

Mount Willard
type: Concept
in scheme: travel!digital Thesaurus
pref label: Mount Willard
definition: bdk: besondere Attraktion

Mount Willard
type: Label
in scheme: travel!digital Thesaurus

Mount Rainier oder Tacoma
type: Concept
pref label: Mount Rainier oder Tacoma
in scheme: travel!digital Thesaurus
definition: bdk: besondere Attraktion

Mount Rainier oder Tacoma
type: Label
in scheme: travel!digital Thesaurus

Defilee
type: Concept
in scheme: travel!digital Thesaurus
narrower: Defilee von Balaban
pref label: Defilee
narrower: mittleres (2.) Defilé
definition: bdk: besondere Attraktion | Duden: parademäßiger Vorbeimarsch, das feierliche Vorüberziehen, besonders an einer hochgestellten Persönlichkeit

Defilee von Balaban
type: Concept
in scheme: travel!digital Thesaurus
pref label: Defilee von Balaban
related match: Sakarya River
definition: bdk: besondere Attraktion

Defilee von Balaban
type: Label
in scheme: travel!digital Thesaurus

Defilee
type: Label
in scheme: travel!digital Thesaurus

mittleres (2.) Defilé
type: Concept
in scheme: travel!digital Thesaurus
pref label: mittleres (2.) Defilé
related match: Irrawaddy River
definition: bdk: besondere Attraktion

mittleres (2.) Defilé
type: Label
in scheme: travel!digital Thesaurus

Hurricane Mountain
type: Concept
pref label: Hurricane Mountain
in scheme: travel!digital Thesaurus
definition: bdk: besondere Attraktion

Hurricane Mountain
type: Label
in scheme: travel!digital Thesaurus

Copple Crown
type: Concept
in scheme: travel!digital Thesaurus
pref label: Copple Crown
definition: bdk: besondere Attraktion
related match: Wolfeboro, New Hampshire

Copple Crown
type: Label
in scheme: travel!digital Thesaurus

Kiefernwälder
type: Concept
pref label: Kiefernwälder
in scheme: travel!digital Thesaurus
related match: Tenerife
definition: bdk: besondere Attraktion

Kiefernwälder
type: Label
in scheme: travel!digital Thesaurus

Indian Pass
type: Concept
pref label: Indian Pass
in scheme: travel!digital Thesaurus
definition: bdk: besondere Attraktion
related match: Adirondack Mountains

Indian Pass
type: Label
in scheme: travel!digital Thesaurus

Dalles des Columbia
type: Concept
related match: Celilo Falls
pref label: Dalles des Columbia
in scheme: travel!digital Thesaurus
definition: bdk: besondere Attraktion

Dalles des Columbia
type: Label
in scheme: travel!digital Thesaurus

Luna Island
type: Concept
pref label: Luna Island
in scheme: travel!digital Thesaurus
definition: bdk: besondere Attraktion

Luna Island
type: Label
in scheme: travel!digital Thesaurus

Djebel Bir
type: Concept
pref label: Djebel Bir
in scheme: travel!digital Thesaurus
related match: Khroumire
definition: bdk: besondere Attraktion

Djebel Bir
type: Label
in scheme: travel!digital Thesaurus

Halbinsel
type: Concept
pref label: Halbinsel
in scheme: travel!digital Thesaurus
related match: Collo
definition: bdk: besondere Attraktion

Halbinsel
type: Label
in scheme: travel!digital Thesaurus

Safsaftal
type: Concept
related match: Skikda
in scheme: travel!digital Thesaurus
pref label: Safsaftal
definition: bdk: besondere Attraktion

Safsaftal
type: Label
in scheme: travel!digital Thesaurus

Bai von Funchal
type: Concept
pref label: Bai von Funchal
in scheme: travel!digital Thesaurus
related match: Funchal
definition: bdk: besondere Attraktion

Bai von Funchal
type: Label
in scheme: travel!digital Thesaurus

Taku Inlet
type: Concept
pref label: Taku Inlet
in scheme: travel!digital Thesaurus
definition: bdk: besondere Attraktion

Taku Inlet
type: Label
in scheme: travel!digital Thesaurus

Dallas oder Pleasant Valley
type: Concept
related match: Ridgway, Colorado
pref label: Dallas oder Pleasant Valley
in scheme: travel!digital Thesaurus
definition: bdk: besondere Attraktion

Dallas oder Pleasant Valley
type: Label
in scheme: travel!digital Thesaurus

Mammoth Paint Pots
type: Concept
related match: Fountain Paint Pot
pref label: Mammoth Paint Pots
in scheme: travel!digital Thesaurus
definition: bdk: besondere Attraktion

Mammoth Paint Pots
type: Label
in scheme: travel!digital Thesaurus

Mount Washburne
type: Concept
pref label: Mount Washburne
in scheme: travel!digital Thesaurus
definition: bdk: besondere Attraktion

Mount Washburne
type: Label
in scheme: travel!digital Thesaurus

Mondstein
type: Concept
in scheme: travel!digital Thesaurus
pref label: Mondstein
related match: Anuradhapura
definition: bdk: besondere Attraktion | Duden: Adular: (zu den Feldspaten gehörender) farbloser oder weißlicher bis bläulicher Schmuckstein mit irisierendem Glanz Meyers Großes Konversations-Lexikon 1908: Orthoklās (Kalifeldspat), Mineral der Feldspatgruppe (s. Feldspat), findet sich in kurz säulenförmigen oder dick tafelartigen, auch rechtwinklig säulenförmigen Kristallen von monoklinem Aussehen und häufig in Zwillingskristallen, die man nach einzelnen Fundorten als die Zwillinge nach dem Karlsbader, nach dem Manebacher und nach dem Bavenoer Gesetz bezeichnet hat. Er kommt teils eingewachsen und dann ringsum ausgebildet, teils aufgewachsen in Drusen, auch derb in kristallinischen Massen vor. Man unterscheidet mehrere Varietäten: a) Adular (Eisspat), stets in aufgewachsenen Kristallen, meist Zwillings- und Viellingskristallen, mit Bergkristall in Drusen der granitischen Gesteine der Alpen (besonders im Zillertal und am St. Gotthard), farblos, wasserhell, glasglänzend, durchsichtig bis durchscheinend, zuweilen mit bläulichem Lichtschein und dann wohl als Halbedelstein (Mondstein, Fisch- oder Wolfsauge, ceylonischer oder Wasseropal, Girasol) zu Ring- und Nadelsteinen geeignet; b) gemeinen Feldspat (Pegmatolith), weiß, rötlich bis ziegelrot, grau, gelb, grünlich, weniger glänzend als Adular, durchscheinend bis undurchsichtig, eingewachsen und in Drusen, auch derb, als wesentlicher Gemengteil vieler Gesteine, besonders des Granits, Syenits, Porphyrs, Gneises, sehr verbreitet. Schöne Kristalle liefern Karlsbad in Böhmen, Bischofsgrün im Fichtelgebirge, Hirschberg, Striegau und Kunnersdorf in Schlesien, Baveno am Lago Maggiore, Elba etc.[145] Der farbenspielende Feldspat von Frederiksvaern und ein durch eingelagerte Eisenglanzschüppchen rot schillernder O. von Nordamerika (Orthoklas-Sonnenstein, Avanturinfeldspat) werden auf Nadelsteine, Dosen, Stockknöpfe verarbeitet. Grobkristallinische Feldspate, von skelettartig ausgebildeten Quarzkristallen regelmäßig durchsetzt, bilden den Schr…

Mondstein
type: Label
in scheme: travel!digital Thesaurus

Napa-Thal
type: Concept
pref label: Napa-Thal
in scheme: travel!digital Thesaurus
definition: bdk: besondere Attraktion

Napa-Thal
type: Label
in scheme: travel!digital Thesaurus

Eureka Glen
type: Concept
pref label: Eureka Glen
in scheme: travel!digital Thesaurus
definition: bdk: besondere Attraktion
related match: Delaware Water Gap National Recreation Area

Eureka Glen
type: Label
in scheme: travel!digital Thesaurus

Prospect Hill
type: Concept
in scheme: travel!digital Thesaurus
pref label: Prospect Hill
definition: bdk: besondere Attraktion
related match: Sharon Springs, New York

Prospect Hill
type: Label
in scheme: travel!digital Thesaurus

Beauty Spring
type: Concept
pref label: Beauty Spring
in scheme: travel!digital Thesaurus
definition: bdk: besondere Attraktion

Beauty Spring
type: Label
in scheme: travel!digital Thesaurus

Deerfield Gorge
type: Concept
in scheme: travel!digital Thesaurus
pref label: Deerfield Gorge
definition: bdk: besondere Attraktion
related match: Deerfield River

Deerfield Gorge
type: Label
in scheme: travel!digital Thesaurus

Golden Gate
type: Concept
pref label: Golden Gate
in scheme: travel!digital Thesaurus
definition: bdk: besondere Attraktion

Golden Gate
type: Label
in scheme: travel!digital Thesaurus

Garden of the Gods
type: Concept
narrower: Gateway des Garden of the Gods
in scheme: travel!digital Thesaurus
pref label: Garden of the Gods
definition: bdk: besondere Attraktion

Gateway des Garden of the Gods
type: Concept
related match: Garden of the Gods
pref label: Gateway des Garden of the Gods
in scheme: travel!digital Thesaurus
definition: bdk: besondere Attraktion

Gateway des Garden of the Gods
type: Label
in scheme: travel!digital Thesaurus

Garden of the Gods
type: Label
in scheme: travel!digital Thesaurus

Golf von Smyrna
type: Concept
in scheme: travel!digital Thesaurus
pref label: Golf von Smyrna
definition: bdk: besondere Attraktion

Golf von Smyrna
type: Label
in scheme: travel!digital Thesaurus

Auwinkel
type: Concept
in scheme: travel!digital Thesaurus
pref label: Auwinkel
related match: Budapest Cog-wheel Railway
related match: Budapest
definition: bdk: besondere Attraktion

Auwinkel
type: Label
in scheme: travel!digital Thesaurus

Mount Kearsarge
type: Concept
in scheme: travel!digital Thesaurus
pref label: Mount Kearsarge
definition: bdk: besondere Attraktion

Mount Kearsarge
type: Label
in scheme: travel!digital Thesaurus

Cape Horn
type: Concept
related match: Sierra Nevada (U.S.)
pref label: Cape Horn
in scheme: travel!digital Thesaurus
definition: bdk: besondere Attraktion

Cape Horn
type: Label
in scheme: travel!digital Thesaurus

Drachenbaum- und Palmenallee
type: Concept
pref label: Drachenbaum- und Palmenallee
in scheme: travel!digital Thesaurus
related match: Algiers
definition: bdk: besondere Attraktion

Drachenbaum- und Palmenallee
type: Label
in scheme: travel!digital Thesaurus

Mount Washington
type: Concept
in scheme: travel!digital Thesaurus
pref label: Mount Washington
definition: bdk: besondere Attraktion

Mount Washington
type: Label
in scheme: travel!digital Thesaurus

Ausable Lakes
type: Concept
related match: Ausable Chasm (New York)
narrower: Lower Ausable Lake
definition: bdk: besondere Attraktion
pref label: Ausable Lakes
narrower: Upper Ausable Lake
related match: Keene, New York
in scheme: travel!digital Thesaurus

Lower Ausable Lake
type: Concept
pref label: Lower Ausable Lake
in scheme: travel!digital Thesaurus
definition: bdk: besondere Attraktion
related match: Ausable Chasm (New York)
related match: Keene, New York

Lower Ausable Lake
type: Label
in scheme: travel!digital Thesaurus

Ausable Lakes
type: Label
in scheme: travel!digital Thesaurus

Upper Ausable Lake
type: Concept
pref label: Upper Ausable Lake
in scheme: travel!digital Thesaurus
definition: bdk: besondere Attraktion
related match: Ausable Chasm (New York)
related match: Keene, New York

Upper Ausable Lake
type: Label
in scheme: travel!digital Thesaurus

Pico de Orizaba oder Citlatepetl
type: Concept
pref label: Pico de Orizaba oder Citlatepetl
in scheme: travel!digital Thesaurus
definition: bdk: besondere Attraktion

Pico de Orizaba oder Citlatepetl
type: Label
in scheme: travel!digital Thesaurus

Engpass
type: Concept
narrower: White Mountain Notch
narrower: Narrows
narrower: Dixville Notch
in scheme: travel!digital Thesaurus
pref label: Engpass
definition: bdk: besondere Attraktion
narrower: Franconia Notch
pref label: notch
narrower: Engpaß von Kazán
narrower: Crawford oder White Mountain Notch
comment: Nordamerika 1893: nur englisch
related match: Whiteface Mountain
preferred label: notch @en

White Mountain Notch
type: Concept
in scheme: travel!digital Thesaurus
pref label: White Mountain Notch
definition: bdk: besondere Attraktion
related match: White Mountains (New Hampshire)

White Mountain Notch
type: Label
in scheme: travel!digital Thesaurus

Narrows
type: Concept
definition: bdk: besondere Attraktion
narrower: Seymour Narrows
pref label: Narrows
narrower: Jack’s Narrows
in scheme: travel!digital Thesaurus
narrower: Packsaddle Narrows
narrower: Lewiston oder Long Narrows
related match: Lake George (New York)

Seymour Narrows
type: Concept
pref label: Seymour Narrows
in scheme: travel!digital Thesaurus
definition: bdk: besondere Attraktion

Seymour Narrows
type: Label
in scheme: travel!digital Thesaurus

Narrows
type: Label
in scheme: travel!digital Thesaurus

Jack’s Narrows
type: Concept
pref label: Jack’s Narrows
in scheme: travel!digital Thesaurus
definition: bdk: besondere Attraktion
related match: Jacks Mountain

Jack’s Narrows
type: Label
in scheme: travel!digital Thesaurus

Packsaddle Narrows
type: Concept
pref label: Packsaddle Narrows
in scheme: travel!digital Thesaurus
definition: bdk: besondere Attraktion
related match: Conemaugh River

Packsaddle Narrows
type: Label
in scheme: travel!digital Thesaurus

Lewiston oder Long Narrows
type: Concept
pref label: Lewiston oder Long Narrows
in scheme: travel!digital Thesaurus
definition: bdk: besondere Attraktion
related match: Mifflin, Pennsylvania

Lewiston oder Long Narrows
type: Label
in scheme: travel!digital Thesaurus

Dixville Notch
type: Concept
in scheme: travel!digital Thesaurus
pref label: Dixville Notch
definition: bdk: besondere Attraktion

Dixville Notch
type: Label
in scheme: travel!digital Thesaurus

Engpass
type: Label
hasTranslation: notch
in scheme: travel!digital Thesaurus

notch
type: Label
isTranslationOf: Engpass
in scheme: travel!digital Thesaurus

Franconia Notch
type: Concept
in scheme: travel!digital Thesaurus
pref label: Franconia Notch
definition: bdk: besondere Attraktion

Franconia Notch
type: Label
in scheme: travel!digital Thesaurus

Engpaß von Kazán
type: Concept
in scheme: travel!digital Thesaurus
pref label: Engpaß von Kazán
related match: Orșova
related match: Danube
related match: Iron Gates
definition: bdk: besondere Attraktion

Engpaß von Kazán
type: Label
in scheme: travel!digital Thesaurus

Crawford oder White Mountain Notch
type: Concept
in scheme: travel!digital Thesaurus
pref label: Crawford oder White Mountain Notch
definition: bdk: besondere Attraktion

Crawford oder White Mountain Notch
type: Label
in scheme: travel!digital Thesaurus

Three Sister Islands
type: Concept
pref label: Three Sister Islands
in scheme: travel!digital Thesaurus
definition: bdk: besondere Attraktion

Three Sister Islands
type: Label
in scheme: travel!digital Thesaurus

Mittelgebirge
type: Concept
pref label: Mittelgebirge
in scheme: travel!digital Thesaurus
related match: Kabylie
definition: bdk: besondere Attraktion

Mittelgebirge
type: Label
in scheme: travel!digital Thesaurus

Mount Prospect
type: Concept
in scheme: travel!digital Thesaurus
pref label: Mount Prospect
definition: bdk: besondere Attraktion
related match: Plymouth, New Hampshire

Mount Prospect
type: Label
in scheme: travel!digital Thesaurus

Mount Pisgah
type: Concept
related match: Asheville, North Carolina
pref label: Mount Pisgah
in scheme: travel!digital Thesaurus
definition: bdk: besondere Attraktion

Mount Pisgah
type: Label
in scheme: travel!digital Thesaurus

Shenandoah-Thal
type: Concept
alternative label: Thal von Virginien
alt label: Thal von Virginien
pref label: Shenandoah-Thal
in scheme: travel!digital Thesaurus
definition: bdk: besondere Attraktion

Thal von Virginien
type: Label
in scheme: travel!digital Thesaurus

Shenandoah-Thal
type: Label
in scheme: travel!digital Thesaurus

Terrapin Rock
type: Concept
pref label: Terrapin Rock
in scheme: travel!digital Thesaurus
definition: bdk: besondere Attraktion

Terrapin Rock
type: Label
in scheme: travel!digital Thesaurus

Stadtwäldchen
type: Concept
in scheme: travel!digital Thesaurus
pref label: Stadtwäldchen
definition: bdk: besondere Attraktion

Stadtwäldchen
type: Label
in scheme: travel!digital Thesaurus

Isles of Shoals
type: Concept
definition: bdk: besondere Attraktion
in scheme: travel!digital Thesaurus
pref label: Isles of Shoals

Isles of Shoals
type: Label
in scheme: travel!digital Thesaurus

Santa Catalina
type: Concept
pref label: Santa Catalina
in scheme: travel!digital Thesaurus
definition: bdk: besondere Attraktion

Santa Catalina
type: Label
in scheme: travel!digital Thesaurus

Yellowstone Lake
type: Concept
pref label: Yellowstone Lake
in scheme: travel!digital Thesaurus
definition: bdk: besondere Attraktion

Yellowstone Lake
type: Label
in scheme: travel!digital Thesaurus

Cathedral
type: Concept
pref label: Cathedral
in scheme: travel!digital Thesaurus
definition: bdk: besondere Attraktion
related match: Watkins Glen, New York

Cathedral
type: Label
in scheme: travel!digital Thesaurus

Castle Crags
type: Concept
pref label: Castle Crags
in scheme: travel!digital Thesaurus
definition: bdk: besondere Attraktion

Castle Crags
type: Label
in scheme: travel!digital Thesaurus

Rangeley oder Androscoggin Lakes
type: Concept
in scheme: travel!digital Thesaurus
pref label: Rangeley oder Androscoggin Lakes
definition: bdk: besondere Attraktion

Rangeley oder Androscoggin Lakes
type: Label
in scheme: travel!digital Thesaurus

Penandjaan
type: Concept
related match: Tengger massif
in scheme: travel!digital Thesaurus
pref label: Penandjaan
definition: bdk: besondere Attraktion

Penandjaan
type: Label
in scheme: travel!digital Thesaurus

Santa Clara Valley
type: Concept
pref label: Santa Clara Valley
in scheme: travel!digital Thesaurus
definition: bdk: besondere Attraktion

Santa Clara Valley
type: Label
in scheme: travel!digital Thesaurus

Turquoise Spring
type: Concept
pref label: Turquoise Spring
in scheme: travel!digital Thesaurus
definition: bdk: besondere Attraktion

Turquoise Spring
type: Label
in scheme: travel!digital Thesaurus

Castle
type: Concept
pref label: Castle
in scheme: travel!digital Thesaurus
definition: bdk: besondere Attraktion

Castle
type: Label
in scheme: travel!digital Thesaurus

Marshall-Pass
type: Concept
pref label: Marshall-Pass
in scheme: travel!digital Thesaurus
definition: bdk: besondere Attraktion

Marshall-Pass
type: Label
in scheme: travel!digital Thesaurus

Chabet el-Akra
type: Concept
in scheme: travel!digital Thesaurus
pref label: Chabet el-Akra
related match: Béjaïa
definition: bdk: besondere Attraktion

Chabet el-Akra
type: Label
in scheme: travel!digital Thesaurus

Raquette Lake
type: Concept
pref label: Raquette Lake
in scheme: travel!digital Thesaurus
definition: bdk: besondere Attraktion

Raquette Lake
type: Label
in scheme: travel!digital Thesaurus

Golf von Neapel
type: Concept
pref label: Golf von Neapel
in scheme: travel!digital Thesaurus
definition: bdk: besondere Attraktion

Golf von Neapel
type: Label
in scheme: travel!digital Thesaurus

Ice Glen
type: Concept
in scheme: travel!digital Thesaurus
pref label: Ice Glen
definition: bdk: besondere Attraktion

Ice Glen
type: Label
in scheme: travel!digital Thesaurus

Palisaden
type: Concept
in scheme: travel!digital Thesaurus
pref label: Palisaden
definition: bdk: besondere Attraktion

Palisaden
type: Label
in scheme: travel!digital Thesaurus

Glen Onko
type: Concept
pref label: Glen Onko
in scheme: travel!digital Thesaurus
definition: bdk: besondere Attraktion
related match: Lehigh Valley

Glen Onko
type: Label
in scheme: travel!digital Thesaurus

Beryl Spring
type: Concept
pref label: Beryl Spring
in scheme: travel!digital Thesaurus
definition: bdk: besondere Attraktion

Beryl Spring
type: Label
in scheme: travel!digital Thesaurus

Lynn Channel
type: Concept
pref label: Lynn Channel
in scheme: travel!digital Thesaurus
definition: bdk: besondere Attraktion

Lynn Channel
type: Label
in scheme: travel!digital Thesaurus

Pic des Beni-Salah
type: Concept
related match: Blida
pref label: Pic des Beni-Salah
in scheme: travel!digital Thesaurus
definition: bdk: besondere Attraktion

Pic des Beni-Salah
type: Label
in scheme: travel!digital Thesaurus

Crown Point
type: Concept
pref label: Crown Point
in scheme: travel!digital Thesaurus
definition: bdk: besondere Attraktion

Crown Point
type: Label
in scheme: travel!digital Thesaurus

Banyan-Feigenbaum (Ficus bengalensis)
type: Concept
in scheme: travel!digital Thesaurus
pref label: Banyan-Feigenbaum (Ficus bengalensis)
definition: bdk: besondere Attraktion

Banyan-Feigenbaum (Ficus bengalensis)
type: Label
in scheme: travel!digital Thesaurus

Forêt de Sidi-Sliman
type: Concept
pref label: Forêt de Sidi-Sliman
in scheme: travel!digital Thesaurus
related match: Sidi Slimane, Morocco
definition: bdk: besondere Attraktion

Forêt de Sidi-Sliman
type: Label
in scheme: travel!digital Thesaurus

Monte San Deca
type: Concept
pref label: Monte San Deca
in scheme: travel!digital Thesaurus
related match: Corfu
definition: bdk: besondere Attraktion

Monte San Deca
type: Label
in scheme: travel!digital Thesaurus

Panorama Bluff
type: Concept
pref label: Panorama Bluff
definition: bdk: besondere Attraktion
in scheme: travel!digital Thesaurus
related match: Keene, New York
related match: Ausable Chasm (New York)

Panorama Bluff
type: Label
in scheme: travel!digital Thesaurus

Caldera
type: Concept
narrower: Caldera de Vandama
in scheme: travel!digital Thesaurus
pref label: Caldera
definition: bdk: besondere Attraktion

Caldera de Vandama
type: Concept
pref label: Caldera de Vandama
in scheme: travel!digital Thesaurus
related: Pico de Vandama
definition: bdk: besondere Attraktion

Caldera de Vandama
type: Label
in scheme: travel!digital Thesaurus

Caldera
type: Label
in scheme: travel!digital Thesaurus

Soziale Gruppenbezeichnungen
type: Concept
top concept of: travel!digital Thesaurus
narrower: Schicht
narrower: Stand
definition: bdk: soziale Gemeinschaften z.B.: Kaste, Klasse, Adel, Sklave
narrower: Sklave
narrower: ständisch
narrower: Dynastie
narrower: Klasse
narrower: dynastisch
narrower: Geschlecht
narrower: Kaste
narrower: Bettler
notation: I.06

Schicht
type: Concept
in scheme: travel!digital Thesaurus
pref label: Schicht
definition: Duden: 2. Gesellschaftsschicht
narrower: Volksschicht

Schicht
type: Label
in scheme: travel!digital Thesaurus

Volksschicht
type: Concept
alternative label: Volksklasse
in scheme: travel!digital Thesaurus
definition: bdk: siehe Volk, Schicht
alt label: Volksklasse
related: Volk
pref label: Volksschicht

Volksklasse
type: Label
in scheme: travel!digital Thesaurus

Volk
type: Concept
narrower: Volkselement
narrower: Mischvolk
narrower: Wandervolk
narrower: Völkerschaft
alt label: Nachbarvolk
definition: Duden: 1. durch gemeinsame Kultur und Geschichte [und Sprache] verbundene große Gemeinschaft von Menschen | Meyers Großes Konversations-Lexikon 1909: Volk (Populus), ein nach Abstammung u. Sprache, Sitte und Bildung zusammengehöriger Teil der Menschheit. Es wird aber noch V. und Nation unterschieden und unter ersterm die Gesamtheit der Angehörigen eines Staates verstanden (s. Nation). Auch bezeichnet man als V. die große Menge der bürgerlichen Gesellschaft im Gegensatz zu den durch politische Stellung. Reichtum und Bildung hervorragenden Klassen. – In der Jägersprache heißt V. (Kette) die sich zusammenhaltenden Familien der Rebhühner und Wachteln. Vgl. Gesperr. | Quelle: Meyers Großes Konversations-Lexikon, Band 20. Leipzig 1909, S. 223. | Permalink: http://www.zeno.org/nid/20007659024
alt label: Volksgemeinde
narrower: Hilfsvolk
alternative label: Nachbarvolk
pref label: Volk
narrower: Volksteil
alternative label: Volksgemeinde
narrower: Grenzvolk
narrower: Mittelmeervolk
narrower: Seevolk
narrower: Urvolk
narrower: Jägervolk
in scheme: travel!digital Thesaurus
narrower: Kulturvolk
narrower: Bergvolk

Volkselement
type: Concept
related: Bevölkerungselement
in scheme: travel!digital Thesaurus
pref label: Volkselement
definition: bdk: siehe Volk

Bevölkerungselement
type: Concept
in scheme: travel!digital Thesaurus
pref label: Bevölkerungselement
definition: Duden: Bevölkerungsgruppe: größere [homogene] Gruppe innerhalb der Bevölkerung

Bevölkerungselement
type: Label
in scheme: travel!digital Thesaurus

Volkselement
type: Label
in scheme: travel!digital Thesaurus

Mischvolk
type: Concept
pref label: Mischvolk
in scheme: travel!digital Thesaurus
definition: bdk: siehe Volk

Mischvolk
type: Label
in scheme: travel!digital Thesaurus

Wandervolk
type: Concept
pref label: Wandervolk
in scheme: travel!digital Thesaurus
related: Nomade
definition: bdk: siehe Volk, Nomade

Wandervolk
type: Label
in scheme: travel!digital Thesaurus

Völkerschaft
type: Concept
definition: Duden: kleines Volk; Volksgruppe, -stamm | Meyers Großes Konversations-Lexikon 1908: Nation (lat., Völkerschaft), ein nach Abstammung, Sitte und Sprache zusammengehöriger Teil der Menschheit; Nationalität, die Zugehörigkeit zu diesem Teil. Das Wort N. wird nur in diesem Sinne, das Wort Volk sowohl in diesem Sinne als auch zur Bezeichnung der Angehörigen eines bestimmten Staates gebraucht. Man kann also deutsches Volk und deutsche N. sagen, dagegen wohl von einem österreichischen Volk, nicht aber von einer österreichischen N. sprechen. Zu beachten ist ferner, daß nach englischem und französischem Sprachgebrauch der Ausdruck N. gerade umgekehrt das Staatsvolk (die politische Nationalität), daher auch Nationalität soviel wie Staatsangehörigkeit bezeichnet, während für die N. im deutschen Sinne des Wortes, für das Naturvolk (die natürliche Nationalität), die Worte Peuple (franz.) und People (engl.) gebräuchlich sind. In dem Begriff der N. liegt das Bewußtsein der gemeinsamen Abstammung und der Zusammengehörigkeit: das Nationalgefühl. Ebendieses ist es aber, das zugleich den Gegensatz zwischen der einen und der andern N. hervortreten läßt. Kann zudem eine N. auf eine große Vergangenheit zurückblicken, oder nimmt sie unter den verschiedenen Nationen eine besonders hervorragende Stellung ein, so steigert sich das Nationalgefühl zum Nationalstolz, während sich jener Gegensatz zwischen verschiedenen Nationalitäten zuweilen bis zum Nationalhaß verschärft. Mit dem Nationalgefühl steht der nationale Selbsterhaltungstrieb im Zusammenhange; darum gilt jeder N. die Nationalfreiheit) als höchstes Gut, und die Nationalehre verbietet ihr die freiwillige Unterwerfung unter eine andre N. Aus demselben Grund ist auch jede N. auf die Erhaltung ihrer nationalen Eigentümlichkeiten bedacht, vor allem auf die der Nationalsprache, denn auf dieser beruht zumeist das Wesen der N., und sie ist es, welche die Stammesgenossen am engsten verbindet. Dazu kommt bei den Kulturvölkerschaften eine gemei…
in scheme: travel!digital Thesaurus
pref label: Völkerschaft

Völkerschaft
type: Label
in scheme: travel!digital Thesaurus

Nachbarvolk
type: Label
in scheme: travel!digital Thesaurus

Volksgemeinde
type: Label
in scheme: travel!digital Thesaurus

Hilfsvolk
type: Concept
pref label: Hilfsvolk
in scheme: travel!digital Thesaurus
definition: bdk: siehe Volk

Hilfsvolk
type: Label
in scheme: travel!digital Thesaurus

Volk
type: Label
in scheme: travel!digital Thesaurus

Volksteil
type: Concept
definition: bdk: siehe Volk
related: Bevölkerungselement
pref label: Volksteil
in scheme: travel!digital Thesaurus

Volksteil
type: Label
in scheme: travel!digital Thesaurus

Grenzvolk
type: Concept
in scheme: travel!digital Thesaurus
pref label: Grenzvolk
definition: bdk: im Grenzgebiet beheimatetes Volk

Grenzvolk
type: Label
in scheme: travel!digital Thesaurus

Mittelmeervolk
type: Concept
pref label: Mittelmeervolk
in scheme: travel!digital Thesaurus
definition: bdk: am Mittelmeer beheimatetes Volk

Mittelmeervolk
type: Label
in scheme: travel!digital Thesaurus

Seevolk
type: Concept
in scheme: travel!digital Thesaurus
definition: Duden EN: Seevolk n seafaring people (oder nation)
pref label: Seevolk

Seevolk
type: Label
in scheme: travel!digital Thesaurus

Urvolk
type: Concept
in scheme: travel!digital Thesaurus
pref label: Urvolk
definition: Duden: 1. Volk, aus dem andere Völker hervorgegangen sind | 2. Urbevölkerung

Urvolk
type: Label
in scheme: travel!digital Thesaurus

Jägervolk
type: Concept
pref label: Jägervolk
in scheme: travel!digital Thesaurus
definition: bdk: siehe Jäger, Volk
related: Jäger

Jägervolk
type: Label
in scheme: travel!digital Thesaurus

Kulturvolk
type: Concept
in scheme: travel!digital Thesaurus
definition: Duden: Volk mit hoch entwickelter Kultur
pref label: Kulturvolk

Kulturvolk
type: Label
in scheme: travel!digital Thesaurus

Bergvolk
type: Concept
alternative label: Gebirgsvolk
in scheme: travel!digital Thesaurus
definition: Duden: im Gebirge beheimatetes Volk
pref label: Bergvolk
alt label: Gebirgsvolk

Bergvolk
type: Label
in scheme: travel!digital Thesaurus

Gebirgsvolk
type: Label
in scheme: travel!digital Thesaurus

Volksschicht
type: Label
in scheme: travel!digital Thesaurus

Stand
type: Concept
narrower: Bürgerstand
narrower: Aristokratie
narrower: Mittelstand
narrower: Aristokrat
pref label: Stand
related match: Estates of the realm
definition: Duden: 5. a. Kurzform für: Familienstand | b. Kurzform für: Berufsstand | c. gegenüber anderen verhältnismäßig abgeschlossene Gruppe, Schicht in einer hierarchisch gegliederten Gesellschaft | d. Vertreter der Stände in staatlichen, politischen Körperschaften des Mittelalters und der frühen Neuzeit | Meyers Großes Konversations-Lexikon 1909: Stände, Bezeichnung für die verschiedenen Klassen von Personen, die durch Gemeinsamkeit eines Berufes verbunden sind, Berufsstände, z. B. Handwerker-, Handels-, Offiziers-, Beamtenstand. Der Berufsstand ist rechtlich von Bedeutung, soweit er ein gemeinsames Berufsrecht hat. Die sogen. Geburtsstände sind ursprünglich erblich gewordene Berufsstände. Dies trifft insbes. bei den mittelalterlichen Berufsständen (Feudalständen): Geistlichkeit, Adel, Stadtbürger, hinsichtlich der beiden letztgenannten zu. Für das heutige Recht haben sie keine Bedeutung mehr. Insbesondere ist der Adel (s. d.) kein Stand mehr, sondern eine erbliche staatliche Titularauszeichnung, mit der sich gewisse Rechtsvorzüge verbinden können. Man bezeichnet also den Gegensatz zu adlig richtigerweise nur durch die Verneinung, nicht adlig, nicht durch bürgerlich. Über S. im Sinne von Landstände s. Volksvertretung. | Quelle: Meyers Großes Konversations-Lexikon, Band 18. Leipzig 1909, S. 845. | Permalink: http://www.zeno.org/nid/20007514891
narrower: Bauernstand
narrower: Adel
in scheme: travel!digital Thesaurus
narrower: Priesterstand
narrower: Beamtenstand
narrower: Feudalherr
narrower: aristokratisch
narrower: Proletariat
narrower: adelig

Bürgerstand
type: Concept
related match: Burgess (title)
definition: bdk: siehe Bürger, Stand
in scheme: travel!digital Thesaurus
pref label: Bürgerstand
related: Bürger

Bürgerstand
type: Label
in scheme: travel!digital Thesaurus

Bürger
type: Concept
alternative label: Bürgerschaft
definition: Duden: 1. a. Angehöriger eines Staates | b. Einwohner einer Gemeinde | 2. Angehöriger des bestimmten Traditionen verhafteten Mittelstandes | Meyers Großes Konversations-Lexikon 1905: Bürger, Angehöriger eines Gemeinwesens, insbes. Staatsbürger, Gemeindebürger. Man spricht auch von akademischen Bürgern, d. h. Studierenden einer Hochschule. Der Ursprung des heutigen Bürgertums fällt in das 9. Jahrh., wo man die größte Sicherheit in befestigten Ortschaften erblickte. Die Verteidiger der befestigten Orte (castra) nannte man, wie die Dienstmannen der Burgen, B., burgenses. Später gelangten die durch ihre Mauern gesicherten Städtebewohner zu einer dem bisher allein mächtigen Adel gegenüber selbständigen Macht. Seit dieser Zeit war V. Ehrenname jedes Städtebewohners, der an den städtischen Rechten Anteil hatte. Sobald die Städtebewohner zu dieser Bedeutung gelangt waren, bildeten sich unter ihnen verschiedene Klassen. Zur ersten Klasse erhoben sich die sogen. vollberechtigten Einwohner, die Ratsmänner, Handelsherren und Mitglieder der höhern Zünfte. Ihnen, den Bürgern, standen alle Städtebewohner, deren Erwerbszweig das Recht der Zunftfähigkeit noch nicht erworben hatte, als bloße Handwerker gegenüber. Aber auch noch dann, als sich diese zurückgesetzten Gewerbe nicht nur das Zunftrecht, sondern durch offenen Aufruhr gegen die ratsfähigen Geschlechter im Mittelalter auch die Ratsfähigkeit verschafft hatten, machten sich, obwohl alle berechtigten Mitglieder einer Stadtgemeinde B. hießen, gleichwohl noch engere Bedeutungen des Wortes B. geltend. Zunächst unterschied man an einigen Orten B. als Hauseigentümer von den Handwerkern und zog zwischen den Gerechtsamen beider strenge Grenzen. Noch enger wurde der Begriff B. durch die Gegensätze der Schutzverwandten, Beisitzer, Beisassen oder bloßen Einwohner. Solche Schutzverwandte galten als unvollkommene B., und der eigentliche Charakter des Bürgers kam nur den vollberechtigten Mitgliedern der Stadtgemeinde zu. Diese Schutzverwandt…
alt label: Bürgerschaft
pref label: Bürger
in scheme: travel!digital Thesaurus

Bürgerschaft
type: Label
in scheme: travel!digital Thesaurus

Bürger
type: Label
in scheme: travel!digital Thesaurus

Aristokratie
type: Concept
alternative label: Aristocratie
pref label: Aristokratie
definition: Duden: 1. a. Staatsform, in der die Herrschaft im Besitz einer privilegierten sozialen Gruppe (Adel, Oberschicht) ist; Adelsherrschaft | b. Staat, Gemeinwesen, in dem eine Aristokratie besteht | 2. adlige Oberschicht, Adel[sstand] | Meyers Großes Konversations-Lexikon 1905: Aristokratie (griech., »Herrschaft der Vornehmsten«), im staatsphilosophischen System des Aristoteles diejenige Staatsform, nach der eine bevorzugte Klasse der Staatsangehörigen im Besitz der Staatsgewalt ist. Aristoteles teilt die Beherrschungsformen ein in das Königtum (Monarchie), die A. und die Demokratie, je nachdem die Staatsgewalt in der Hand eines Einzelnen sich befindet oder einer gewissen bevorzugten Klasse oder der Gesamtheit des Volkes zusteht. Mit Rücksicht auf die Staatsverhältnisse der Neuzeit pflegt man jedoch meist nur zwei Grundformen der Staatsverfassung zu unterscheiden, die monarchische und die republikanische, je nachdem die Staatsgewalt von einem Einzelnen oder von der Gesamtheit der Staatsangehörigen durch deren Organe ausgeübt wird. Bei der Republik wied dann allerdings wieder zwischen A. und Demokratie unterschieden, insofern entweder eine gewisse Klasse von Staatsbürgern die Zügel des Staates in Händen hat oder die Gesamtheit des Volkes ohne Standesunterschied als Souverän gedacht wird. Die Neuzeit ist dem aristokratischen System nicht günstig. Keine der bestehenden Republiken hat eine aristokratische Staatsform, während diese im Altertum vielfach vertreten war. Wie in Griechenland Athen als Muster der Demokratie erschien, so wurde die A. besonders durch Sparta dargestellt. Auch die altrömische Republik mit ihrer Patrizierherrschaft war eine A. Ebenso hat man das frühere Deutsche Reich in der Zeit des Verfalls der kaiserlichen Macht nicht mit Unrecht als eine A. bezeichnet. Auch in Venedig hat sich lange Zeit hindurch die aristokratische Staatsform erhalten. Wenn aber auch der Begriff der A. heutzutage als Staatsform nicht meh-von praktische. Bedeutung ist, so speicht m…
related: Adel
narrower: Geld-Aristokratie
narrower: Geburts-Aristokratie
in scheme: travel!digital Thesaurus
alt label: Aristocratie

Aristokratie
type: Label
hasVariant: Aristocratie
in scheme: travel!digital Thesaurus

Aristocratie
type: Label
isVariantOf: Aristokratie
in scheme: travel!digital Thesaurus

Geld-Aristokratie
type: Concept
definition: bdk: siehe Aristokratie
pref label: Geld-Aristokratie
in scheme: travel!digital Thesaurus

Geld-Aristokratie
type: Label
in scheme: travel!digital Thesaurus

Geburts-Aristokratie
type: Concept
definition: bdk: siehe Aristokratie
pref label: Geburts-Aristokratie
in scheme: travel!digital Thesaurus

Geburts-Aristokratie
type: Label
in scheme: travel!digital Thesaurus

Mittelstand
type: Concept
in scheme: travel!digital Thesaurus
pref label: Mittelstand
definition: Duden: 1. (Wirtschaft) Gesamtheit der kleinen und mittleren Unternehmen sowie der Selbstständigen | 2. Mittelschicht | Pierer's Universal-Lexikon 1860: Mittelstand, Inbegriff der Individuen, welche weder einerseits zu dem Adel, dem höhern Offiziercorps, der höhern Beamtenklasse, noch anderseits zu der niedern Volksklasse sich zählen, also Beamte (die nicht Minister, Geheime Räthe, Präsidenten u. Directoren sind), Arzte, Künstler, Gelehrte, Kaufleute, Fabrikanten u.a. durch Bildung u. Vermögen hervorragende Bürger; vgl. Gesellschaft B) b) cc). | Quelle: Pierer's Universal-Lexikon, Band 11. Altenburg 1860, S. 332. | Permalink: http://www.zeno.org/nid/2001045103X

Mittelstand
type: Label
in scheme: travel!digital Thesaurus

Aristokrat
type: Concept
related: Aristokratie
related: Adel
pref label: Aristokrat
in scheme: travel!digital Thesaurus
definition: Duden: Angehöriger der Aristokratie, Adliger

Aristokrat
type: Label
in scheme: travel!digital Thesaurus

Stand
type: Label
in scheme: travel!digital Thesaurus

Bauernstand
type: Concept
in scheme: travel!digital Thesaurus
pref label: Bauernstand
related: Bauer
definition: bdk: siehe Bauer, Stand | Duden: Stand der Bauern

Bauernstand
type: Label
in scheme: travel!digital Thesaurus

Bauer
type: Concept
alternative label: Landmann
alt label: Landwirt
pref label: Bauer
narrower: Bauernweib
in scheme: travel!digital Thesaurus
narrower: Ackerbauer
narrower: Viehzüchter
pref label: fellahîn
definition: Duden: 1. a. jemand, der berufsmäßig Landwirtschaft betreibt; Landwirt | Meyers Großes Konversations-Lexikon 1905: Bauer, im Gegensatze zum Städter jeder Landbewohner, der sich im Hauptberuf mit Landwirtschaft beschäftigt. Im engern Sinn ist B. nur ein solcher kleiner Landwirt, der auf eignem Grund und Boden wirtschaftet, also der Bauerngutsbesitzer im Gegensatze zum Pachter und zum landwirtschaftlichen Arbeiter oder Dienstboten. Vom Großgrundbesitzer unterscheidet er sich durch den Umfang des Gutes. Die frühere Unterscheidung zwischen Rittergut und Bauerngut, die sich darauf gründete, daß der Besitz eines Rittergutes ein Vorrecht des Adels war und damit gewisse Vorrechte verbunden waren, ist durch die moderne Gesetzgebung beseitigt, wenn sich auch noch manche privatrechtliche Eigentümlichkeiten der Bauerngüter bis in die neueste Zeit erhalten haben (s. Bauerngut). Nach der Größe ihres Besitzes werden in den verschiedenen Gegenden unterschieden: Vollbauern (Vollspänner, Vollmeier, Vollerben, Vollhöfner, Besitzer ganzer Höfe, Hofbauern), Dreiviertelbauern (Hüfnermeier, Dreiviertelspänner), Halbbauern (Halbspänner, Halbhufner, Huber. Halbmeier), Viertelhofsbesitzer oder Lehner, Eigenlehner, Köter (Katen, Kotsassen, Kossäten, von »Kot« oder »Kat«, kleiner Hof), die nur ein Haus oder etwas Ackerland besitzen, endlich Hintersiedler (Hintersitzer, Hintersassen, Kleinhäusler, Tropfhäusler), die nur mit einem Haus und etwas Grundbesitz angesessen sind. Andre Bezeichnungen erklären sich aus dem frühern Abhängigkeitsverhältnis der betreffenden Bauern, wie Kirchen-, Kloster-, Stifts-, Pfarr-, Amts-, Patrimonialbauern u. dgl. [...] | Quelle: Meyers Großes Konversations-Lexikon, Band 2. Leipzig 1905, S. 457-459. | Permalink: http://www.zeno.org/nid/20006300022
preferred label: fellahîn @ar
narrower: Haurânbauer
alt label: Landmann
narrower: Weinbauer
alternative label: Landwirt

Landwirt
type: Label
in scheme: travel!digital Thesaurus

Bauer
type: Label
in scheme: travel!digital Thesaurus
hasTranslation: fellahîn

fellahîn
type: Label
in scheme: travel!digital Thesaurus
isTranslationOf: Bauer

Bauernweib
type: Concept
definition: bdk: siehe Bauer | Duden: Weib: 1. a. (veraltend) Frau als Geschlechtswesen im Unterschied zum Mann | b. (umgangssprachlich) [junge] Frau als Gegenstand sexueller Begierde, als [potenzielle] Geschlechtspartnerin | c. (abwertend) unangenehme weibliche Person, Frau | 2. (veraltet) Ehefrau | Meyers Großes Konversations-Lexikon 1909: Weib (Frau), eine erwachsene Person weiblichen Geschlechts. Über die Unterschiede zwischen Mann und W. hinsichtlich der Körperkonstitution s. Geschlechtseigentümlichkeiten. Die Stellung und Behandlung des Weibes richtet sich bei den verschiedenen Völkern nach den Begriffen des stärkern Geschlechts von ihrem Werte. Bei den üppigen Orientalen wird die Frau meist nur als Luftwerkzeug gefangen gehalten, bei den meisten Naturvölkern ist sie Lasttier, dem die härtesten Arbeiten aufgebürdet werden. Im allgemeinen pflegt die Haltung der Frauen um so unwürdiger zu sein, je unkultivierter ein Volk ist; bei den farbigen Rassen sind sie fast nur Sklavinnen. Dem Neger gelten sie als arbeitende Haustiere, und fast noch schlimmer ist ihr Zustand bei den Australiern, wo sie gewöhnlich schon im unreifen Alter gekauft werden und lebenslang die brutalen Mißhandlungen des Mannes zu erdulden haben. Einige Völker, z. B. die Samojeden, halten das weibliche Geschlecht überhaupt für »unrein«; es nimmt an den religiösen Zeremonien keinen Anteil; die Frauen dürfen nicht mit dem Mann essen, nicht durch dieselbe Tür ein und aus gehen. Bei fast allen Naturvölkern, auch selbst bei vielen halbzivilisierten Völkern, gilt das W. zur Zeit seiner geschlechtlichen Funktionen als »unrein«. Das Recht über Leben und Tod der Frau steht bei erstern meist unbeschränkt dem Manne zu, der seine Herrschaft fast ausnahmslos in härtester Art ausübt. Sehr viele unzivilisierte und halbzivilisierte Völker, z. B. die Eingebornen Australiens, Neuguineas, die Fidschiinsulaner, die Aino auf den Kurilen und die Feuerländer, huldigen dem Frauenraub (s. d.). Wo dagegen das W. durch Kauf (s. Frauenk…
pref label: Bauernweib
in scheme: travel!digital Thesaurus

Bauernweib
type: Label
in scheme: travel!digital Thesaurus

Ackerbauer
type: Concept
alternative label: Ackerbautreibende
definition: Duden: 1. Bauer, Landwirt, der insbesondere Ackerbau betreibt | 2. <meist im Plural> (Völkerkunde) jemand, der Ackerbau treibt, dessen Existenzgrundlage der Ackerbau ist | Meyers Großes Konversations-Lexikon 1905: Ackerbau, Teil der Landwirtschaft, der sich auf die Nutzbarmachung des Grund und Bodens durch Hervorbringung pflanzlicher Rohstoffe bezieht. Nur die Pflanze vermag die unorganischen Stoffe des Bodens für sich und zur Ernährung der Tiere nutzbar zu machen. Die Lehre vom A. (Agronomie) stützt sich daher auf die Kenntnis des Pflanzen lebens (Phytobiologie) und nimmt ihren Ausgang von der Erörterung der Wachstumsbedingungen, d.h. Boden und Atmosphäre, welche die Stoffe und Kräfte für die Entwickelung der Pflanzen bieten. Sie erörtert die Kulturmaßregeln zur dauernden (Melioration) oder zeitweiligen (Bodenbearbeitung, Düngung) Verbesserung des Pflanzenstandortes, hat schließlich die Kulturverfahren anzugeben, die während des Keimens, Wachsens und Reisens der Kulturpflanzen zur Ausführung gelangen, um unter den gegebenen oder verbesserten Wachstumsbedingungen von der Bodenfläche den möglichst hohen Ertrag von Pflanzenprodukten zu erzielen. Die Lehre vom A. im allgemeinen wird auch als allgemeiner Pflanzenbau von dem besondern Pflanzenbau (s. d.) unterschieden. Vgl. Krafft, Ackerbaulehre (7. Aufl., Berl. 1899); Rosenberg-Lipinsky, Der praktische A. (7. Aufl., Bresl. 1890, 2 Bde.). S. auch Landwirtschaft. | Quelle: Meyers Großes Konversations-Lexikon, Band 1. Leipzig 1905, S. 84. | Permalink: http://www.zeno.org/nid/20006191932
pref label: Ackerbauer
alt label: Ackerbautreibende
in scheme: travel!digital Thesaurus

Ackerbauer
type: Label
in scheme: travel!digital Thesaurus

Ackerbautreibende
type: Label
in scheme: travel!digital Thesaurus

Viehzüchter
type: Concept
definition: Duden: jemand, der Viehzucht betreibt | Duden: Viehzucht: planmäßige Aufzucht von Vieh (1) unter wirtschaftlichem Aspekt | Meyers Großes Konversations-Lexikon 1909: Viehzucht (Tierzucht), die von bestimmten Grundsätzen geleitete und sich der Ziele bewußte Paarung der landwirtschaftlichen Haustiere. Sie sucht in der Nachkommenschaft (Nachzucht) Tiere (Vieh) zu produzieren, die das höchste Maß der Nutzbarkeit überhaupt oder für bestimmte zeitgemäße Verhältnisse besitzen. Die Vermehrung der Nutzungseigenschaften wird vornehmlich bei Gewinnung von Nutztieren und außerdem Berücksichtigung der Schönheit und Harmonie der Form nebst Vererbungsfähigkeit bei Gewinnung von Zuchttieren angestrebt. Letzteres höheres Ziel beansprucht viel mehr Aufwand von züchterischer Intelligenz und von Kapital. Die Züchtung gewährt nur eine Grundlage, auf der Haltung und Fütterung (s. Futter und Fütterung) weiterzubauen haben, wenn das Ziel der Tierzucht erreicht werden soll. Im besondern züchtet man das Pferd als Arbeitstier, das Rind als Erzeuger von Milch, Fleisch und Fett und als Arbeitstier, das Schaf als Erzeuger von Wolle, Fleisch und Fett, das Schwein als Erzeuger von Fleisch und Fett. Jedes der genannten Haustiere stellt eine besondere Art dar. Zu einer Art gehören die Tiere, die sich untereinander fruchtbar paaren und deren Nachkommen bedingungslos fruchtbar sind. Zwischen einigen Arten, z. B. Pferd und Esel, ist eine Befruchtung möglich; aber die Nachkommen (Bastarde) sind unfruchtbar. Ausnahmsweise ist der Bastard bei der Anpaarung, d. h. bei der Begattung mit einem Tier der Stammarten, fruchtbar. Zu einer Rasse stellt der Züchter alle Tiere einer Art, die sich von andern Tieren derselben Art durch charakteristische Merkmale unterscheiden und diese Charakteristika auch dann vererben, wenn die Tiere unter andre äußere Einflüsse kommen, als in ihrer Heimat bestehen. Die Rasse behält die Charaktere nur so lange, als die Verhältnisse nicht mächtig genug sind, sie zu ändern. Die Rassen …
in scheme: travel!digital Thesaurus
pref label: Viehzüchter

Viehzüchter
type: Label
in scheme: travel!digital Thesaurus

Haurânbauer
type: Concept
related: Haurânier
in scheme: travel!digital Thesaurus
pref label: Haurânbauer
definition: bdk: siehe Haurânier, Bauer

Haurânier
type: Concept
related match: Hauran
pref label: Haurânier
in scheme: travel!digital Thesaurus
definition: bdk: Einwohnerbezeichnzung zu Hauran | Meyers Großes Konversations-Lexikon 1907: Hauran (im Altertum Auranitis), vulkanische, sehr fruchtbare Hochebene in Syrien (s. Karte »Palästina«), an den Quellen des Jarmuk (Scheriat el Menadhire), mit der Hauptstadt Bostra (jetzt Bozra). Das Gebiet ist baumlos und nur von einigen, meist trocknen Wadis durchzogen. Nordöstlich davon erhebt sich der aus Dolerit und blasigen Schlacken bestehende Dschebel H. im Tell el Dschena bis 1839 m. Der Bezirk H. ist 21,300 qkm groß mit 136,200 Einw. Das Land wurde durch die Reisen Grahams, Wetzsteins, Palmers, Drakes und Stübels näher bekannt. Die Ost- und Südflanke des H. ist seit alters als die Kornkammer Syriens berühmt. Man zählt dort gegen 300 verödete Städte und Dörfer, dagegen nur wenige bewohnte Ortschaften, darunter mehrere jüdische Ackerbaukolonien. Die Getreideausfuhr beträgt jährlich 80–100,000 Ton., außerdem wird noch eine gleiche Menge gewonnen. Seit 1893 besitzt der H. durch die Bahn Damaskus-Muzerib (103 km) Verbindung mit Beirût. Geplant ist eine Bahn nach Haifa. Vgl. v. Oppenheim, Vom Mittelmeer zum Persischen Golf durch H. etc. (Berl. 1899, 2 Bde.). | Quelle: Meyers Großes Konversations-Lexikon, Band 8. Leipzig 1907, S. 882. | Permalink: http://www.zeno.org/nid/20006749291

Haurânier
type: Label
in scheme: travel!digital Thesaurus

Haurânbauer
type: Label
in scheme: travel!digital Thesaurus

Landmann
type: Label
in scheme: travel!digital Thesaurus

Weinbauer
type: Concept
alternative label: Winzer
definition: Duden: Winzer | Duden: Winzer: jemand, der Wein anbaut, aus den Trauben Wein herstellt und verkauft
pref label: Weinbauer
in scheme: travel!digital Thesaurus
alt label: Winzer

Weinbauer
type: Label
in scheme: travel!digital Thesaurus

Winzer
type: Label
in scheme: travel!digital Thesaurus

Priesterstand
type: Concept
in scheme: travel!digital Thesaurus
related: Priester
definition: bdk: siehe Priester, Stand
pref label: Priesterstand

Priesterstand
type: Label
in scheme: travel!digital Thesaurus

Beamtenstand
type: Concept
definition: bdk: siehe Beamte, Stand
in scheme: travel!digital Thesaurus
pref label: Beamtenstand
related: Beamte

Beamtenstand
type: Label
in scheme: travel!digital Thesaurus

Beamte
type: Concept
narrower: Bundesbeamte
narrower: Regierungsbeamte
narrower: Zollbeamte
related match: Civil service
in scheme: travel!digital Thesaurus
narrower: Aufsichtsbeamte
narrower: Konsularbeamte
narrower: Subalternbeamte
narrower: Staatsbeamte
narrower: Verwaltungsbeamte
narrower: Beamte der öffentlichen Wohltätigkeit
narrower: Eisenbahnbeamte
narrower: Postbeamte
narrower: Telegraphenbeamte
narrower: Civilbeamte
narrower: Hofbeamte
definition: Duden: Beamter: Person, die im öffentlichen Dienst (bei Bund, Land, Gemeinde u. Ä.) oder im Dienst einer Körperschaft des öffentlichen Rechts steht und ein bestimmtes Rechtsverhältnis ihrem Dienstherrn gegenüber hat | Meyers Großes Konversations-Lexikon 1905: Beamter, im weitern Sinne jeder, der gegen Gehalt im Dienst eines Gemeinwesens oder einer sonstigen Körperschaft oder auch eines Privaten, eines Fabrikbesitzers, einer Bank etc. tätig und ständig beschäftigt ist. Im engern Sinn aber versteht man unter Beamten die Inhaber eines öffentlichen Amtes (Hof-, Staats-, Kirchen- und Gemeindebeamten). Die Beamten des Deutschen Reiches heißen Reichsbeamte (s. d.). Das Reichsstrafgesetzbuch (§ 359) versteht unter Beamten alle im Dienste des Reiches oder in unmittelbarem oder mittelbarem Dienst eines Bundesstaates auf Lebenszeit, auf Zeit oder nur vorläufig angestellte Personen, ohne Unterschied, ob sie einen Diensteid geleistet haben oder nicht, desgleichen Notare, nicht aber Advokaten und Anwalte. Dieser Begriff ist für die Beurteilung von Amtsverbrechen (s. d.) von Wichtigkeit. Vgl. Amt und Staatsdienst. | Quelle: Meyers Großes Konversations-Lexikon, Band 2. Leipzig 1905, S. 520. | Permalink: http://www.zeno.org/nid/20006303684
narrower: Beamte des öffentlichen Dienstes
pref label: Beamte
narrower: Mauthbeamte
narrower: Hotelbeamte

Bundesbeamte
type: Concept
definition: bdk: siehe Beamte
pref label: Bundesbeamte
in scheme: travel!digital Thesaurus

Bundesbeamte
type: Label
in scheme: travel!digital Thesaurus

Regierungsbeamte
type: Concept
in scheme: travel!digital Thesaurus
pref label: Regierungsbeamte
definition: Duden: in der Verwaltung einer Regierung (2) tätiger Beamter

Regierungsbeamte
type: Label
in scheme: travel!digital Thesaurus

Zollbeamte
type: Concept
related match: Customs
definition: Duden: Beamter der Zollbehörde | Duden: Zoll: 1. a. Abgabe, die für bestimmte Waren beim Transport über die Grenze zu zahlen ist | b. (früher) Abgabe für die Benutzung bestimmter Straßen, Brücken o. Ä. | 2. Behörde, die den Zoll erhebt | Meyers Großes Konversations-Lexikon 1909: Zölle (griech. télos, latein. telonea, engl. toll; Mauten, v. mittellat. muta) sind Abgaben, die teils aus finanz- teils aus handelspolitischen Gründen erhoben werden. Als Mittel der Finanzpolitik sind sie uralt. Im deutschen Mittelalter hatten sie vielfach den Charakter von Gebühren, d. h. von Abgaben[977] für die Benutzung gewisser dem Verkehr dienender Einrichtungen, so die Wege-, Brücken- und ähnliche Zölle, ursprünglich wohl auch die Marktzölle, als Abgaben für den Rechtsschutz, für die Benutzung der städtischen Hallen, Kaufhäuser, Plätze etc. Sie hatten also ursprünglich einen echt lokalen Charakter als private oder grundherrliche Abgaben, die als Entgelt für gewährte Unterstützung und Geleit, für Unterhaltung von Brücken und Straßen etc. dienten und nach der Lex Salica auch nur als solches erhoben werden durften. Rein fiskalisch waren von jeher die Abgaben, die beim Überschreiten gewisser Grenzlinien, namentlich von Schiffen beim Passieren eines Gebietes (Transit- oder Passierzölle, Stromzölle) erhoben wurden. Eigentliche Grenzzölle mit teils fiskalischer, teils wirtschaftspolitischer Wirkung sind die von den Städten auf fremde Waren eingeführten Aufschläge. Aber auch die übrigen Z., namentlich die Marktzölle, erhielten im Laufe der Zeit immer mehr fiskalischen Charakter. Das Deutsche Reich war solchergestalt mit einer Menge von Zollstätten bedeckt. Hieraus entwickelte sich ein eigentümliches Zollrecht als Inbegriff mannigfaltiger, vielfach freilich usurpierter Einzelrechte, auf Grund deren häufig auch Z. ohne jedwede Gegenleistung erhoben wurden. Das Zollregal des deutschen Kaisers umfaßte die Beaufsichtigung und Überwachung des Zollwesens zur Verhütung ungerecht erhobener Z., das Re…
pref label: Zollbeamte
in scheme: travel!digital Thesaurus
pref label: gumruktschi
preferred label: gumruktschi @ar

Zollbeamte
type: Label
in scheme: travel!digital Thesaurus
hasTranslation: gumruktschi

gumruktschi
type: Label
in scheme: travel!digital Thesaurus
isTranslationOf: Zollbeamte

Aufsichtsbeamte
type: Concept
in scheme: travel!digital Thesaurus
related: Aufseher
pref label: Aufsichtsbeamte
definition: Duden: Aufsichtsbeamter: Beamter, der Aufsicht führt | Aufsichtsbeamtin: weibliche Form zu Aufsichtsbeamter

Aufseher
type: Concept
preferred label: guardian @en
pref label: guardian
in scheme: travel!digital Thesaurus
narrower: Moscheeaufseher
pref label: Aufseher
definition: Duden: jemand, der Aufsicht zu führen hat | Duden: Aufsicht: 1. das Achten darauf, dass bestimmte Vorschriften eingehalten werden, dass nichts passiert | 2. Aufsicht führende Person, Stelle

guardian
type: Label
isTranslationOf: Aufseher
in scheme: travel!digital Thesaurus

Aufseher
type: Label
hasTranslation: guardian
in scheme: travel!digital Thesaurus

Moscheeaufseher
type: Concept
definition: bdk: siehe Aufseher
pref label: Moscheeaufseher
in scheme: travel!digital Thesaurus
alt label: Moscheewächter
alternative label: Moscheewächter

Moscheeaufseher
type: Label
in scheme: travel!digital Thesaurus

Moscheewächter
type: Label
in scheme: travel!digital Thesaurus

Aufsichtsbeamte
type: Label
in scheme: travel!digital Thesaurus

Konsularbeamte
type: Concept
definition: bdk: siehe Beamte, Konsul | Duden: Beamter eines Konsulats (2) | Duden: Konsulat: 1. [lateinisch consulatus = Konsulamt, -würde] (Geschichte) Amt[szeit] eines Konsuls (1) | 2. Dienststelle eines Konsuls (2)
in scheme: travel!digital Thesaurus
pref label: Konsularbeamte

Konsularbeamte
type: Label
in scheme: travel!digital Thesaurus

Subalternbeamte
type: Concept
in scheme: travel!digital Thesaurus
pref label: Subalternbeamte
definition: bdk: siehe Beamte | Duden: subaltern: 1. a. nur einen untergeordneten Rang einnehmend, nur beschränkte Entscheidungsbefugnisse habend

Subalternbeamte
type: Label
in scheme: travel!digital Thesaurus

Staatsbeamte
type: Concept
definition: bdk: siehe Beamte
pref label: Staatsbeamte
in scheme: travel!digital Thesaurus

Staatsbeamte
type: Label
in scheme: travel!digital Thesaurus

Verwaltungsbeamte
type: Concept
definition: bdk: siehe Beamte | Duden: jemand, der als Beamter in einer Verwaltung (2a) arbeitet
pref label: Verwaltungsbeamte
in scheme: travel!digital Thesaurus

Verwaltungsbeamte
type: Label
in scheme: travel!digital Thesaurus

Beamte der öffentlichen Wohltätigkeit
type: Concept
in scheme: travel!digital Thesaurus
definition: bdk: siehe Beamte
preferred label: commissioner of public charity @en
comment: Nordamerika 1893: nur englisch
pref label: Beamte der öffentlichen Wohltätigkeit
pref label: commissioner of public charity

Beamte der öffentlichen Wohltätigkeit
type: Label
hasTranslation: commissioner of public charity
in scheme: travel!digital Thesaurus

commissioner of public charity
type: Label
isTranslationOf: Beamte der öffentlichen Wohltätigkeit
in scheme: travel!digital Thesaurus

Eisenbahnbeamte
type: Concept
definition: bdk: siehe Beamte
pref label: Eisenbahnbeamte
in scheme: travel!digital Thesaurus

Eisenbahnbeamte
type: Label
in scheme: travel!digital Thesaurus

Postbeamte
type: Concept
pref label: Postbeamte
in scheme: travel!digital Thesaurus
definition: bdk: siehe Beamte

Postbeamte
type: Label
in scheme: travel!digital Thesaurus

Telegraphenbeamte
type: Concept
definition: bdk: siehe Beamte | Duden: Telegraf, Telegraph: Einrichtung zur Übermittlung von Nachrichten durch elektrische Signale
in scheme: travel!digital Thesaurus
pref label: Telegraphenbeamte

Telegraphenbeamte
type: Label
in scheme: travel!digital Thesaurus

Civilbeamte
type: Concept
definition: bdk: siehe Beamte
pref label: Civilbeamte
in scheme: travel!digital Thesaurus

Civilbeamte
type: Label
in scheme: travel!digital Thesaurus

Hofbeamte
type: Concept
pref label: Hofbeamte
in scheme: travel!digital Thesaurus
definition: bdk: siehe Beamte | Duden: Hof: 3. a. Sitz eines regierenden Fürsten, Herrschers | b. Gesamtheit der zur Umgebung, zum Gefolge eines Fürsten gehörenden Personen

Hofbeamte
type: Label
in scheme: travel!digital Thesaurus

Beamte des öffentlichen Dienstes
type: Concept
comment: Nordamerika 1893: nur englisch
in scheme: travel!digital Thesaurus
pref label: civil service commissioner
pref label: Beamte des öffentlichen Dienstes
preferred label: civil service commissioner @en
definition: bdk: siehe Beamte

civil service commissioner
type: Label
isTranslationOf: Beamte des öffentlichen Dienstes
in scheme: travel!digital Thesaurus

Beamte des öffentlichen Dienstes
type: Label
hasTranslation: civil service commissioner
in scheme: travel!digital Thesaurus

Beamte
type: Label
in scheme: travel!digital Thesaurus

Mauthbeamte
type: Concept
definition: bdk: siehe Beamte | Duden: Maut: 1. Straßen-, Brückenzoll | 2. (regional, besonders österreichisch) Dienststelle, auf der eine Maut kassiert wird | Meyers Großes Konversations-Lexikon 1909: Wegegeld (Chausseegeld, Maut), für Benutzung von Wegen, insbes. Chausseen und Brücken,[456] erhobene Abgabe. Im Mittelalter kam es meist vermischt mit Geleitsabgaben und Zöllen vor. Insbesondere in Deutschland bildeten die Wege eine Quelle finanzieller Ausbeutung, woraus die heute veralteten Begriffe des Wegezolles und des Wegeregals entstanden. Mit weiterer Entwickelung des Verkehrs tritt jedoch der finanzielle Gesichtspunkt mehr in den Hintergrund. Bau und Unterhaltung der Wege wird mehr in der Art Gegenstand öffentlicher Fürsorge, daß das W. als Gebühr erhoben wird und nur einen Teil der Kosten deckt. Nun ist aber die Erhebung des Wegegeldes beschwerlich und sehr kostspielig. Sie belästigt und verzögert den Verkehr, ohne gerade einen Schutz gegen zwecklose, unwirtschaftliche Benutzungen zu bilden. Mit Rücksicht hierauf sowie unter Würdigung der großen Bedeutung, welche die Landstraßen ohndies für die Gesamtheit haben, hat man die Schlagbäume, welche die Erhebung ermöglichen und erleichtern sollten, in den meisten Kulturländern beseitigt und das W. aufgehoben, so in Bayern und Württemberg (im innern Verkehr) 1828, in Baden 1831, in Kurhessen 1865, in Preußen 1875, in Frankreich bereits seit 1806; nur seitens der Gemeinden (»Pflasterzölle« in süddeutschen Städten) wird noch häufig ein W. erhoben. Dagegen besteht in England noch eine ausgedehnte Erhebung von Chausseegeldern. Brückengelder kommen auch heute noch in größerm Umfang vor. Gegen deren Erhebung lassen sich nicht alle Gründe vorführen, die gegen das W. sprechen. Doch untersagt z. B. ein französisches Gesetz vom 30. Juli 1880 auch künftig, Brücken unter Bedingungen zu bauen, nach denen dem Unternehmer von dem die Brücke benutzenden Publikum eine direkte Vergütung gewährt wird, und verlangt Ablösung derartiger Berechtigung…
in scheme: travel!digital Thesaurus
pref label: Mauthbeamte
related match: Road pricing

Mauthbeamte
type: Label
in scheme: travel!digital Thesaurus

Hotelbeamte
type: Concept
in scheme: travel!digital Thesaurus
pref label: Hotelbeamte
definition: bdk: siehe Beamte

Hotelbeamte
type: Label
in scheme: travel!digital Thesaurus

Feudalherr
type: Concept
related match: Feudalism
definition: Duden: Vertreter der herrschenden Oberschicht in einem Feudalstaat | Duden: 1. auf dem Lehnsrecht aufgebaute Wirtschafts- und Gesellschaftsform, in der alle Herrschaftsfunktionen von der über den Grundbesitz verfügenden aristokratischen Oberschicht ausgeübt werden | 2. a. System des Lehnswesens im mittelalterlichen Europa | b. Zeit des Feudalismus | Meyers Großes Konversations-Lexikon 1908: Lehnswesen (Feudal-, Benefizialwesen). Man versteht unter Lehn oder Lehen (Lehnrecht, lat. Feudum, Feodum, Beneficium) das ausgedehnteste erbliche Nutzungsrecht an einer fremden Sache, das sich auf eine Verleihung seitens des Eigentümers gründet, die zugleich zwischen diesem und dem Berechtigten das Verhältnis wechselseitiger Treue hervorruft; auch diese Sache selbst, zumeist ein Grundstück oder ein Komplex von Grundstücken, wird Lehn (Lehnsgut) genannt. Der betreffende Eigentümer ist der Lehnsherr (Lehngeber, dominus feudi, senior), der Berechtigte der Vasall (vassus, vasallus) oder Lehnsmann. Sprachlich hängt der Ausdruck »Lehn« mit »leihen« zusammen, bedeutet also soviel wie geliehenes Gut; über das Wort Feudum (Feodum) s. d. Den Gegensatz zum Lehn bildet das freie Eigentum, Allodium (s. d.). Die dem Vasallen zustehende Berechtigung nähert sich tatsächlich dem Eigentum so sehr, daß man dieselbe geradezu als nutzbares Eigentum (dominium utile) u. das Recht des eigentlichen Eigentümers als Obereigentum (dominium directum) bezeichnet. Die Rechtsgrundsätze über das L. bilden das Lehnrecht im objektiven Sinne. | Das L. ist hervorgegangen aus der Verschmelzung zweier Rechtsinstitute wesentlich germanischen Ursprungs, des Benefizialwesens, der Beleihung (beneficium) mit Kirchengütern, und der Vasallität, die aus der germanischen Gefolgschaft (s. d.) hervorgegangen ist. Durch die Verbindung von Benefizialwesen und Vasallität entstand das mittelalterliche Lehn als ein mit der Verpflichtung zu vasallischer Treue und vasallischen Diensten verliehenes Benefizium. Seit dem 10. Jahrh. wurde…
in scheme: travel!digital Thesaurus
pref label: Feudalherr
related: Feudaladel

Feudalherr
type: Label
in scheme: travel!digital Thesaurus

aristokratisch
type: Concept
definition: Duden: 1. die Aristokratie betreffend, ihr zugehörend, entsprechend, von ihr stammend | 2. adlig
related: adelig
in scheme: travel!digital Thesaurus
pref label: aristokratisch
related: Aristokratie

adelig
type: Concept
alternative label: hochadelig
alt label: hochadelig
definition: Duden: 1. a. den Adel betreffend, ihm gemäß | b. dem Adel angehörend
in scheme: travel!digital Thesaurus
pref label: adelig
related: Adel

hochadelig
type: Label
in scheme: travel!digital Thesaurus

adelig
type: Label
in scheme: travel!digital Thesaurus

aristokratisch
type: Label
in scheme: travel!digital Thesaurus

Proletariat
type: Concept
pref label: Proletariat
in scheme: travel!digital Thesaurus
definition: Duden: 1. (marxistisch) in einer kapitalistischen Gesellschaft Klasse der abhängig Beschäftigten (die keine eigenen Produktionsmittel besitzen) | 2. Klasse der ärmsten Bürger im antiken Rom

Proletariat
type: Label
in scheme: travel!digital Thesaurus

Sklave
type: Concept
definition: Duden: 1. (besonders früher) jemand, der in völliger wirtschaftlicher und rechtlicher Abhängigkeit von einem anderen Menschen als dessen Eigentum lebt | Meyers Großes Konversations-Lexikon 1909: Sklaverei, der Zustand eines Menschen, der seiner persönlichen Freiheit beraubt ist, als Sache behandelt wird und als solche (Sklave) im Eigentum eines andern steht. (Der Name Sklave kommt her von dem Volksstamm der Slaven, ehemals Skleren [sklavi] genannt, die bei ihrer Unterwerfung durch die Deutschen als Knechte verkauft wurden.) In der antiken Welt, deren wirtschaftliches System größtenteils auf der S. beruhte, war diese allgemein verbreitet, indem man die häuslichen und gewerblichen Dienstleistungen zumeist durch Sklaven verrichten ließ, zu denen von jeher insbes. die Kriegsgefangenen verwendet wurden. So finden wir im Altertum die S. ebenso bei den Völkern des Orients wie bei den Griechen und Römern verbreitet, welch letztere die S. zu einem besondern Rechtsinstitut ausgebildet hatten. Der Sklave (homo servus) hatte nach römischem Recht, das übrigens in der ältern Zeit die Entstehung der S. auch durch Schuldknechtschaft zuließ, keine Rechtsfähigkeit. Er war als bloße Sache Gegenstand des Handels, Sklavenkinder waren von Geburt an Sklaven, dem Herrn stand das Recht über Leben und Tod des Sklaven zu. Was der Sklave verdiente, gehörte dem Herrn, der jedoch vielfach dem Sklaven die Verwaltung eines Teils seines Vermögens überließ (sogen. peculium). Das hatte die Wirkung, daß der Herr für die Kontraktsschulden des Sklaven in dem Umfange des Wertes des peculium den Gläubigern haftete. Auch konnte dieses peculium im Testament des Herrn insofern als eignes Vermögen des Sklaven behandelt werden, als der Herr dem Sklaven die Freiheit hinterlassen konnte unter der Bedingung, daß er aus dem peculium dem Erben einen gewissen Betrag zahle. Auch die Freigelassenen (libertini) standen immer noch zu dem Patron, der sie freigelassen hatte, in einem Abhängigkeitsverhältnis. Die Arten der…
narrower: Christensklave
alt label: Sclave
narrower: Negersklave
alternative label: Sclave
related match: Slavery
pref label: slave
in scheme: travel!digital Thesaurus
pref label: Sklave
preferred label: slave @en

Christensklave
type: Concept
definition: bdk: siehe Christ, Sklave
in scheme: travel!digital Thesaurus
pref label: Christensklave
related: Christ

Christensklave
type: Label
in scheme: travel!digital Thesaurus

Christ
type: Concept
narrower: Tertullianer
narrower: Manichäer
alt label: Christenheit
in scheme: travel!digital Thesaurus
narrower: Maronit
narrower: Protestant
narrower: Thomaschrist
narrower: Jacobit
narrower: Athanasianer
narrower: Mormone
definition: Duden: ein gläubiger, überzeugter Christ | [Anm.: Ergänzung: Anhänger des christlichen Glaubens; siehe Christentum]
narrower: Sabier
preferred label: orang mesehi @ms
alternative label: Christengemeinde
narrower: Monophysit
narrower: Katholik
narrower: Kopte
alt label: Christengemeinde
pref label: Christ
narrower: Judenchrist
pref label: orang mesehi
narrower: Monothelet
related: Christentum
narrower: Arianer
alternative label: Christenheit
narrower: Melchit
narrower: Heidenchristen

Tertullianer
type: Concept
related match: Tertullian
pref label: Tertullianer
in scheme: travel!digital Thesaurus
definition: Duden: Tertullian: römischer Kirchenschriftsteller | Brockhaus' Kleines Konversations-Lexikon 1911: Tertulliān, Quintus Septimius Florens, ältester lat. Kirchenvater, geb. um die Mitte des 2. Jahrh. zu Karthago, zunächst Rechtsgelehrter und Sachwalter, erst um 185 Christ, gest. nach 220 als Presbyter zu Karthago; als Schriftsteller der Schöpfer der lat. Kirchensprache, glänzender Verteidiger des Christentums gegen die Heiden wie Häretiker, Mitbegründer der alten kath. Kirchenlehre, Vorkämpfer strengster Kirchenzucht, deshalb seit 202 Anhänger und Führer der abendländ. Montanisten (s.d.). Werke hg. von Oehler (1851 fg.), Reifferscheid und Wissowa (Bd. 1, 1890), deutsch von Kellner (2 Bde., 1882). – Vgl. Hauck (1877), Nöldecken (1890). | Quelle: Brockhaus' Kleines Konversations-Lexikon, fünfte Auflage, Band 2. Leipzig 1911., S. 823. | Permalink: http://www.zeno.org/nid/20001614339

Tertullianer
type: Label
in scheme: travel!digital Thesaurus

Manichäer
type: Concept
pref label: Manichäer
in scheme: travel!digital Thesaurus
definition: Duden: Anhänger des Manichäismus | Duden: Manichäismus: von Mani gestiftete gnostische Religion der späten Antike und des frühen Mittelalters, deren Ausgangspunkt ein radikaler Dualismus (von Licht und Finsternis, Gut und Böse, Geist und Materie) ist | Meyers Großes Konversations-Lexikon 1908: Manichäismus, eine seit dem 3. Jahrh. aufblühende, im 4. und 5. Jahrh. im Morgenland und Abendland verbreitete, aus dem babylonischen Gnostizismus herausgewachsene und mit christlichen Vorstellungen durchsetzte Religionsform. Der Stifter Mani (Manes, Manichäus), 215/216 von persischen Eltern in Babylonien geboren, trat 242 mit seiner Lehre hervor und fiel 276 unter König Bahram I. dem Haß der persischen Priester zum Opfer. Er wurde gekreuzigt und sein Leichnam geschunden. Seine Anhänger verehrten in ihm den von Christus im Johannes-Evangelium seinen Gläubigen verheißenen Parakleten (Fürsprecher), als den er sich selbst bezeichnet hatte. Der M. ist durch den ausgeprägtesten Dualismus charakterisiert, d. h. er beruht auf der Voraussetzung zweier von Ewigkeit zu Ewigkeit räumlich nebeneinander bestehender, sich direkt entgegengesetzter Grundwesen. Im Kampfe beider Prinzipien sind einige Lichtteile von der Materie verschlungen worden. Sie bilden die sogen. Weltseele, die sich nach Befreiung sehnt. Hieraus entwickelten die spätern, abendländischen Manichäer die Idee des leidenden Menschensohnes (Jesus patibilis). Dessen Erlösung betreiben von der Sonne aus die Lichtgeister durch ihre Propheten, namentlich durch Jesus. Dieser ist in einem Scheinleib in die Welt gekommen, um die Lichtseelen zu besonnen und an ihren Ursprung zu erinnern. Die Erlösung geschieht durch den Unterricht, den Christus begann, und den Manes als der Paraklet aus Christi Reden und aus selbst empfangenen Offenbarungen vollendet. Die Manichäer verwerfen daher das Alte Testament ganz und gebrauchen das Neue Testament nur mit Auswahl und nach Manes' eigner Deutung. Ihre Sittenlehre gebot die strengste Askese und zw…
related match: Manichaeism

Manichäer
type: Label
in scheme: travel!digital Thesaurus

Christenheit
type: Label
in scheme: travel!digital Thesaurus

Maronit
type: Concept
related match: Syriac Christianity
pref label: Maronit
in scheme: travel!digital Thesaurus
definition: Duden: Angehöriger der mit Rom unierten syrisch-christlichen Kirche im Libanon | Meyers Großes Konversations-Lexikon 1908: Maroniten (arab. Mûrâni, Mehrz. Mawârine, so benannt nach einem Mönch, Johannes Maro, der 680 vom Papst zum Patriarchen des Libanon ernannt wurde und 707 starb), eine christliche Sekte im Libanon. Früher Monotheleten, d. h. Anhänger der im J. 680 durch das sechste ökumenische Konzil von Konstantinopel verdammten Lehre von dem Einen Willen in Christo, wandten sich die M. 1182 dem römisch-katholischen Glaubensbekenntnis zu. Aber erst im 16. Jahrh. fand durch die Bemühungen der Päpste die eigentliche Vereinigung der M. mit der römischen Kirche statt. Papst Gregor XIII., der 1579 dem maronitischen Patriarchen Michael das Pallium übersandt hatte, gründete 1584 in Rom ein Kollegium für die M., aus dem bald tüchtige Männer hervorgingen, wie Georgius Amira (1663 Patriarch), Gabriel Sionita, Abraham Eechellensis, die beiden Assemani (s. d.), und das noch jetzt besteht. Unter Clemens XII. wurde 1736 auf einer Synode im Kloster Mar Hanna, der Joseph Simon Assemani als päpstlicher Legat beiwohnte, der römische Katechismus[343] angenommen. Obgleich die M. von aufrichtiger Verehrung für den Papst erfüllt sind, weichen sie doch in mancher Hinsicht von dem Ritus der römischen Kirche ab. So haben sie nicht die lateinische, sondern die syrische Liturgie. Ihre Priester dürfen verheiratet sein und nur nach der Weihe keine Ehe eingehen. Ihr Patriarch, der früher im Kloster Santa Maria von Kaunobîn im Libanon seinen Sitz hatte, jetzt aber während des Winters im Kloster Blicke bei Beirut, im Sommer zu Dimân residiert und den Titel »Patriarch von Antiochien und ganz Syrien« führt, wird von den Bischöfen gewählt und vom Papst bestätigt. Die maronitischen Erzbistümer und Bistümer sind: Beirut, Tripolis, Tyrus mit Sidon, Dschebeil, d. h. Byblus (Bistum), Byblus, Baalbek, Damaskus, Cypern, Aleppo und Eden (Bistum). Im Libanon gibt es sehr viele maronitische Klöster. Die Ge…

Maronit
type: Label
in scheme: travel!digital Thesaurus

Protestant
type: Concept
narrower: Herrnhuter
narrower: Congregationalist
definition: Duden: 1. [nach dem feierlichen Protest (1) der evangelischen Reichsstände auf dem Reichstag zu Speyer 1529] Angehöriger einer protestantischen Kirche | [Anm.: Ergänzung: Anhänger des protestantischen Glaubens] | Duden: Protestantismus: 1. aus der kirchlichen Reformation des 16. Jahrhunderts hervorgegangene Glaubensbewegung, die die verschiedenen evangelischen Kirchengemeinschaften umfasst | 2. Geist und Lehre des protestantischen Glaubens; das Protestantischsein
in scheme: travel!digital Thesaurus
narrower: Presbyterianer
related match: Protestantism
narrower: Hugenotte
narrower: Methodist
pref label: Protestant
narrower: Puritaner
pref label: protestant
preferred label: protestant @ar

Herrnhuter
type: Concept
definition: Duden: Angehöriger der Herrnhuter Brüdergemeine (einer aus dem Pietismus hervorgegangenen Freikirche) | Meyers Großes Konversations-Lexikon 1905: Brüdergemeine (Brüderunität, Herrnhuter), die aus Nachkommen der Böhmischen und Mährischen Brüder (s.d.) entstandene Religionsgesellschaft. Steter Druck in den österreichischen Landen veranlaßte im 17. und 18. Jahrh. zu fortgesetzter Auswanderung evangelisch Gesinnter. Eine Anzahl solcher Emigranten, unter ihnen bewußte Nachkommen der [487] Brüder, fand 1722 Aufnahme bei dem Grafen Zinzendorf (s.d.) und ließ sich auf seinem Rittergut Berthelsdorf in der Lausitz nieder, wo der Ort Herrnhut entstand. Als in der Emigrantenkolonie Zwistigkeiten mancherlei Art, hervorgerufen durch Lehrstreitigkeiten und religiöse Schwärmerei, ausbrachen, nahm sich Zinzendorf persönlich der Leitung an. Es gelang ihm auch, die Einheit der auf mehr als 200 Seelen angewachsenen Kolonie durch die Annahme eines das äußere und innere Zusammenleben regelnden Statuts (12. Mai 1727) herzustellen. Der nun rasch zunehmende innere Zusammenschluß fand seinen höchsten Ausdruck in einer gemeinsamen Abendmahlsfeier in der Kirche zu Berthelsdorf 13. Aug. 1727 (Stiftungstag). Trotz ihrer besondern Gesellschafts- und Erbauungseinrichtungen, die sie als Erneuerung der altbrüderischen Disziplin beurteilte, wollte die junge Gemeine im Verbande der sächsischen Landeskirche verbleiben. Aber wachsende staatliche und kirchliche Feindschaft drängte mehr und mehr zu kirchlicher Verselbständigung, eine Entwickelung, der Zinzendorf nur äußerst widerstrebend, die Mähren unbedenklicher nachgaben. Die Übertragung der altbrüderischen Bischofsweihe auf einen der Mähren (1735) war der nächste Schritt dazu. Hand in Hand mit der Verselbständigung ging Ausbreitung, gefördert durch die Reisen des verbannten Grafen. Lutheraner, Reformierte und Sektierer schlossen sich den Brüdern an. Herzenschristentum und Gemeindisziplin sollte das Einheitsband dieser verschiedenen »Tropen« bilden; di…
in scheme: travel!digital Thesaurus
pref label: Herrnhuter

Herrnhuter
type: Label
in scheme: travel!digital Thesaurus

Congregationalist
type: Concept
preferred label: congregationalist @en
related match: Congregational church
pref label: Congregationalist
label: Kongregationalist
in scheme: travel!digital Thesaurus
pref label: congregationalist
definition: Duden: Angehöriger einer englisch-nordamerikanischen Kirchengemeinschaft | Duden: Kongretationalismus: reformiert-kalvinistische religiöse Bewegung in England und Nordamerika, die eine übergeordnete Kirchenstruktur ablehnt | Meyers Großes Konversations-Lexikon 1907: Independénten (lat.; engl. Independents, »Unabhängige«), eine Partei der Dissenters (s. d.), ging aus den Brownisten (s. d.) hervor und erhielt durch H. Barrow (hingerichtet 6. April 1593) eine völlig demokratische Verfassung. Ihr Grundcharakter ist der auf die Spitze getriebene religiöse Subjektivismus; demgemäß soll jede Gemeinde (Kongregation; daher nennt man die I. jetzt gewöhnlich Kongregationalisten) von allen andern, wenn auch in Lehre und Verfassung mit ihr übereinstimmenden Gemeinden unabhängig (independens quoad alias ecclesias, daher der Name), sich selbst regieren. Im Vaterland unterdrückt, wendeten sich die I. nach Holland, wo durch John Robinson 1610 die erste independentistische Gemeinde zu Leiden gegründet wurde. Der Lehrbegriff eines Teiles der I. weicht nicht von dem der anglikanischen Kirche ab, z. T. aber bekennen sie sich zu Calvins Lehre; gegen Andersgläubige vertreten sie den Grundsatz der Toleranz. Vor allem dringen sie auf Kenntnis der Heiligen Schrift. Die englische Revolution (s. Großbritannien, S. 398 f.), an der sie sich eifrig beteiligten, ermöglichte ihnen die Rückkehr ins Vaterland, wo sie, von Cromwell, Milton u. a. begünstigt, bedeutenden Einfluß gewannen. I. und Presbyterianer standen damals einander ebenso schroff gegenüber wie beide den Katholiken und Episkopalen; doch schieden sie nicht nur kirchliche, sondern auch politische Meinungen, indem die I. radikale Republikaner waren. Schon seit 1620 hatten sie sich auch in Amerika verbreitet. Dort haben sie sich indessen seit 1805 mit den Presbyterianern und Baptisten wenigstens zur Gründung eines gemeinschaftlichen Kollegiums geeinigt. Ihre Lehren sind vornehmlich in zwei Bekenntnisschriften niedergelegt, die indes kein s…

Congregationalist
type: Label
in scheme: travel!digital Thesaurus
hasTranslation: congregationalist

congregationalist
type: Label
isTranslationOf: Congregationalist
in scheme: travel!digital Thesaurus

Presbyterianer
type: Concept
related match: Presbyterian polity
pref label: presbytérien
in scheme: travel!digital Thesaurus
pref label: Presbyterianer
preferred label: presbytérien @fr
definition: Duden: Presbyterianer: Angehöriger protestantischer Kirchen mit Presbyterialverfassung besonders in Schottland und Amerika

presbytérien
type: Label
in scheme: travel!digital Thesaurus
isTranslationOf: Presbyterianer

Presbyterianer
type: Label
in scheme: travel!digital Thesaurus
hasTranslation: presbytérien

Hugenotte
type: Concept
definition: Duden: 1. Anhänger des Calvinismus in Frankreich | 2. Nachkomme eines zur Zeit der Verfolgung aus Frankreich geflohenen Calvinisten | Meyers Großes Konversations-Lexikon 1907: Hugenotten (franz. Huguenots), Name der französischen Protestanten, der wahrscheinlich von den protestantischen Genfern herrührt, die im Kampfe gegen Savoyen sich an die Schweizer anlehnten und deshalb die Partei der »Eidgenossen« oder in französischer Verstümmelung Huguenots genannt wurden. Schon unter König Franz I. hatte der unter den Gebildeten herrschende, der alten Kirche feindliche Humanismus der Reformation Eingang verschafft, die, von des Königs Schwester Margarete von Navarra begünstigt, besonders unter den Gelehrten große Verbreitung fand. 1523 entstand in Meaux die erste lutherische Vereinigung. Indes politische Rücksichten und despotische Gesinnung veranlaßten Franz I. zur Verfolgung der Lutheraner, deren viele seit 1525 hingerichtet wurden. Nichtsdestoweniger dehnte sich der Protestantismus schnell unter Adel und Bürgertum aus, und gerade die Verfolgung ließ an Stelle des friedfertigern Luthertums die streitbare und tatkräftige Lehre Calvins treten. Vergebens steigerte Heinrich II. (1547–1559) noch die Schärfe der Verfolgung. Bei seinem Tode zählten die Reformierten schon 400,000 Anhänger und hatten im Mai 1559 ihre erste große Landesversammlung gehalten, die sie in Gemeinden, Provinzialsynoden und einer Nationalsynode in demokratischem Sinn und auf praktischste Weise organisierte und zugleich in 40 Glaubens- und ebensoviel Disziplinarartikeln ihr Bekenntnis auf Calvinscher Grundlage feststellte. Die prinzliche Familie Bourbon und das mächtige Haus Châtillon übernahmen ihre Führung, während die Guisen ihre erbittertsten Gegner wurden. Da diese unter dem König Franz II. (1559–60) die Regierung in Händen hatten, verhängten sie über die H. die schlimmsten Verfolgungen. Indes ehe die Guisen ihren Zweck erreicht hatten, starb Franz II., und für dessen minderjährigen Bruder, Karl IX., …
in scheme: travel!digital Thesaurus
pref label: Hugenotte

Hugenotte
type: Label
in scheme: travel!digital Thesaurus

Methodist
type: Concept
related match: Methodism
definition: Duden: Mitglied einer methodistischen Kirchengemeinde | Duden: Methodismus: (aus der anglikanischen Kirche im 18. Jahrhundert hervorgegangene) evangelische Erweckungsbewegung, die durch Bibelfrömmigkeit, Betonung der persönlichen Glaubensbindung und Laienmitarbeit gekennzeichnet ist
in scheme: travel!digital Thesaurus
related: Congregationalist
pref label: Methodist

Methodist
type: Label
in scheme: travel!digital Thesaurus

Protestant
type: Label
in scheme: travel!digital Thesaurus
hasTranslation: protestant

protestant
type: Label
in scheme: travel!digital Thesaurus
isTranslationOf: Protestant

Puritaner
type: Concept
definition: Duden: 1. Anhänger des Puritanismus | Duden: Puritanismus: streng calvinistische Richtung im England des 16. und 17. Jahrhunderts | Meyers Großes Konversations-Lexikon 1908: Puritāner (neulat.), eine auf den Einfluß Genfs zurückzuführende Partei der Protestanten in England, die im Gegensatz zur Hochkirche die Kirche in ihrer evangelischen Reinheit (puritas, daher P.) wiederherstellen wollte, völlige Unabhängigkeit der Kirche bom Staat, Einführung der reformierten Kirchenverfassung, strenge Kirchenzucht verlangte und in diesem ihrem Bestreben mit den zahlreichen katholischen Elementen in Lehre und Verfassung der englischen Staatskirche in Widerstreit geriet. Der englische Puritanismus trat bald in Verbindung mit dem schottischen Presbyterianismus und erfocht in der englischen Revolution (s. Anglikanische Kirche) gegen das ihm mit immer härtern Zwangsmitteln zusetzende Königtum einen vollständigen Sieg, dessen Früchte aber sofort der konsequentesten Partei der P., den sogen. Independenten (s. d.), zufielen. Spätere Phasen des Puritanismus bilden verschiedene Sekten, besonders die Gesellschaft der Freunde, die sogen. Quäker (s. d.). S. Presbyterianer. Vgl. Neal, History of the Puritans (Lond. 1822, 5 Bde.); Hopkins, The Puritans (2. Aufl., das. 1875, 3 Bde.); D. Campbell, The Puritan in Holland, England and America (New York 1892, 2 Bde.); Byington, The Puritan in England and New England (Lond. 1896). | Quelle: Meyers Großes Konversations-Lexikon, Band 16. Leipzig 1908, S. 462. | Permalink: http://www.zeno.org/nid/20007302835
in scheme: travel!digital Thesaurus
pref label: Puritaner

Puritaner
type: Label
in scheme: travel!digital Thesaurus

Thomaschrist
type: Concept
in scheme: travel!digital Thesaurus
pref label: Thomaschrist
definition: bdk: Anhänger der christlichen Kirche in Indien, die sich auf Apostel Thomas, den ersten Missionar in Indien beruft | Meyers Großes Konversations-Lexikon 1909: Thomaschristen nennt man die ihren Ursprung auf den Apostel Thomas (s. d.) zurückführenden Christen an der Malabarküste von Ostindien. Sie werden zuerst um die Mitte des 6. Jahrh. erwähnt und bekannten sich bis gegen Ende des 16. Jahrh. zum nestorianischen Christentum (s. Nestorianer). 1599 wurde ein Teil von ihnen mit Rom uniert. Doch kam es unter den Unierten 1653 zu einem Schisma, das der Patriarch der Jakobiten (s. d. 1) benutzte, um seinen Einfluß geltend zu machen. Gegenwärtig zählt man 108,000 unierte T., amtlich »Katholiken des syrisch-malabarischen Ritus« (s. Unierte orientalische Kirchen) genannt, in zwei apostolischen Vikariaten. Die nichtunierten T. (Suriani), etwa 70,000, leben unter einheimischen Bischöfen im Gebiete des Radscha von Travancore. Mit der nestorianischen Kirche haben sie keine Verbindung mehr. Auch der Einfluß der Jakobiten ist gering. Vgl. Germann, Die Kirche der T. (Gütersloh 1877); Rae, The Syrian church in India (Lond. 1892); Silbernagl, Verfassung und gegenwärtiger Bestand sämtlicher Kirchen des Orients (2. Aufl., hrsg. von Schnitzer, Regensb. 1904). | Quelle: Meyers Großes Konversations-Lexikon, Band 19. Leipzig 1909, S. 495. | Permalink: http://www.zeno.org/nid/20007582064

Thomaschrist
type: Label
in scheme: travel!digital Thesaurus

Jacobit
type: Concept
pref label: Jacobit
in scheme: travel!digital Thesaurus
definition: Duden: 1. Anhänger der syrischen monophysitischen Nationalkirche | Meyers Großes Konversations-Lexikon 1907: Jakobīten, 1) Name, den sich die Monophysiten (s. d.) beilegten, nachdem sie der 541 zum Bischof von Edessa geweihte Mönch Jakob Baradai oder Zanzalos (gest. 578) wieder zu einer Gemeinschaft vereinigt hatte. Die Gemeinden der J., die in nicht geringer Zahl in Syrien, Mesopotamien und Persien vorhanden waren, bestanden auch nach der Eroberung dieser Länder durch die Araber fort. Die ägyptischen J. hatten seit dem 13. Jahrh. Verfolgungen zu erleiden, durch die ihre allmähliche Absonderung von ihren Glaubensgenossen in Asien und ihre nunmehrige Gestaltung zur Sekte der Kopten (s. d.) herbeigeführt wurden. Wie diese, so erkennen auch die syrischen J. die drei ersten ökumenischen Konzile und die Räubersynode von Ephesos an; ihre Dogmatik konzentriert sich ganz darin, daß die menschliche Natur Christi in seiner Gottheit verschwindet. Gegenwärtig sind sie an Zahl sehr zurückgegangen. [...] | Quelle: Meyers Großes Konversations-Lexikon, Band 10. Leipzig 1907, S. 157. | Permalink: http://www.zeno.org/nid/20006835848
related match: Syriac Orthodox Church
related: Monophysit

Jacobit
type: Label
in scheme: travel!digital Thesaurus

Monophysit
type: Concept
pref label: Monophysit
in scheme: travel!digital Thesaurus
definition: Duden: Anhänger des Monophysitismus | Duden: Monophysitismus: altkirchliche Lehre, nach der die zwei Naturen Christi zu einer neuen gottmenschlichen Natur verbunden sind | Meyers Großes Konversations-Lexikon 1908: Monophysiten (griech.), Bezeichnung derjenigen Partei in der orientalischen Kirche, die im Gegensatz zu den rechtgläubigen Diphysiten (so genannt, weil sie zwei Naturen in Christus lehrten) nur eine gottmenschliche Natur in Christus anerkennen wollten. Das Chalcedonische Glaubensbekenntnis (s. d.) fand nur im Abendland und in den unter dem unmittelbaren Einfluß des oströmischen Kaisers und seines Patriarchen stehenden Kirchen des Orients allgemeine Billigung. In den Provinzen des Ostens, namentlich in Ägypten, Palästina und Syrien, rief es langwierige und erbitterte Streitigkeiten hervor. Gelegentliche Beschwichtigungsversuche, unter denen das Henotikon des Kaiser Zenon (s. d.) von 482 der wichtigste war, führten nicht zum Ziel. Vergeblich waren auch die Bemühungen Justinians I. (527–565) und seiner Gattin Theodora, deren Sympathien dem monophysitischen Bekenntnis gehörten, die Kontroverse aus der [78] Welt zu schaffen. Erfolglos ließ der Kaiser, um den Orthodoxen zu genügen, den von den M. hochgeachteten Origenes (s. d.) und, um die M. zu gewinnen, die antiochenische Theologie (s. Antiochenische Schule und Dreikapitelstreit) verdammen. Inzwischen waren die M. selbst in die verschiedensten Richtungen und Parteien auseinander gegangen. In Ägypten sonderten sich infolge des Henotikons die strengen M. (sogen. Akephaloi, Kopflose) von den regierungsfreundlichen ab. Aus dem dogmatischen Streit zwischen den Bischöfen Julianus von Halikarnassus und Severus von Antiochia (s. d.) gingen die Parteien der Julianisten (Aphthartodoketen, »Unverweslichkeitsträumer«, genannt, weil sie den Leib Christi schon auf Erden der Vergänglichkeit entzogen glaubten) und der Severianer (Phthartolatren, »Verweslichkeitsdiener«, genannt) hervor. Von diesen sonderten sich wieder die Ag…
related match: Monophysitism

Monophysit
type: Label
in scheme: travel!digital Thesaurus

Athanasianer
type: Concept
related match: Athanasian Creed
pref label: Athanasianer
in scheme: travel!digital Thesaurus
definition: Brockhaus Bilder-Conversations-Lexikon 1837: Ariāner und Athanasiāner waren die beiden Hauptvarteien, in welche die christliche Kirche im 4. Jahrh. wegen der Lehre vom Vater, Sohn und Geist sich theilte. Beide nannten sich nach ihren Häuptern, jene nach Arius, einem gelehrten griech. Kirchenlehrer zu Alexandria, gest. 336, diese nach Athanasius, der als Bischof daselbst starb. Während Arius behauptete, daß Christus von dem Vater vor allen Creaturen geschaffen, folglich ein Geschöpf, aber das erste, edelste, der Gottheit ganz ähnliche sei, lehrte Athanasius, daß der Sohn, aus dem Wesen des Vaters erzeugt, mit diesem gleiches Wesen sei. An ihren Streitigkeiten nahm sehr bald die ganze Kirche Antheil, ja es kam sogar zu blutigen und mörderischen Händeln, sodaß der Kaiser Konstantin zur Schlichtung derselben im I. 325 eine allgemeine Synode nach Nicäa berief. Hier war die Athanasianische Partei die mächtigere, setzte ein Glaubensbekenntniß auf, das nicäische oder Athanasianische genannt und verdammte Diejenigen, welche dasselbe anzunehmen sich weigerten. Arius setzte demselben ein anderes Glaubensbekenntniß entgegen, welches dem Kaiser so gefiel, daß nun die Athanasianer von ihren Ämtern vertrieben wurden. Nachdem bis ins 7. Jahrh. bald die eine, bald die andere Partei, je nachdem ihr die Kaiser gewogen waren, herrschend gewesen, verlor sich der Name Arianer, allein ihre Ansichten haben sich fort und fort in der christlichen Kirche erhalten. | Quelle: Brockhaus Bilder-Conversations-Lexikon, Band 1. Leipzig 1837., S. 115. | Permalink: http://www.zeno.org/nid/20000811610
related: Arianer

Athanasianer
type: Label
in scheme: travel!digital Thesaurus

Arianer
type: Concept
related match: Arianism
in scheme: travel!digital Thesaurus
pref label: Arianer
definition: Duden: Anhänger des Arianismus | Duden: Arianismus: Lehre des Arius (4. Jahrhundert), wonach Christus mit Gott nicht wesensgleich, sondern nur wesensähnlich sei | Pierer's Universal-Lexikon 1857: Arianer (Kirchgesch.), Anhänger des Arius (s.d.). 318 gerieth Arius mit seinem Bischof Alexander, welcher den Satz vertheidigte, in der Dreieinigkeit sei auch eine Einigkeit, in Streit. Arius sprach dem Sohn die Einheit des Wesens ab, aus dem Wesen Gottes (wie man bisher gelehrt hatte) könne er nicht gezeugt sein, sonst müsse man Gott sich theilbar denken. Er nannte ihn daher ein von Gott vor aller Zeit u. aus Nichts hervorgebrachtes Wesen, welches aber nicht wie eins der anderen Geschöpfe, u. auch vor allen, von Gott hervorgebracht sei. Da nun der Sohn von Gott gezeugt sei, so müsse es eine Zeit gegeben haben, wo er noch nicht war; er könne also nicht ewig sein, wie Gott. Bald fand diese Meinung Beifall, u. schnell entstand eine Secte. die sich selbst A. (nach Arius), Eusebianer (nach Eusebios, Bischof zu Nikomedien, dem vornehmsten Vertheidiger der Partei), Exukontianer (angeblich wegen der Ansicht, daß Jesus ἐξ οὐκ ὀνιός, d.i. aus Nichts, geschaffen sei), nannte, vom Kaiser Constantin aber den Namen Porphyrianer (nach Porphyrios) erhielt. Ihre Gegner aber nannten sich wegen der Ansicht, daß der Sohn dem Vater dem Wesen nach gleich (ὁμοοίσιος) sei, Homousiasten u. ein Concil zu Alexandria 321 setzte den Arius ab u. that ihn u. seine Anhänger in den Bann. Arius floh nach Palästina u. später nach Illyrien. Aber er hatte die asiatischen Bischöfe, namentlich den Eusebios, Bischof von Nikomedien, u. den Eusebios, Bischof von Cäsarea, zu Freunden, welche die Handlungsweise Alexanders mißbilligten. Die ganze Kirche gerieth in Bewegung, u. um den Streit zu schlichten, schickte der Kaiser Constantin den Bischof Hosius von Corduba als Vermittler nach Alexandria; doch ohne Erfolg. Nun berief derselbe 325 das Concil von Nikäa, welchem er selbst beiwohnte. Über 300 Bischöfe waren zuge…

Arianer
type: Label
in scheme: travel!digital Thesaurus

Mormone
type: Concept
in scheme: travel!digital Thesaurus
definition: Duden: Angehöriger einer chiliastischen Religionsgemeinschaft (besonders in Nordamerika), die sich selbst als Kirche Jesu Christi der Heiligen der letzten Tage bezeichnet | Meyers Großes Konversations-Lexikon 1908: Mormōnen (Latter-Day Saints, Heilige der letzten Tage), religiöse Sekte in Nordamerika, gestiftet von Joe Smith, geb. 23. Dez. 1805 zu Sharon im Staate Vermont. Smith grub 1823 auf eine Engelserscheinung hin im Hügel Cumora bei Palmyra in County New York nach »heiligen goldenen Tafeln«, die er unter Leitung des Engels 22. Sept. d. J. fand, aber nach dessen Bestimmung erst 22. Sept. 1827 heben durfte. Sie waren in »neuformiertem Ägyptisch« geschrieben; in der Kiste lag eine Wunderbrille (Urim und Thummim) mit durchsichtigen Steinen statt Gläsern, die den des Lesens unkundigen Smith die geheimnisvollen Zeilen zu lesen befähigte, ihm auch die Zukunft enträtselte. Im J. 1830 gab Smith die gedruckte englische Übersetzung der Platten unter dem Titel: »The book of Mormon« (deutsch, neueste Aufl. Berl. 1902; übersetzt in 13 Sprachen) heraus. Das Buch erzählt in einer der biblischen nachgebildeten Sprache, wie zur Zeit des Königs Zedekia von Jerusalem ein frommer Israelit, Lehi, samt seiner Familie von Palästina nach Amerika[152] auswanderte und hier seine wunderbaren Reiseabenteuer sowie die Offenbarungen, die ihm Gott hinsichtlich der Zukunft mitteilte, auf Goldplatten auszeichnete. Mehrere seiner Söhne, vor allem Laman, gingen in die Wildnis und wurden die Stammväter und Häuptlinge der Rothäute. Die Nachkommen seines Sohnes Nephi aber waren schon mehrere Jahrhunderte vor Christus gute Christen, in deren Mitte die Priesterwürde und die Goldplatten forterbten. Dieser Familie erschien dann auch der auferstandene Christus und wählte aus ihr zwölf Apostel, die in kurzem das ganze Land zum Christentum bekehrten. Als zu Anfang des 4. Jahrh. die Kirche infolge von Spaltung und Kriegen zerfallen war, erschien Mormon (der Name wird von den M. als »mehr gut« erklärt), ein…
pref label: Mormone
related: Mormonentum

Mormone
type: Label
in scheme: travel!digital Thesaurus

Sabier
type: Concept
pref label: Sabier
in scheme: travel!digital Thesaurus
alternative label: Sabait
definition: Duden: Mandäer: Mitglieder einer alten gnostischen Täufersekte, die einen Erlöser aus dem Lichtreich erwartet (im Irak und im Iran heute noch verbreitet) | Meyers Großes Konversations-Lexikon 1908: Mandäer, eine heidnisch-christliche, in ihren Anfängen vorläufig nicht bestimmbare Sekte des Euphrat- und Tigrisgebiets, entstanden etwa in der Gegend von Upî, später in den heißen Sumpfdistrikten des untern Babylonien (im Gebiet von Wâsit und Basra) und des benachbarten Chusistan. Von jeher nicht sehr zahlreich, zählen sie jetzt keine 2000 Köpfe mehr. Sie nennen sich selbst Mandâjê, »Mandäer« (nach Mandâ d'Chaijê, ihrem Erlöser und einem der Äonen ihrer sehr reich entwickelten religiösen Mythologie), daneben auch Nâßôrâjê, »Nazarener«, »Christen«; die Namen »Johanneschriften« und »Sabier« oder »Zabier«, die man ihnen (den erstern seit der Schrift des Karmelitermissionars Ignatius a Jesu: »Narratio originis rituum et errorum Christianorum S. Joannis«, Rom 1652) oft in Europa beilegt, sind unpassend. Die M. bedienen sich heutzutage wohl durchweg der arabischen Sprache, ihre heiligen Schriften aber sind in einem eigentümlichen, dem Babylonisch-Talmudischen und Syrischen am nächsten stehenden ostaramäischen Dialekt verfaßt, den Nöldeke (»Über die Mundart der M.«, Götting. 1862, und »Mandäische Grammatik«, Halle 1875) meisterlich bearbeitet hat, und der für die semitische Sprachforschung besonders deshalb interessant ist, weil er vom Hebräischen kaum berührt ist. Die ältesten und wichtigsten dieser Religionsschriften (niedergeschrieben teilweise schon unter den Sasaniden, redigiert aber erst im 7. u. 8. christl. Jahrh.) sind: das »Ginzâ« (»Der Schatz«), oder »Sidrâ Rabbâ« (»Das große Buch«), grundlos oft »Liber Adami« genannt (sehr schlecht hrsg. von Norberg, Lund 1815–16, 3 Bde.; weit besser von Petermann: »Thesaurus sive Liber magnus«, Berl. u. Leipz. 1867, 2 Bde.); »Sidrâ d'Jahjâ« (»Buch des Johannes«, hrsg. von Lidzbarski, Gießen 1905); die Lieder und Formeln in der sogen…
alt label: Sabait

Sabier
type: Label
in scheme: travel!digital Thesaurus

Sabait
type: Label
in scheme: travel!digital Thesaurus

Katholik
type: Concept
narrower: Paulist
narrower: Jesuit
pref label: kâtûlîki
narrower: Karmeliter
preferred label: kâtûlîki @ar
in scheme: travel!digital Thesaurus
pref label: Katholik
narrower: Soeur de St. Vincent de Paul
definition: Duden: Angehöriger der katholischen Kirche | Duden: Katholizismus: Geist und Lehre des katholischen Glaubens | Meyers Großes Konversations-Lexikon 1907: Katholizismus (griech.), im Gegensatze zum Protestantismus der eigentümliche Geist und Charakter der morgenländischen und abendländischen Kirche, wie sich solcher im Verlauf der ersten christlichen Jahrhunderte entwickelt, dann besonders im Abendland unter der Herrschaft der Päpste ausgebildet. später durch die Kirchenversammlung zu Trient (1545–63) schärfer ausgeprägt hat und bis auf die neueste Zeit konsequent festgehalten worden ist (s. Kirche, S. 33 ff.). Die Kirche nannte sich schon um die Mitte des 2. Jahrh. die katholische, die »allgemeine, allumfassende«, im Gegensatze zu den Sonderrichtungen der gnostischen Häretiker, später auch überhaupt zu dem religiösen Partikularismus der vorchristlichen Zeiten. Der ursprüngliche Sinn des Ausdrucks weist aber auf die eigentümliche Taktik zurück, womit die im 2. Jahrh. sich zusammenschließende Menge der Gläubigen ihre Überlieferungen als die »überall« (kathólu) verbreiteten und anerkannten den abweichenden Lehren und Schulen gegenüber geltend machte. Die Anhänglichkeit an dieses von dem Episkopat als Nachfolger des Apostolats konservierte Ganze der Wahrheit, an diese überall sich selbst gleiche Überlieferung galt als erste christliche Tugend; die so Gesinnten und sich also Erweisenden hießen Katholiken im Gegensatz gegen diejenigen, die aus der Gesamtströmung der Überlieferung heraustraten, sich in ihrem Denken und Handeln nicht durch die gemeinsame Regel bestimmen ließen und sich besondern, selbst erwählten, vom Gesamtsinn der Kirche willkürlich abweichenden Ansichten hingaben. Schon früh stellt sich daher eine dreifache Reihe von Gegensätzen des K. heraus, nämlich häretische, wie die Ebioniten, Gnostiker und Manichäer, die das Christentum durch jüdische und heidnische Ingredienzien entstellten, heterodoxe, wie die Monarchianer, Arianer, Nestorianer, Eutychianer und Pe…
related match: Catholic Church
narrower: Templer
narrower: Franziskaner
narrower: Johanniter
narrower: Lazarist
narrower: Ursulinerin
narrower: Chorherr des heiligen Grabes

Paulist
type: Concept
pref label: Paulist
in scheme: travel!digital Thesaurus
definition: bdk: katholische Ordensgemeinschaft

Paulist
type: Label
in scheme: travel!digital Thesaurus

Jesuit
type: Concept
pref label: Jesuit
in scheme: travel!digital Thesaurus
definition: Duden: 1. Angehöriger des Jesuitenordens | Meyers Großes Konversations-Lexikon 1907: Jesuīten (Gesellschaft Jesu, lat. Societas Jesu, daher die Abkürzung S. J.), geistlicher Orden, gestiftet mit dem Zwecke, sich nicht nur dem eignen Heil und der eignen Vollkommenheit, sondern auch der der Mitmenschen mit Gottes Gnade angelegentlich zu widmen. Die weltgeschichtliche Bedeutung des Ordens besteht darin, daß er zur Erreichung dieses Zweckes die dem römischen Katholizismus innewohnenden geistlichen und weltlichen Kräfte, zumal im Kampfe gegen den sie bedrängenden Protestantismus, neubelebt und ihnen zur schärfsten Ausprägung verholfen hat, mit unerbittlicher Folgerichtigkeit und unter oft skrupelloser Verwertung des Grundsatzes: wenn der Zweck erlaubt ist, sind es auch die Mittel (si finis est licitus, etiam media sunt licita). Den Namen Compañia Jesu, Fähnlein Jesu, gab ihm der Stifter, Ignaz von Loyola (s. hierüber und über die Anfänge des Ordens den Art. »Loyola«), nachdem er (1538) in einer Vision gesehen hatte, wie Gott Jesu den besondern Schutz der kleinen Gesellschaft übertrug, die sich aus einer frommen Studentenverbindung (1 ö. Aug. 1534) zu einer Priestergesellschaft für innere Mission zu entwickeln begonnen hatte. Entscheidend für die Zukunft wurde, daß die Mitglieder zu den drei Mönchsgelübden als viertes fügten, ihr Leben dem beständigen Dienst Christi und der Päpste zu widmen, unter dem Kreuzesbanner Kriegsdienste zu leisten, nur dem Herrn und dem römischen Oberpriester, als dessen irdischem Stellvertreter, zu dienen, so daß, was immer der gegenwärtige Papst und seine Nachfolger in Sachen des Heils der Seele und der Verbreitung des Glaubens ihnen befehlen, und in welche Länder immer er sie entsenden möge, sie ohne jegliche Zögerung und Entschuldigung sogleich, soweit es in ihren Kräften liege, Folge zu leisten gehalten sein wollten. In einem Zeitpunkt, da alle Welt dem Papste den Gehorsam aufkündigte, legte sich ihm hier ein neuer Orden unbedingt zu Füßen. …

Jesuit
type: Label
in scheme: travel!digital Thesaurus

kâtûlîki
type: Label
in scheme: travel!digital Thesaurus
isTranslationOf: Katholik

Katholik
type: Label
in scheme: travel!digital Thesaurus
hasTranslation: kâtûlîki

Karmeliter
type: Concept
pref label: Karmeliter
in scheme: travel!digital Thesaurus
definition: Duden: Angehöriger eines katholischen, teils streng kontemplativ lebenden, teils seelsorgerisch und missionarisch tätigen Bettelordens | Meyers Großes Konversations-Lexikon 1907: Karmelīter, Mönchsorden, um die Mitte des 12. Jahrh. auf dem Berge Karmel (s. d.) in Palästina von Berthold, einem Kreuzfahrer aus Kalabrien, nach der Klostersage vom jüdischen Propheten Elias (daher Eliä Ordensbrüder) gestiftet. Nach der 1209 vom Patriarchen Albert zu Jerusalem gegebenen Ordensregel müssen die K. in abgesonderten Zellen leben, sich abwechselnd bei Tag und bei Nacht mit Handarbeiten und Gebet beschäftigen, dürfen nichts Eignes besitzen, niemals Fleisch essen und haben zu gewissen Stunden ein gänzliches Schweigen zu beobachten. 1226 erhielten sie als Einsiedlerbrüder vom Berge Karmel die päpstliche Bestätigung. Von den Sarazenen aus Palästina vertrieben, ließen sie sich 1238 zuerst in Cypern, dann im westlichen und südlichen Europa nieder und erlangten 1247 von Innozenz IV. eine mildere Regel und die Privilegien der Bettelorden mit dem Titel Ordo beatae Mariae de monte Carmelo. Seitdem ließen sie mehr und mehr von der ursprünglichen Strenge ab, was unter Pius II. 1459 zur Trennung der bei der ersten Strenge beharrenden Observanten oder Barfüßer-Karmelitern von den Konventualen oder beschuhten K. führte. Später zerfiel der Orden in viele selbständige Kongregationen mit eignen Regeln, z. B. die Kongregation von Mantua, den Tertiarierorden u. a. Auch hatte er das Amt, die Santa Casa in Loreto (s. d.) zu bewachen. Die Tracht der K. bestand ursprünglich in einer braunen oder dunkelgrauen Kutte und einem weißen, schwarz und braun quergestreiften Mantel, zur Andeutung der auf dem Mantel des heil. Elias entstandenen Brandflecke, wozu in der Folge das graue Skapulier kam. Später ward in mehreren Klöstern der Konventualen die schwarze Farbe herrschend, während die Observanten die dunkelgraue beibehielten. Auch trug man breitkrempige weiße Hüte mit schwarzem Futter. | Im Laufe des 19. …

Karmeliter
type: Label
in scheme: travel!digital Thesaurus

Soeur de St. Vincent de Paul
type: Concept
in scheme: travel!digital Thesaurus
related match: Daughters of Charity of Saint Vincent de Paul
pref label: Soeur de St. Vincent de Paul
definition: Meyers Großes Konversations-Lexikon 1909: Vinzentinerinnen (Sœurs oder Filles de la charité), vom heil. Vinzenz von Paul (s. d.) 1625 zu einem Verein für Krankenpflege umgeschaffene Frauengenossenschaft, seit 1634 selbständige Kongregation mit jährlich zu erneuerndem Gelübde, deren von Vinzenz gegebene Regel 1668 von Clemens IX. bestätigt wurde. Die V. sind die zahlreichste, namentlich auch im Deutschen Reiche sehr verbreitete Kongregation der Barmherzigen Schwestern (s. d.). Sie widmen sich auch der Pflege von Geisteskranken. Vgl. Buß, Der Oi den der Barmherzigen Schwestern (Schaffhausen 1847) | Quelle: Meyers Großes Konversations-Lexikon, Band 20. Leipzig 1909, S. 178. Permalink: http://www.zeno.org/nid/20007654596
related match: Vincent de Paul

Soeur de St. Vincent de Paul
type: Label
in scheme: travel!digital Thesaurus

Templer
type: Concept
in scheme: travel!digital Thesaurus
pref label: Templer
definition: Duden: Angehöriger eines geistlichen Ritterordens im Mittelalter, der zum Schutz der Jerusalempilger verpflichtet ist; Tempelherr | Meyers Großes Konversations-Lexikon 1909: Templer, soviel wie Tempelherren; auch die Mitglieder der Tempelgesellschaft (s. d.). | Quelle: Meyers Großes Konversations-Lexikon, Band 19. Leipzig 1909, S. 407. | Permalink: http://www.zeno.org/nid/20007571763

Templer
type: Label
in scheme: travel!digital Thesaurus

Franziskaner
type: Concept
alternative label: Franciscaner
pref label: Franziskaner
in scheme: travel!digital Thesaurus
narrower: Minorit
definition: Duden: Angehöriger des Franziskanerordens | Meyers Großes Konversations-Lexikon 1907: Franziskaner (Fratres minores, Minoriten, mindere Brüder, seraphische Brüder, auch Barfüßer und graue Brüder), der älteste und noch jetzt am weitesten verbreitete Bettelorden, der es zuerst verstand, das Ideal der apostolischen Eigentumslosigkeit, durch das bisher die ketzerischen Parteien, zumal die Waldenser (s.d.), so großen Eindruck auf die Phantasie des Volkes erzielt hatten, im Dienste der Kirche nutzbar zu machen. Der Urheber der Bewegung, Franz von Assisi (s.d., S. 31 dieses Bandes), hatte diesem Ideal in einem freien, armen, nur durch die liebesinnige Hingabe an den Herrn gebundenen Leben nachstreben wollen. Ihre festgegliederte Organisation als in den Mechanismus der kirchlichen Hierarchie hineingestellter Bettelorden mit genau geregelter Verfassung und ins einzelne gehenden Statuten erhielt seine Stiftung erst durch die von ihm selbst als Neuerung schmerzlich empfundene Regel von 1221, die, 1223 umgebildet, von Papst Honorius III. bestätigt wurde. Noch zu Lebzeiten des Stifters führte der Gegensatz zwischen dem in der Ordensregel gepriesenen, von einer strengern Partei festgehaltenen Ideal der schlechthinigen Armut und dem der mildern Richtung, welche die bald reichlich herbeiströmenden Mittel zur Förderung der Zwecke des Ordens praktisch zu verwerten trachtete, zu lebhaften Konflikten. Besondern Vorschub leistete der laxern Partei der Ordensgeneral Elias von Cortona (1232–39), bis er der päpstlichen Gunst verlustig ging. Doch blieb auch nach seiner Absetzung die Tendenz auf Milderung der franziskanischen Grundsätze, begünstigt durch die Kurie, trotz zeitweiligen Sieges der strengern Richtung im Orden selbst (Johannes von Parma, 1247–57), bestehen. Nikolaus III. (Bulle Exiit von 1279) gestattete den Franziskanern zwar nicht den Besitz, wohl aber den Nießbrauch irdischer Güter, indem er zum Besitzer aller Ordensgüter den Papst erklärte. Durch diese Maßregel wurden die Geg…
alt label: Franciscaner

Franziskaner
type: Label
in scheme: travel!digital Thesaurus
hasVariant: Franciscaner

Franciscaner
type: Label
in scheme: travel!digital Thesaurus
isVariantOf: Franziskaner

Minorit
type: Concept
pref label: Minorit
in scheme: travel!digital Thesaurus
definition: Duden: Angehöriger eines selbstständigen Zweiges des Franziskanerordens | Meyers Großes Konversations-Lexikon 1908: Minoriten (Minores fratres, Mindere Brüder) war ursprünglich Selbstbezeichnung aller Franziskaner; später trugen die grau gekleideten jenen, die braun gekleideten diesen Namen. Weiteres s. Franziskaner. | Quelle: Meyers Großes Konversations-Lexikon, Band 13. Leipzig 1908, S. 883. | Permalink: http://www.zeno.org/nid/20007093896

Minorit
type: Label
in scheme: travel!digital Thesaurus

Johanniter
type: Concept
definition: Duden: Angehöriger des Johanniterordens | Meyers Großes Konversations-Lexikon 1907: Johanniterorden (später Rhodiser- und Malteserorden). Die Anfänge dieses ersten und ältesten geistlichen Ritterordens sind in Dunkel gehüllt. Nach den besten Quellen gründete Karl d Gr. in Jerusalem südlich und gegenüber von der heiligen Grabeskirche, auf dem jetzt Muristan genannten Platze, der seit 1869 der preußischen Krone gehört und seit 1898 eine protestantische St. Salvatorkirche trägt, ein Hospiz und eine St. Marienkirche, die zwar verfielen, aber durch Amalsitener restauriert wurden (etwa 1065). Die Kirche, Santa Maria latina genannt, gehörte den Benedikt inern, die bald darauf eine St. Maria Magdalenenkirche mit einem Hospiz erbauten, um den Pilgerinnen Unterkunft zu gewähren; sie wurden als Santa Maria latina major und minor unterschieden. Das ältere Hospital, für die Aufnahme von Männern bestimmt, war anfangs dem St. Johannes Eleemon aus Alexandria geweiht, nahm aber später St. Johannes Baptista zum Schutzpatron an und trennte sich unter einem gewissen Gerhard bald nach der Eroberung Jerusalems 1099 von der Verbindung mit jenen Kirchen. Die neue Bruderschaft erhielt eine eigne Verfassung und deren Bestätigung durch Paschalis II. (15. Febr. 1113). Nach Gerhards Tode (3. Sept. 1120) folgte Raymund von Puy als Meister, der den Brüdern die Pflichten der Armut, Keuschheit und des Gehorsams auferlegte und als Ordenstracht einen schwarzen Mantel mit weißem Kreuz auf der linken Seite vorschrieb; später verband er mit der Krankenpflege auch die Verpflichtung zum Schutz der Pilger und zum Kampf gegen die Muselmänner. Die Mitglieder zerfielen in Ritter adliger Geburt, Ordenspriester und dienende Brüder, die zum Kampf auszogen. den Kirchen- und Krankendienst übernahmen. Der Orden fand bald überall weite Verbreitung im ganzen Abendland und erwarb auch einen umfangreichen Besitz im Königreich Jerusalem. Innere Streitigkeiten, auch häufige Zwiste mit dem Orden der Templer schwächten bal…
alternative label: Johanniterbruder
narrower: Rhodiser
pref label: Johanniter
alt label: Johanniterbruder
in scheme: travel!digital Thesaurus

Rhodiser
type: Concept
related: Johanniterorden
related: Johanniterritter
in scheme: travel!digital Thesaurus
definition: Pierer's Universal-Lexikon 1862: Rhodiser (Rhodiser-Ritter), so v.w. Johanniter, während ihrer Besitzung der Insel Rhodos, s.d. | Quelle: Pierer's Universal-Lexikon, Band 14. Altenburg 1862, S. 121. | Permalink: http://www.zeno.org/nid/20010750789
pref label: Rhodiser
related: Malteser Orden

Johanniterorden
type: Concept
in scheme: travel!digital Thesaurus
pref label: Johanniterorden
related: Johanniter
definition: Duden: um 1100 in Jerusalem ursprünglich zur Pflege kranker Pilger gegründeter geistlicher Ritterorden | Meyers Großes Konversations-Lexikon 1907: Johanniterorden (später Rhodiser- und Malteserorden). Die Anfänge dieses ersten und ältesten geistlichen Ritterordens sind in Dunkel gehüllt. Nach den besten Quellen gründete Karl d Gr. in Jerusalem südlich und gegenüber von der heiligen Grabeskirche, auf dem jetzt Muristan genannten Platze, der seit 1869 der preußischen Krone gehört und seit 1898 eine protestantische St. Salvatorkirche trägt, ein Hospiz und eine St. Marienkirche, die zwar verfielen, aber durch Amalsitener restauriert wurden (etwa 1065). Die Kirche, Santa Maria latina genannt, gehörte den Benedikt inern, die bald darauf eine St. Maria Magdalenenkirche mit einem Hospiz erbauten, um den Pilgerinnen Unterkunft zu gewähren; sie wurden als Santa Maria latina major und minor unterschieden. Das ältere Hospital, für die Aufnahme von Männern bestimmt, war anfangs dem St. Johannes Eleemon aus Alexandria geweiht, nahm aber später St. Johannes Baptista zum Schutzpatron an und trennte sich unter einem gewissen Gerhard bald nach der Eroberung Jerusalems 1099 von der Verbindung mit jenen Kirchen. Die neue Bruderschaft erhielt eine eigne Verfassung und deren Bestätigung durch Paschalis II. (15. Febr. 1113). Nach Gerhards Tode (3. Sept. 1120) folgte Raymund von Puy als Meister, der den Brüdern die Pflichten der Armut, Keuschheit und des Gehorsams auferlegte und als Ordenstracht einen schwarzen Mantel mit weißem Kreuz auf der linken Seite vorschrieb; später verband er mit der Krankenpflege auch die Verpflichtung zum Schutz der Pilger und zum Kampf gegen die Muselmänner. Die Mitglieder zerfielen in Ritter adliger Geburt, Ordenspriester und dienende Brüder, die zum Kampf auszogen. den Kirchen- und Krankendienst übernahmen. Der Orden fand bald überall weite Verbreitung im ganzen Abendland und erwarb auch einen umfangreichen Besitz im Königreich Jerusalem. Innere Streitigkeite…

Johanniterorden
type: Label
in scheme: travel!digital Thesaurus

Johanniterritter
type: Concept
definition: bdk: Johanniter, Ritter
in scheme: travel!digital Thesaurus
pref label: Johanniterritter
related: Johanniter

Johanniterritter
type: Label
in scheme: travel!digital Thesaurus

Rhodiser
type: Label
in scheme: travel!digital Thesaurus

Malteser Orden
type: Concept
definition: Meyers Großes Konversations-Lexikon 1907: Johanniterorden (später Rhodiser- und Malteserorden). Die Anfänge dieses ersten und ältesten geistlichen Ritterordens sind in Dunkel gehüllt. Nach den besten Quellen gründete Karl d Gr. in Jerusalem südlich und gegenüber von der heiligen Grabeskirche, auf dem jetzt Muristan genannten Platze, der seit 1869 der preußischen Krone gehört und seit 1898 eine protestantische St. Salvatorkirche trägt, ein Hospiz und eine St. Marienkirche, die zwar verfielen, aber durch Amalsitener restauriert wurden (etwa 1065). Die Kirche, Santa Maria latina genannt, gehörte den Benedikt inern, die bald darauf eine St. Maria Magdalenenkirche mit einem Hospiz erbauten, um den Pilgerinnen Unterkunft zu gewähren; sie wurden als Santa Maria latina major und minor unterschieden. Das ältere Hospital, für die Aufnahme von Männern bestimmt, war anfangs dem St. Johannes Eleemon aus Alexandria geweiht, nahm aber später St. Johannes Baptista zum Schutzpatron an und trennte sich unter einem gewissen Gerhard bald nach der Eroberung Jerusalems 1099 von der Verbindung mit jenen Kirchen. Die neue Bruderschaft erhielt eine eigne Verfassung und deren Bestätigung durch Paschalis II. (15. Febr. 1113). Nach Gerhards Tode (3. Sept. 1120) folgte Raymund von Puy als Meister, der den Brüdern die Pflichten der Armut, Keuschheit und des Gehorsams auferlegte und als Ordenstracht einen schwarzen Mantel mit weißem Kreuz auf der linken Seite vorschrieb; später verband er mit der Krankenpflege auch die Verpflichtung zum Schutz der Pilger und zum Kampf gegen die Muselmänner. Die Mitglieder zerfielen in Ritter adliger Geburt, Ordenspriester und dienende Brüder, die zum Kampf auszogen. den Kirchen- und Krankendienst übernahmen. Der Orden fand bald überall weite Verbreitung im ganzen Abendland und erwarb auch einen umfangreichen Besitz im Königreich Jerusalem. Innere Streitigkeiten, auch häufige Zwiste mit dem Orden der Templer schwächten bald seine Macht, doch tat er auf allen Kreuz…
in scheme: travel!digital Thesaurus
related: Malteser
alt label: Malteserorden
pref label: Malteser Orden
related: Johanniterorden
alternative label: Malteserorden

Malteserorden
type: Label
isVariantOf: Malteser Orden
in scheme: travel!digital Thesaurus

Malteser Orden
type: Label
hasVariant: Malteserorden
in scheme: travel!digital Thesaurus

Johanniter
type: Label
in scheme: travel!digital Thesaurus

Johanniterbruder
type: Label
in scheme: travel!digital Thesaurus

Lazarist
type: Concept
pref label: Lazarist
in scheme: travel!digital Thesaurus
definition: Duden: Angehöriger einer katholischen Kongregation von Missionspriestern | Meyers Großes Konversations-Lexikon 1908: Lazaristen (Lazariten), in Frankreich die Priester der von Vinzenz de Paul 1624 gestifteten und von Urban VIII. 1632 bestätigten Kongregation für innere Mission mit einfachen Gelübden, die ihren Namen von der Priorei Saint-Lazare in Paris hat. | Die L. sind in allen Erdteilen besonders als Jugendlehrer, Kranken- und Armenpfleger tätig. In Polen gewannen sie unter dem Namen Väter der Mission als Lehrer in den Seminaren und als geistliche Zensoren Einfluß. Besondern Aufschwung nahmen sie unter ihrem General Etienne (1843–1874), und ihre Mitgliederzahl stieg von (1845) 600 auf (1904) 3407 (darunter 1827 Priester) in 31 Provinzen. Aus Deutschland sind sie als Verwandte der Jesuiten seit 13. Mai 1873 ausgewiesen. Ihr Wappen zeigt die Abbildung. Vgl. L. K. Goetz, L. und Jesuiten (Gotha 1898). | Quelle: Meyers Großes Konversations-Lexikon, Band 12. Leipzig 1908, S. 274. | Permalink: http://www.zeno.org/nid/20006983340
related match: Vincent de Paul

Lazarist
type: Label
in scheme: travel!digital Thesaurus

Ursulinerin
type: Concept
definition: Duden: Angehörige eines katholischen Schwesternordens mit der Verpflichtung zur Erziehung der weiblichen Jugend | Meyers Großes Konversations-Lexikon 1909: Ursulinerinnen (Ursulinen), eine nach der heil. Ursula (s. d.) benannte, 1535 (1537) durch Angela Merici (s. Angela 2) in Brescia gestiftete und 1544 von Paul III. bestätigte Kongregation für Jugendunterricht und Krankenpflege. Zu ihrer Verbreitung trug besonders Kardinal Borromeo (s. d. 1) bei. 1604 konstituierte sich in Paris ein Orden der U. mit feierlichen [967] Gelübden und strenger Klausur, die bald auch in Deutschland Ausbreitung fanden, wo ihre Unterrichtsanstalten während des Kulturkampfes (1875) aufgehoben wurden. | Zurzeit bestehen über 300 Klöster der U., davon 39 in Deutschland, mit etwa 7000 Schwestern; ihr Wappen zeigt die Abbildung. Vgl. Sainte-Foi, Annales de l'ordre de sainte Ursule (Clermont 1858, 5 Bde.); Meer, Der Orden der Ursulinen in Schlesien (Bresl. 1878); At, Histoire de sainte Angèle Merici (Par. 1885). | Quelle: Meyers Großes Konversations-Lexikon, Band 19. Leipzig 1909, S. 967-968. | Permalink: http://www.zeno.org/nid/20007631316
pref label: Ursulinerin
in scheme: travel!digital Thesaurus

Ursulinerin
type: Label
in scheme: travel!digital Thesaurus

Chorherr des heiligen Grabes
type: Concept
in scheme: travel!digital Thesaurus
pref label: Chorherr des heiligen Grabes
definition: Pierer's Universal-Lexikon 1859: Heiligen Grabsorden, 1) Orden regulirter Chorherren vom H. Grab, gestiftet 1114 von Arnold, Patriarch von Jerusalem, über ganz Europa verbreitet; 1495 aufgehoben. 2) Regulirte Chordamen vom H. G., von demselben Stifter, sehr verbreitet u. wie die Chorherren 1637 vom Papst Urban VIII. mit einer neuen Regel begabt; jetzt bestehen sie noch in Holland, Frankreich u. Baden, in letzterem Lande mit der Bestimmung, daß das Ordensgelübde immer nur auf drei Jahre von Neuem abgelegt wird; sie leben in strenger Clausur u. beschäftigen sich auch mit der Erziehung u. dem Unterricht junger Mädchen, wodurch sie ihren Unterhalt erwerben; Tracht: weites schwarzes Oberkleid, mit einem vorn u. über dem Rücken herabhängenden Chorhemd, schwarzer (bei den Novizen weißer) Schleier, auf der linken Brust ein rothseidenes Kreuz, dessen Querstreifen von ungleicher Länge sind, im Chor ein langer schwarzer Mantel. 3) Geistlicher Ritterorden vom H. Grab zu Jerusalem, gestiftet 1496 vom Papst Alexander VI., zu Beschwichtigung des über die Aufhebung der Chorherren vom H. G. sehr erbosten Adels; Zweck: Beförderung der Wallfahrten zum Heiligen Grabe etc. Großmeister der Papst, Stellvertreter der Guardian der Franciscaner zu Jerusalem. Der Orden verbreitete sich über ganz Europa, erlosch im 18. Jahrh., aber Ludwig XVIII. nahm ihn am 10. August 1814 als königlich französischen Orden wieder auf, ordnete vier Klassen: Großoffiziere, Offiziere, Ritter u. Novizen, im Ganzen 450 Mitglieder ohne die Prinzen des Hauses, an u. ließ sie bei der Aufnahme Aufrechthaltung der Ehre, der Religion u. des Ordens u. dem Könige Treue schwören. Das Jahr 1830 machte ihm wieder ein Ende. 4) Geistlicher Ritterorden vom H. Grab in England, angeblich gestiftet 1174 von König Heinrich II. von England, nach Regel u. Statuten des vorigen; Zeichen: ein grünes Doppelkreuz mit Kleeblättern an den Spitzen; verband die Ritter, wenigstens zwei Jahre lang das Heilige Grab zu Jerusalem zu hüten etc.; gin…

Chorherr des heiligen Grabes
type: Label
in scheme: travel!digital Thesaurus

Kopte
type: Concept
definition: Duden: Angehöriger der christlichen Kirche Ägyptens | Meyers Großes Konversations-Lexikon 1907: Kopten, die christlichen Nachkommen der alten Ägypter, hauptsächlich in den Städten des nördlichen Oberägypten sitzend, vor allem in Siut und Achmîm, die zum größern Teil von K. bewohnt werden. Während sie sich hier und in Mittelägypten ziemlich rein erhalten haben, sind sie in Unterägypten vor der mohammedanischen Eroberung nicht unvermischt geblieben. Außerhalb des eigentlichen Ägypten ist die Zahl der in den Städten angesiedelten K. sehr gering, während koptische Landbauer ganz fehlen. In ihrem Körperbau zeigen die K. noch den altägyptischen Typus: breite, meist niedrige Stirn, schwarzes, leicht gekräuseltes Haar, gerade, scharf geschnittene Nase, dazu Augen, die von länglichem Schnitt, aber groß und von strahlendem Schwarz sind. Die Hautfarbe wechselt von Gelblich bis Braun (s. Tafel »Afrikanische Völker I«, Fig. 6 u. 7). Von den Fellah unterscheiden sich die K. in den Städten durch feinern Knochenbau, das selten 1,6 m übersteigende mittlere Maß ihrer Körperhöhe und hellere Gesichtsfarbe, bedingt durch die Beschäftigung mit den höhern Gewerben und feinern Handarbeiten (Uhrmacher, Gold- und Silberarbeiter, Juweliere, Schneider, Goldsticker, Weber, Verfertiger falscher Altertümer) oder durch die Arbeit mit der Feder als Schreiber, Rechenmeister, Notare, Buchhalter etc. Die koptischen Ackerbauer und Kameltreiber sind dagegen den Fellah körperlich durchaus gleich. Durch ihre Tracht (schwarzer oder blauer Turban, dunkle Kleider) unterscheiden sich die K., namentlich Schreiber und Geistliche, sogleich von den Arabern. Der Name der K. wird wohl am besten vom griechischen Aigyptos (arab. Ghubt oder Kübt) abgeleitet. Ihre Sprache ist auf das engste mit dem Altägyptischen verwandt, jetzt aber als Volkssprache völlig erloschen (s. Koptische Sprache). Auch manche Sitten der K. erinnern noch an die alten Ägypter, so die Beschneidung, die sie keineswegs von den verhaßten Mohammedan…
related match: Coptic Orthodox Church of Alexandria
pref label: Kopte
in scheme: travel!digital Thesaurus

Kopte
type: Label
in scheme: travel!digital Thesaurus

Christengemeinde
type: Label
in scheme: travel!digital Thesaurus

Christ
type: Label
hasTranslation: orang mesehi
in scheme: travel!digital Thesaurus

orang mesehi
type: Label
isTranslationOf: Christ
in scheme: travel!digital Thesaurus

Judenchrist
type: Concept
related: Jude
in scheme: travel!digital Thesaurus
pref label: Judenchrist
definition: Duden: 1. (im Urchristentum) Christ jüdischer Herkunft im Unterschied zum Heidenchristen | 2. Jude, der zum Christentum übergetreten ist [ohne seinen jüdischen Glauben innerlich aufzugeben] | Meyers Großes Konversations-Lexikon 1907: Judenchristen, moderne Bezeichnung derjenigen Christen, die, nachdem sie vom Judentum zum Christentum übergetreten waren, die fortdauernde Gültigkeit des mosaischen Zeremonial- und Ritualgesetzes, sei es für alle Christen, sei es wenigstens für die gebornen Juden, behaupteten, sich an die Urapostel, besonders an Petrus und Jacobus, anschlossen und gegen die Lehrweise des Apostels Paulus einen mehr oder minder schroffen Gegensatz bildeten. Wie der Mittelpunkt des Heidenchristentums Antiochia ward, so blieb Jerusalem geraume Zeit Hauptsitz des Judenchristentums. Vgl. Ebioniten, Nazarener. | Quelle: Meyers Großes Konversations-Lexikon, Band 10. Leipzig 1907, S. 341. | Permalink: http://www.zeno.org/nid/20006846750

Judenchrist
type: Label
in scheme: travel!digital Thesaurus

Monothelet
type: Concept
pref label: Monothelet
in scheme: travel!digital Thesaurus
definition: Duden: Vertreter des Monotheletismus | Duden: Monotheletismus: altchristliche Sektenlehre, die in Christus zwei unvereinigte Naturen, aber nur einen gottmenschlichen Willen wirksam glaubte | Meyers Großes Konversations-Lexikon 1908: Monothelēten (griech.), Bezeichnung derjenigen Partei in der orientalischen Kirche, die im Gegensatz zu der rechtgläubigen Lehre, wonach die zwei Naturen auch zwei Willen forderten, an einem gottmenschlichen Willen in Christus festhielten. Der Kaiser Heraklios (s. d.) hatte 633 auf den Rat seines Patriarchen Sergius diese Formel zur Grundlage einer Einigung zwischen Diphysiten und Monophysiten (s. d.) machen wollen. Aber die diphysitische Orthodoxie witterte hinter dem neuen Schlagwort die alte monophysitische Ketzerei. Es entstand ein heftiger Streit, den Heraklios und sein Nachfolger Konstans 11. durch vermittelnde Edikte (»Ekthesis« 638, »Typos« 648) vergeblich beizulegen versuchten. Während Papst Honorius I. (s. d.) an der monotheletischen Formel nichts auszusetzen fand, wurde sie von Papst Martin I. auf der ersten Lateransynode 649 und von dem sechsten ökumenischen Konzil in Konstantinopel unter Führung des Papstes Agatho 680–681 verworfen und hier bestimmt, daß in Christus zwei den beiden Naturen entsprechende Willen und Wirkungsweisen seien, wobei sich der menschliche Wille dem göttlichen stets unterordne. Aus den Überresten der kirchlich ausgeschiedenen M. entstand die Sekte der Maroniten (s. d.). Vgl. Harnack, Lehrbuch der Dogmengeschichte, Bd. 2 (3. Aufl., Freiburg 1894); Owsepian, Die Entstehungsgeschichte des Monotheletismus (Leipz. 1897). | Quelle: Meyers Großes Konversations-Lexikon, Band 14. Leipzig 1908, S. 80. | Permalink: http://www.zeno.org/nid/20007106440
related match: Monothelitism

Monothelet
type: Label
in scheme: travel!digital Thesaurus

Melchit
type: Concept
pref label: Melchit
in scheme: travel!digital Thesaurus
definition: Duden: Angehöriger der syrischen, ägyptischen und palästinensischen Christenheit mit byzantinischer Liturgie | Meyers Großes Konversations-Lexikon 1908: Melchiten (Melikiten, syrisch Malkaji, »Königliche«, vom syrischen melik, »König«, so genannt, weil sie, dem Edikt des Kaisers Marcian von 452 Folge[574] leistend, die Beschlüsse des Konzils von Chalcedon annahmen und die monophysitische Lehre verwarfen), Name der griechisch-katholischen (unierten griechischen) Christen syrischen Ursprungs in Syrien, Palästina und Ägypten, die aus der orthodoxen griechischen Kirche hervorgegangen, seit 1686 mit Rom uniert und unter einem in Damaskus residierenden Patriarchen (mit dem Titel »Patriarch von Antiochia und des ganzen Orients«) stehen. Zum Unterschied von den orthodoxen Griechen (Rûm) nennen sich die M. »Katholiken« (Katlûki, Kuttâli, Mehrz. Kwâtile); sie zählen zu den reichsten und vornehmsten Christen im Orient und beschäftigen sich viel mit Handel. Ihre Gesamtzahl wird auf ungefähr 130,000 angegeben. Obgleich sie die Suprematie des römischen Papstes anerkennen, so weichen sie in ihren kirchlichen Gebräuchen und Einrichtungen doch ziemlich stark von der römischen Kirche ab: so haben sie noch den griechischen Ritus und die griechische Liturgie des heil. Basilius und heil. Chrysostomus, aber in arabischer Sprache, ferner den julianischen Kalender, die Priesterehe und nehmen das Abendmahl in beiderlei Gestalt. Die Taufe wird bei ihnen, ebenso wie bei den Griechen, durch vollständiges Untertauchen, nicht bloß durch Begießung, vollzogen. Die Priestertracht ist die gleiche wie bei den orthodoxen (oder, wie die M. sagen, schismatischen) Griechen. Vgl. Silbernagl, Verfassung und gegenwärtiger Bestand sämtlicher Kirchen des Orients (2. Aufl., Regensb. 1904). | Quelle: Meyers Großes Konversations-Lexikon, Band 13. Leipzig 1908, S. 574-575. | Permalink: http://www.zeno.org/nid/20007072368

Melchit
type: Label
in scheme: travel!digital Thesaurus

Heidenchristen
type: Concept
related: Heide
in scheme: travel!digital Thesaurus
pref label: Heidenchristen
definition: Duden: Heidenchristentum: (in ur- und frühchristlicher Zeit) durch die Mission des Apostels Paulus unter den nicht jüdischen Völkern begründetes Christentum | Meyers Großes Konversations-Lexikon 1907: Heidenchristen heißen im allgemeinen alle aus dem Heidentum zum Christentum Übergetretenen. In der Geschichte des Urchristentums nennt man H. diejenigen Gläubigen, die, ohne zuerst Proselyten des Judentums zu werden, vom Apostel Paulus als mit den Judenchristen (s. d.) gleichberechtigte Glieder der christlichen Gemeinde und Bürger des Gottesreichs behandelt wurden. Der Kampf um die Berechtigung dieses Schrittes füllt noch das Leben des Paulus aus, während bald nachher die H. so sehr die große Mehrheit bildeten, daß das Judenchristentum sich entweder ihnen fügen oder aus der Kirche ausscheiden mußte. | Quelle: Meyers Großes Konversations-Lexikon, Band 9. Leipzig 1907, S. 63. | Permalink: http://www.zeno.org/nid/2000675547X

Heide
type: Concept
pref label: Heide
in scheme: travel!digital Thesaurus
related: Heidentum
related match: Paganism
definition: Duden: jemand, der nicht der christlichen, jüdischen oder muslimischen Religion angehört; jemand, der nicht an Gott glaubt [und noch bekehrt werden muss] | Meyers Großes Konversations-Lexikon 1907: Heiden (Ethnici, Pagani), Gesamtbezeichnung der Bekenner andrer Religions- und Kultusformen als der monotheistischen. Nach der herkömmlichen Auffassung nannten die Christen etwa seit der Mitte des 4. Jahrh. die Anhänger des alten Götterdienstes pagani (von pagus, Dorf), weil dieser als eine Bauernreligion nur auf dem Lande noch ein kümmerliches Dasein fristete. Dieser Etymologie ist vielleicht die andre vorzuziehen, wonach ursprünglich paganus (Zivilist) im Gegensatze zu miles (nämlich Christi, Streiter Christi) gebildet wurde. Die zum Christentum bekehrten Deutschen übertrugen den Ausdruck in ihre Sprache und nannten die götzendienerischen Nichtchristen H., Bewohner der Heiden, bei denen sich auch der altgermanische Kult am längsten erhielt. Noch jetzt gibt es trotz der Mission (s. d.) mehr als 800 Mill. H. S. die »Religions- und Missionskarte der Erde«. | Quelle: Meyers Großes Konversations-Lexikon, Band 9. Leipzig 1907, S. 63. | Permalink: http://www.zeno.org/nid/20006755399

Heide
type: Label
in scheme: travel!digital Thesaurus

Heidentum
type: Concept
alternative label: Heidenthum
in scheme: travel!digital Thesaurus
pref label: Heidentum
alt label: Heidenthum
definition: Duden: 1. Zustand des Nicht-zum-Christentum-bekehrt-Seins; Religionen und religiöse Vorstellungen der Heiden | 2. Gesamtheit der Heiden, heidnische Welt | Meyers Großes Konversations-Lexikon 1907: Heidentum, Gesamtbezeichnung der Religionsformen außer der jüdischen, christlichen und mohammedanischen; s. Heiden. | Quelle: Meyers Großes Konversations-Lexikon, Band 9. Leipzig 1907, S. 65. | Permalink: http://www.zeno.org/nid/20006755615

Heidentum
type: Label
in scheme: travel!digital Thesaurus
hasVariant: Heidenthum

Heidenthum
type: Label
in scheme: travel!digital Thesaurus
isVariantOf: Heidentum

Heidenchristen
type: Label
in scheme: travel!digital Thesaurus

Sclave
type: Label
isVariantOf: Sklave
in scheme: travel!digital Thesaurus

Sklave
type: Label
hasTranslation: slave
hasVariant: Sclave
in scheme: travel!digital Thesaurus

slave
type: Label
isTranslationOf: Sklave
in scheme: travel!digital Thesaurus

Negersklave
type: Concept
definition: bdk: siehe Neger, Sklave
pref label: Negersklave
in scheme: travel!digital Thesaurus
related: Neger

Negersklave
type: Label
in scheme: travel!digital Thesaurus

Neger
type: Concept
pref label: Neger
narrower: Sudanneger
narrower: Negerknabe
in scheme: travel!digital Thesaurus
definition: Duden: 1. Person von [sehr] dunkler Hautfarbe | Meyers Großes Konversations-Lexikon 1908: Neger (v. lat. niger, »schwarz«; Nigritier, Äthiopier), Menschenrasse Afrikas, deren Verbreitung verschieden gedeutet ist. Fr. Müller will zu den Negern nur die Völker des westlichen und mittlern Afrika gerechnet wissen, Peschel alle Völker vom Südrande der Sahara südwärts bis zum Gebiete der [496] Hottentotten und Buschmänner und scheidet die N. in Sudânneger und Bantu (s. d.), Ratzel alle dunleln, wollhaarigen Afrikaner, mit Ausschluß der hellen Südafrikaner und hellern Nord- und Ostafrikaner. Die meisten N. haben hohe und schmale Schädel (Gesichtswinkel 66–67°), zu denen sich Vortreten des Oberkiefers und schiefe Stellung der Zähne (Prognathismus) gesellt. Dazu kommen meist wulstige Lippen, im allgemeinen schwache Behaarung des Körpers (im Gesicht und am Kopf wollig verfilzt) und schwacher Bartwuchs. Allen gemeinsam gilt die beharrliche Dunkelung der Haut in vielen Abstufungen, vom rötlichen Braun bis zum tiefsten Dunkelbraun, die auch von weit gröberer Textur ist als bei den Hellfarbigen. Den Geruch der Rasse führt Falkenstein auf öligere Beschaffenheit des Schweißes zurück, der bei unreinlicher Lebensweise leicht ranzige Säure entwickelt. Die mittlere Körpergröße beträgt 1,68 m (bei den Kaffern 1,80 m). Bemerkenswert sind: die Dicke des Halses, die verhältnismäßig geringe Biegung der Wirbelsäule, das enge, keilförmige Becken, die Dicke und Elastizität der Haut. Die körperliche Leistungsfähigkeit hat sich unter dem Druck besonderer Verhältnisse zu bedeutender Höhe entwickelt; weniger geeignet für ununterbrochene Arbeit, sind sie dem Europäer überlegen an Geschwindigkeit und stürmischem Kraftaufwand. Von Charakter heiter, eitel, gefallsüchtig, lügenhaft und sinnlich, aber sehr gelehrig, machen sie europäische Erzeugnisse mit großer Geschicklichkeit nach, eignen sich fremde Sprachen schnell an und sind in den Schulen rasch auffassende Schüler. Musik lieben sie sehr, in Holzsc…
related: Rasse

Neger
type: Label
in scheme: travel!digital Thesaurus

Negerknabe
type: Concept
definition: bdk: siehe Neger | Duden: Knabe: 1. (veraltend, sonst gehoben, Amtssprache, schweizerisch, österreichisch) Junge
in scheme: travel!digital Thesaurus
pref label: Negerknabe

Negerknabe
type: Label
in scheme: travel!digital Thesaurus

Rasse
type: Concept
narrower: Mischrasse
pref label: Rasse
definition: Duden: 3. Bevölkerungsgruppe mit bestimmten gemeinsamen biologischen Merkmalen | Meyers Großes Konversations-Lexikon 1908: Menschenrassen (hierzu die »Ethnographische Karte«, mit Textblatt: »Übersicht der Menschenrassen und Völkerschaften«), die verschiedenen, durch besondere typische Eigenschaften (Rassenmerkmale) gekennzeichneten Gruppen, in die das Menschengeschlecht zerfällt. Ob man die so gebildeten Gruppen im zoologischen Sinn als ebenso viele verschiedene Arten (Spezies) oder als Rassen, d. h. als konstant gewordene (erbliche) Varietäten einer einzigen Art, anzusehen hat, wird so lange eine offene Frage bleiben, bis über die Begriffe Art, Varietät und Rasse Übereinstimmung unter den Naturforschern herrschen wird. Die Ansichten über die Kriterien, die man an eine Art und eine Varietät zu stellen hat, gehen noch sehr auseinander. Im allgemeinen kann man wohl sagen, daß eine Anzahl charakteristischer Züge und deren regelmäßige, fortgesetzte Vererbbarkeit sowie Fruchtbarkeit der Individuen innerhalb der Art und Unfruchtbarkeit zwischen Individuen verschiedener Arten die Spezies kennzeichnen. Allerdings sind auch diese Kriterien durch die Transformationslehre zum Teil hinfällig geworden, die den Nachweis erbracht hat, daß für konstant gehaltene Merkmale sich abändern und neu entstandene Merkmale sich vererben können, sowie daß Kreuzungen innerhalb der Art vorkommen (z. B. zwischen Wolf und Hund, Ziege und Schaf, Gemse und Schaf u. a.), daß also auch die Art wandelbar ist. Halten wir indessen an der oben gegebenen Definition der Art fest, so würde bezüglich des Menschen die Möglichkeit einer scheinbar unbegrenzten Fruchtbarkeit geschlechtlicher Mischungen zwischen den Vertretern verschiedener M., desgleichen die allmählichen Übergänge, die von einer Rasse zur andern stattfinden, gegen die Annahme verschiedener Menschenarten sprechen. Über die Veränderlichkeit des Typus Mensch herrscht allerdings unter den Anthropologen ebenfalls keine Übereinstimmung. Während auf d…
alt label: Race
alternative label: Race
in scheme: travel!digital Thesaurus

Rasse
type: Label
hasVariant: Race
in scheme: travel!digital Thesaurus

Race
type: Label
isVariantOf: Rasse
in scheme: travel!digital Thesaurus

ständisch
type: Concept
definition: Duden: 1. die Stände betreffend; von den Ständen herrührend
pref label: ständisch
in scheme: travel!digital Thesaurus
related: Stand

ständisch
type: Label
in scheme: travel!digital Thesaurus

Dynastie
type: Concept
narrower: abbasidisch
narrower: Aglabide
narrower: Lodî-Dynastie
narrower: Ghassanide
narrower: Osmanlí
narrower: Hamdanide
narrower: Mamluke
narrower: Khaljî
narrower: Zijanide
narrower: Tughlakdynastie
narrower: Obrenowitsch
narrower: Karaman
narrower: Hasmonäer
narrower: Kutb Shâh
narrower: Merinide
narrower: Sakya
narrower: Pândya
narrower: Sassanide
alt label: Nebendynastie
narrower: Saiyid
narrower: Hohenstaufe
narrower: borgitisch
narrower: Angelos-Dynastie
narrower: hafsidisch
narrower: almohadisch
narrower: Râjpute
narrower: merinidisch
narrower: Seleukide
narrower: Lodî
narrower: Omaijade
narrower: Mermnade
narrower: Ptolemäer
narrower: Hilalide
narrower: Husseinit
narrower: nasridisch
narrower: Tantalide
narrower: Tomar
narrower: Antistier
narrower: Idriside
narrower: Atabeke
definition: Duden: 1. Herrschergeschlecht; Herrscherhaus | 2. auf einem bestimmten Gebiet bekannte oder hervorragende, Einfluss ausübende Familie, Gruppe | Meyers Großes Konversations-Lexikon 1906: Dynastīe (griech.), Herrschergeschlecht, Fürsten-, Herrscherhaus; dynastisch, auf die Dynastie bezüglich, diese betreffend, z. B. dynastische Interessen (im Gegensatz zu den Interessen des Volkes oder des Staates). | Quelle: Meyers Großes Konversations-Lexikon, Band 5. Leipzig 1906, S. 325. | Permalink: http://www.zeno.org/nid/20006524621
narrower: Attalide
narrower: Karamanli
narrower: Branchide
narrower: Djambelât
narrower: Flavier
narrower: omaijadisch
narrower: Kuschândynastie
narrower: Râjputendynastie
alternative label: Nebendynastie
narrower: Zijaniden-Dynastie
narrower: Medici
narrower: Komnene
narrower: Karamanlidynastie
narrower: Bragança
in scheme: travel!digital Thesaurus
narrower: Sertier
narrower: seldschukisch
narrower: Thayhri
narrower: Tomardynastie
narrower: Tughlak Shâh
narrower: Paläologos
narrower: Tughlak
narrower: Morabitîn
narrower: Eijubide
narrower: Makkabäer
narrower: Filali
narrower: Fâtimide
alternative label: Haus
narrower: Anjou und Aragonien
narrower: Maʿanîde
narrower: Sklavendynastie
narrower: ptolemäisch
narrower: Abbaside
narrower: Kara Osman Oglu
narrower: râjputanisch
related: Geschlecht
narrower: herodianisch
narrower: Zirit

abbasidisch
type: Concept
related: Abbaside
pref label: abbasidisch
in scheme: travel!digital Thesaurus
definition: bdk: die Abbasiden betreffend; von den Abssiden stammend, zu ihnen gehörend

Abbaside
type: Concept
alternative label: ʿAbbaside
in scheme: travel!digital Thesaurus
related match: Abbasid Caliphate
alt label: ʿAbbaside
definition: Duden: Angehöriger eines in Bagdad ansässigen Kalifengeschlechts | Meyers Großes Konversations-Lexikon 1905: Abbasiden, 1) Kalifendynastie, s. Abbas 1) und Kalifen. – 2) Persische Dynastie, s. Abbas 2). | Quelle: Meyers Großes Konversations-Lexikon, Band 1. Leipzig 1905, S. 14. | Permalink: http://www.zeno.org/nid/20006183166
pref label: Abbaside
alt label: Abbâside
alternative label: Abbâside

ʿAbbaside
type: Label
isVariantOf: Abbaside
in scheme: travel!digital Thesaurus
isVariantOf: Abbâside

Abbaside
type: Label
hasVariant: ʿAbbaside
hasVariant: Abbâside
in scheme: travel!digital Thesaurus

Abbâside
type: Label
hasVariant: ʿAbbaside
in scheme: travel!digital Thesaurus
isVariantOf: Abbaside

abbasidisch
type: Label
in scheme: travel!digital Thesaurus

Aglabide
type: Concept
in scheme: travel!digital Thesaurus
pref label: Aglabide
definition: Meyers Großes Konversations-Lexikon 1905: Aghlabiden, arab. Dynastie in Nordafrika, von den abbasidischen Kalifen eingesetzt, aber tatsächlich unabhängig, eroberte 827–878 Sizilien, wurde 910 von den Fatimiden (s. d.) gestürzt. | Quelle: Meyers Großes Konversations-Lexikon, Band 1. Leipzig 1905, S. 169. | Permalink: http://www.zeno.org/nid/20006199623

Aglabide
type: Label
in scheme: travel!digital Thesaurus

Lodî-Dynastie
type: Concept
related: Lodî
pref label: Lodî-Dynastie
in scheme: travel!digital Thesaurus
definition: bdk: siehe Lodî, Dynastie

Lodî
type: Concept
definition: Meyers Großes Konversations-Lexikon 1906: Dehli (Delhi), 1) Hauptstadt der britisch-ind. Division D. (s. oben) und des Distrikts D. (3305 qkm mit [1891] 638,689 Einw.), am rechten Ufer der Dschamna, 252 m ü. M., hat (1901) 208,385 Einw. (über die Hälfte Hindu, etwa 80,000 Mohammedaner). Die auf dem hohen, aufgemauerten Ufer der Dschamna gelegene Stadt ist auf den übrigen drei Seiten von einer hohen, starken, 9 km langen Mauer nebst Graben und Glacis umgeben. Die enge, schmutzige Südwesthälfte der Stadt wird von den Eingebornen bewohnt, die andre Hälfte dagegen enthält einige der schönsten Bauwerke Indiens, darunter den kaiserlichen Palast, ein mächtiges mauerumsäumtes Gebäude am Flußufer, von 1000 m Länge und 500 m Breite. Zwei prächtige Tore aus rotem Sandstein führen in ein mächtiges Gewölbe, dann in den [586] Diwan-i-Khas, einen Pavillon aus weißem Marmor mit vier vergoldeten Marmorkuppeln und Mosaiken aus edlen Steinen. Gegenüber die kleine Perlmoschee (Moti Masdschid) aus weißem Marmor, mit drei vergoldeten Kuppeln. Jetzt ist der Palast in Kasernen, Arsenal und Festung verwandelt. Außerhalb liegt das imposanteste Gebäude Dehlis, die Dschama Masdschid, die größte Moschee der Welt. Sie erhebt sich auf einem 9,5 m hohen, 140 m breiten und langen Viereck von roten Sandsteinquadern und ist aus weißem Marmor erbaut, der mosaikartig mit rotem Sandstein abwechselt. Den Haupteingang bildet eine prächtige Freitreppe, die Decke drei weiße Marmorkuppeln mit schwarzen Streifen, an jedem Ende der Front ein 45,6 m hohes Minaret. Südlich vom Fort liegen eine Kaserne, vier Kirchen, der Palast des Gouverneurs, das Institut mit Museum und Bibliothek. Eine in der Blütezeit Dehlis errichtete, nachmals verwahrloste Wasserleitung wurde von der englischen Regierung wiederhergestellt. D. besitzt viele Schulen, 13 Druckereien und ebenso viele Zeitungen. Die Industrie ist nicht bedeutend; berühmt sind aber die Gold- und Silberarbeiten, Musselin- und Schalweberei und Schnitzerei. Die Bede…
in scheme: travel!digital Thesaurus
pref label: Lodî

Lodî
type: Label
in scheme: travel!digital Thesaurus

Lodî-Dynastie
type: Label
in scheme: travel!digital Thesaurus

Ghassanide
type: Concept
definition: Meyers Großes Konversations-Lexikon 1907: Ghassaniden (Gassaniden), südarab. Fürstengeschlecht, wanderte nach der Überlieferung noch vor Zenobias Zeit in Syrien ein und gewann die Herrschaft über bedeutende Teile Syriens. Die G., monophysitische Christen, besaßen eine höhere Kultur als ihre Feinde, die Lachmiden von Hira. Sie waren Vasallen Ostroms und bildeten das Bollwerk des oströmischen Reiches in den langjährigen Kämpfen zwischen Oströmern und Persern. Der berühmteste der G. war Harith ibn Dschabala (Arethas, 529–69 n. Chr.), dem Kaiser Justinian den Titel eines Patrikios verlieh. Unter ihrem Oberhaupt Dschabala ibn el Eiham kämpften die G. im oströmischen Heer 636 am Jarmuk gegen die Mohammedaner und wurden dabei vernichtet. Vgl. Nöldeke, Die ghassanischen Fürsten aus dem Hause Gasnas (Berl. 1887). | Quelle: Meyers Großes Konversations-Lexikon, Band 7. Leipzig 1907, S. 816. | Permalink: http://www.zeno.org/nid/20006681026
pref label: Ghassanide
in scheme: travel!digital Thesaurus

Ghassanide
type: Label
in scheme: travel!digital Thesaurus

Osmanlí
type: Concept
in scheme: travel!digital Thesaurus
pref label: Osmanlí
related: Osman
definition: bdk: Herrschergeschlecht im osmanischen Reich | Brockhaus' Kleines Konversations-Lexikon 1911: Osmānen (Osmanli), s.v.w. Türken, nach Osman I., dem Gründer ihres Reichs, benannt. | Quelle: Brockhaus' Kleines Konversations-Lexikon, fünfte Auflage, Band 2. Leipzig 1911., S. 322-323. | Permalink: http://www.zeno.org/nid/20001413155

Osmanlí
type: Label
in scheme: travel!digital Thesaurus

Hamdanide
type: Concept
pref label: Hamdanide
in scheme: travel!digital Thesaurus
definition: Meyers Großes Konversations-Lexikon 1907: Hamdaniden, arab. Dynastie, die, von Hamdan ben Hamdun begründet, sich unter dessen Enkel Hassan 934 vom Kalifat unabhängig machte und bis 978[690] in Mesopotamien, bis 1003 in Nordsyrien (Haleb) herrschte. | Quelle: Meyers Großes Konversations-Lexikon, Band 8. Leipzig 1907, S. 690-691. | Permalink: http://www.zeno.org/nid/20006736815

Hamdanide
type: Label
in scheme: travel!digital Thesaurus

Mamluke
type: Concept
in scheme: travel!digital Thesaurus
pref label: Mamluke
definition: Meyers Großes Konversations-Lexikon 1908: Mameluken (Mamluken, arab., »erkaufte Sklaven«), die Leibwache orientalischer Herrscher. Schon der Kalif al-Mo'taßim (833–842) hatte eine Leibwache von 70,000 Mann. Im 13. Jahrh. kauften die ejjubidischen Sultane Ägyptens von den Türken Kriegsgefangene aus Turan und dem Kaukasus und bildeten hieraus das Korps der M., die wegen ihrer kriegerischen Tüchtigkeit bald allgemein gefürchtet waren, aber ebensooft auch ihren eignen Herren durch Einmischung in die Regierung und durch ihre Neigung zu Empörungen lästig wurden. Als der jugendliche Turan-Schah 1250 mit dem Kreuzfahrerheer Ludwigs IX. von Frankreich einen Vertrag abschloß, ohne vorher die M. zu Rate zu ziehen, ermordeten ihn diese und wählten an seine Stelle den Emir Moos Ibegh (Eibek), womit die Herrschaft der M. in Ägypten begann. Der Dynastie der Bahari den oder Bachriten (von bacher, Strom; weil Sultan Sälich seine M. auf der Nilinsel Roda verquartiert hatte) folgte 1382 und dann ununterbrochen seit 1390 die der Bordschiten (Burdjiten). Als 1517 Selim I. Ägypten eroberte, setzte er zwar einen Pascha über das Land, mußte aber auch die 24 Mamelukenbeis als Statthalter der verschiedenen Provinzen weiter bestehen lassen, und diese rissen bald die ganze Regierungsgewalt wieder an sich. Seit der Mitte des 18. Jahrh. erhielten die M. durch ihre Zahl und ihre Reichtümer ein solches Übergewicht, daß der von der Pforte ernannte Pascha ganz von ihnen abhing, fast alle höhern Staatsämter in ihrem Besitz waren und ihre Beis, besonders seit Ali Bei (1768–73), fast unumschränkte Beherrscher Ägyptens waren. Die Zahl der durch ganz Ägypten zerstreuten M. betrug ungefähr 10–12,000; sie ergänzten sich meist durch tscherkessische Sklaven. Erst Bonapartes Feldzug nach Ägypten (1798–99) brach ihre Macht. Sie wurden unter ihren mächtigsten Beis, Murad und Ibrahim, mehreremal geschlagen, vor allem in der Pyramidenschlacht 21. Juli 1798. Bonaparte nahm eine Anzahl M. in seinen Dienst und brach…

Mamluke
type: Label
in scheme: travel!digital Thesaurus

Khaljî
type: Concept
definition: bdk: Herrschergeschlecht in Indien
pref label: Khaljî
in scheme: travel!digital Thesaurus

Khaljî
type: Label
in scheme: travel!digital Thesaurus

Zijanide
type: Concept
pref label: Zijanide
in scheme: travel!digital Thesaurus
definition: Meyers Großes Konversations-Lexikon 1909: Tlemsen (Telemssen, franz. Tlemcen), Stadt im alger. Depart. Oran, 46 km vom Mittelmeer, auf fruchtbarer Hochebene (über 800 m), am Safsaf und an einer Zweigbahn der Linie Sidi bel Abbes-Oran, mit (1901) 22,273 (als Gemeinde 35,468) Einw. (4100 Franzosen und 2000 Juden), hat 32 Moscheen, Kirche, Synagoge, Kasernen, Museum, Bibliothek, maurische Bäder (über 500 Jahre alt), in der Nähe heiße Quellen, Bergbau auf silberhaltiges Blei, Antimon, Kupfer, Eisen, große Pflanzungen von Oliven und Wein,[580] Marmorbrüche und lebhaften Handel. Im SW. liegt Mansura mit großartigen Wasserwerken (jetzt Ruinen). Die Neueinteilung Algeriens (1902) unterscheidet noch im Depart. Oran fünf Zivilgebiete, von denen das von T., 4358 qkm groß, 143,577 Einw. zählt (33 auf 1 qkm). – T. war seit 1248 die Residenz der auf die Almorawiden folgenden maurischen Zianiden, die sie nur zwischen 1336 und 1358 an die Meriniden 'l Hasan von Fèz und seinen abtrünnigen Sohn Abu 'Inân verloren; von 1560 an herrschten die Türken über T. Schon verfallen, als die Franzosen es 1836 besetzten, wurde es im Frieden von Tafna (1837) wieder freigegeben, 1841 aber aufs neue genommen; im März 1842 und im Oktober 1845 fanden hier nochmals harte Kämpfe zwischen den Franzosen und Abd el Kader statt. Vgl. de Pimodan, Oran, Tlemcen, Sud-Oranais (3. Aufl., Par. 1903); William und Georges Marçais, Les monuments arabes de Tlemcen (das. 1903); W. Marçais, Musée de Tlemcen (das. 1905). | Quelle: Meyers Großes Konversations-Lexikon, Band 19. Leipzig 1909, S. 580-581. | Permalink: http://www.zeno.org/nid/20007589344

Zijanide
type: Label
in scheme: travel!digital Thesaurus

Tughlakdynastie
type: Concept
in scheme: travel!digital Thesaurus
pref label: Tughlakdynastie
related: Tughlak Shâh
related: Tughlak
definition: bdk: siehe Tughlak, Dynastie

Tughlakdynastie
type: Label
in scheme: travel!digital Thesaurus

Tughlak Shâh
type: Concept
alt label: Tughlak Shâhî
alternative label: Tughlak Shâhî
in scheme: travel!digital Thesaurus
definition: bdk: siehe Tughlak, Tughlakdynastie
related: Tughlak
pref label: Tughlak Shâh

Tughlak Shâhî
type: Label
isVariantOf: Tughlak Shâh
in scheme: travel!digital Thesaurus

Tughlak Shâh
type: Label
hasVariant: Tughlak Shâhî
in scheme: travel!digital Thesaurus

Tughlak
type: Concept
definition: Meyers Großes Konversations-Lexikon 1906: Dehli (Delhi), 1) Hauptstadt der britisch-ind. Division D. (s. oben) und des Distrikts D. (3305 qkm mit [1891] 638,689 Einw.), am rechten Ufer der Dschamna, 252 m ü. M., hat (1901) 208,385 Einw. (über die Hälfte Hindu, etwa 80,000 Mohammedaner). Die auf dem hohen, aufgemauerten Ufer der Dschamna gelegene Stadt ist auf den übrigen drei Seiten von einer hohen, starken, 9 km langen Mauer nebst Graben und Glacis umgeben. Die enge, schmutzige Südwesthälfte der Stadt wird von den Eingebornen bewohnt, die andre Hälfte dagegen enthält einige der schönsten Bauwerke Indiens, darunter den kaiserlichen Palast, ein mächtiges mauerumsäumtes Gebäude am Flußufer, von 1000 m Länge und 500 m Breite. Zwei prächtige Tore aus rotem Sandstein führen in ein mächtiges Gewölbe, dann in den [586] Diwan-i-Khas, einen Pavillon aus weißem Marmor mit vier vergoldeten Marmorkuppeln und Mosaiken aus edlen Steinen. Gegenüber die kleine Perlmoschee (Moti Masdschid) aus weißem Marmor, mit drei vergoldeten Kuppeln. Jetzt ist der Palast in Kasernen, Arsenal und Festung verwandelt. Außerhalb liegt das imposanteste Gebäude Dehlis, die Dschama Masdschid, die größte Moschee der Welt. Sie erhebt sich auf einem 9,5 m hohen, 140 m breiten und langen Viereck von roten Sandsteinquadern und ist aus weißem Marmor erbaut, der mosaikartig mit rotem Sandstein abwechselt. Den Haupteingang bildet eine prächtige Freitreppe, die Decke drei weiße Marmorkuppeln mit schwarzen Streifen, an jedem Ende der Front ein 45,6 m hohes Minaret. Südlich vom Fort liegen eine Kaserne, vier Kirchen, der Palast des Gouverneurs, das Institut mit Museum und Bibliothek. Eine in der Blütezeit Dehlis errichtete, nachmals verwahrloste Wasserleitung wurde von der englischen Regierung wiederhergestellt. D. besitzt viele Schulen, 13 Druckereien und ebenso viele Zeitungen. Die Industrie ist nicht bedeutend; berühmt sind aber die Gold- und Silberarbeiten, Musselin- und Schalweberei und Schnitzerei. Die Bede…
in scheme: travel!digital Thesaurus
pref label: Tughlak

Tughlak
type: Label
in scheme: travel!digital Thesaurus

Obrenowitsch
type: Concept
definition: Brockhaus' Kleines Konversations-Lexikon 1911: Obrénowitsch (Obrenović), serb. Fürstendynastie, dem Namen nach von dem serb. Landmann Obren abstammend. Dessen Stiefsohn Milosch, geb. 1780, zeichnete sich seit 1804 in den Kämpfen gegen die Türken aus und wurde 1816 vom Sultan als Fürst von Serbien anerkannt. Er regierte despotisch und mußte Juni 1839 abdanken. Sein Sohn und Nachfolger, Milan O. II., starb schon 8. Juli 1839, sein zweiter Sohn, Michael O. III., geb. 1823, mußte 1842 dem Fürsten Karadjordjewitsch weichen, nach dessen Sturz Milosch O. I. 23. Dez. 1858 wieder gewählt wurde. Dieser starb 26. Sept. 1860. Sein Sohn und Nachfolger, der genannte Michael O. III., wurde 10. Juni 1868 ermordet. Ihm folgte sein Neffe Milan O. IV. (s. Milan I.), diesem sein Sohn Alexander (s.d.), mit dem die Dynastie 103 erlosch. | Quelle: Brockhaus' Kleines Konversations-Lexikon, fünfte Auflage, Band 2. Leipzig 1911., S. 297. | Permalink: http://www.zeno.org/nid/20001402781
in scheme: travel!digital Thesaurus
pref label: Obrenowitsch

Obrenowitsch
type: Label
in scheme: travel!digital Thesaurus

Karaman
type: Concept
in scheme: travel!digital Thesaurus
pref label: Karaman
definition: bdk: Herrschergeschlecht in Anatolien | Meyers Großes Konversations-Lexikon 1907: Karaman (Karaman Ili), Landschaft im südlichen Kleinasien (s. Karte »Kleinasien«), umfaßt das heutige Liwa Konia oder die alten Landschaften Lykaonien, Isaurien und Teile von Kappadokien. Der Norden und Nordwesten wird von der Salzsteppe mit dem Tüz-Tschöllü (Salzsee), der Westen und Süden von den Taurusketten eingenommen. Im westlichen Teile liegen mehrere Seen: Akschehr Göl, Ejerdir Göl, Beischehr Göl etc. K. hat seinen Namen von einem Stamm K., der einst über K. herrschte, 1466 aber den Türken untertänig wurde. Die Stadt K. (das alte Laranda), 90 km südöstlich von Konia, am Nordfuße des Taurus 990 m hoch gelegen, ist Station der Bagdadbahn, hat viel Fontänen, 7 Moscheen, ein Kastell, Baumwollweberei, Teppichknüpferei uno 7–8000 Einw. | Quelle: Meyers Großes Konversations-Lexikon, Band 10. Leipzig 1907, S. 612. | Permalink: http://www.zeno.org/nid/20006869718

Karaman
type: Label
in scheme: travel!digital Thesaurus

Hasmonäer
type: Concept
pref label: Hasmonäer
definition: bdk: Herrschergeschlecht in Judäa | Brockhaus' Kleines Konversations-Lexikon 1911: Hasmonäer, s.v.w. Makkabäer (s.d.), nach Hasmonäus (Asamonäus), dem angeblichen Urgroßvater des Mattathias. | Quelle: Brockhaus' Kleines Konversations-Lexikon, fünfte Auflage, Band 1. Leipzig 1911., S. 767. | Permalink: http://www.zeno.org/nid/20001176161
in scheme: travel!digital Thesaurus
related: Makkabäer

Hasmonäer
type: Label
in scheme: travel!digital Thesaurus

Makkabäer
type: Concept
alternative label: Maccabäerfamilie
definition: Duden: Angehöriger eines jüdischen Geschlechtes | Meyers Großes Konversations-Lexikon 1908: Makkabäer, ursprünglich Beiname des Judas Makkabäus, dann übertragen auf das priesterliche Fürstengeschlecht, das von 167 v. Chr. an bis zur Gründung der herodianischen Dynastie an der Spitze des jüdischen Volkes stand. Die gewaltsamen Hellenisierungsversuche Antiochos' IV, Epiphanes veranlaßten den Priester Matthatias von Modeïn in Palästina, aus dem Geschlechte der Hasmonäer, eine Empörung zu organisieren. Als er einen königlichen Gesandten, der zum Abfall vom väterlichen Glauben aufforderte, öffentlich erdolcht hatte, vereinigten sich unter seiner Leitung die Glaubenstreuen. Vor seinem Tode (167) übertrug er dem dritten seiner fünf Söhne, Judas Makkabäus (s. d.), die Leitung der Erhebung, die dieser heldenmütig und siegreich bis zu seinem Tode (161) durchführte. Ihm folgte Jonathan, der jüngste der Brüder, der sich besonders durch geschickte Benutzung der Thronstreitigkeiten in Syrien behauptete, aber 143 gefangen genommen und in Ptolemaïs hingerichtet wurde (s. Jonathan Apphus). Zwei der Brüder, Jochanan und Elasar, waren im Kampfe gefallen. Simon, dem zweiten allein noch übrigen der fünf Brüder, gelang es, sich von Syrien ganz loszusagen und, vom Volke 141 zum erblichen Hohenpriester und Fürsten ernannt, bis 136 segensreich zu regieren, bis er mit zweien seiner Söhne durch Meuchelmord ums Leben kam. Sein Sohn und Nachfolger Johann Hyrkan I. mußte zwar, als Antiochos Sidetes 133 in Palästina einfiel und Jerusalem belagerte, einen demütigenden Frieden schließen; es gelang ihm aber mit Unterstützung der Römer, mit denen er das bereits von Judas und von Simon abgeschlossene Bündnis erneuerte, nicht nur die Unabhängigkeit, sondern auch Samaria, Idumäa und das Land jenseit des Jordans zu gewinnen. Von Hyrkans Tode an (105) wurde das Reich immer mehr durch Zerwürfnisse, insbes. durch den Parteihaß zwischen Pharisäern und Sadduzäern, zerrüttet. Zunächst folgten die Söhne Hyrkans…
pref label: Makkabäer
in scheme: travel!digital Thesaurus
alt label: Maccabäer
alternative label: Maccabäer
alt label: Maccabäerfamilie

Makkabäer
type: Label
hasVariant: Maccabäer
in scheme: travel!digital Thesaurus

Maccabäer
type: Label
isVariantOf: Makkabäer
in scheme: travel!digital Thesaurus

Maccabäerfamilie
type: Label
in scheme: travel!digital Thesaurus

Kutb Shâh
type: Concept
definition: Meyers Großes Konversations-Lexikon 1907: Haidarabad (Hyderabad), Reich des Nizam, der größte Vasallenstaat des britisch-ind. Kaiserreichs (s. Karte »Ostindien«), im zentralen Teil der vorderindischen Halbinsel, zwischen 15°10´-21°41´ nördl. Br. und 74°40´-81°31´ östl. L., umgeben von dem ihm früher zugehörigen Berar (s. d.), den Zentralprovinzen und den Präsidentschaften Bombay und Madras. Das Land nimmt mit 214,179 qkm Umfang den größten Teil des Tafellandes des Dekkan ein und dacht sich von NW., wo es in den Chandor-, Adschanta- und Balaghatbergen bis 760 m aufsteigt, allmählich nach SO. ab. Von den letztern ziehen die Bidar- und Koïlkendaberge (705 und 723 m) ostwärts. Die Gebirgsgegenden an der Nordgrenze sind unfruchtbar; südlich davon erstreckt sich der »Garten des Dekkan«, der reiche Baumwoll- und Weizenernten liefert, zur Godaweri, die das Land von W. nach O. durchzieht, rechts die Manjira aufnimmt und mit ihren linksseitigen Zuflüssen Penganga und Pranhita den größern Teil der Nord- und die Ostgrenze bildet. Den Süden durchzieht in gleicher Richtung die Kistna, die links die Bhima empfängt und mit der von rechts kommenden Tungabhadra die Südgrenze abgibt; hier wiegt die durch staunenswerte Bewässerungsanlagen geförderte Reiskultur vor. Die Gebirgsgegenden sind mit Wald bedeckt, der durch eine verständige Forstwirtschaft gepflegt wird. Wilde Tiere (Tiger, Panther, Hirsche u. a.) sind zahlreich, die Viehzucht unbedeutend. Das Klima ist heiß (in der Hauptstadt H. 25,2° im Jahresmittel) und trocken, aber nicht ungesund. Die Bevölkerung (1901: 11,141,142, gegen 1891 Abnahme 395,898) besteht aus 9,870,839 Hindu, 1,155,750 Mohammedanern (die herrschende Klasse, da ihr der Fürst angehört), 22,996 Christen u. a. Im Bergland leben in Höhlen und hohlen Bäumen die noch völlig unzivilisierten Gond. Die Hindu sind meist Ackerbauer, die Mohammedaner meist Beamte und Soldaten. Hauptsprachen sind Telugu (s. d.) und Marathi (s. d.), dann Kanaresisch, Hindustani, Hindi, Marw…
related: Fürstengeschlecht
pref label: Kutb Shâh
alt label: Kutb Shâhî
in scheme: travel!digital Thesaurus
alternative label: Kutb Shâhî

Fürstengeschlecht
type: Concept
alternative label: Fürstenhaus
in scheme: travel!digital Thesaurus
related: Fürstin
alt label: Fürstenhaus
definition: Duden: Fürstenhaus | Duden: Fürstenhaus: fürstliche Dynastie
related: Fürst
pref label: Fürstengeschlecht

Fürstin
type: Concept
in scheme: travel!digital Thesaurus
definition: Duden: 1. Frau eines Fürsten | 2. weibliche Form zu Fürst
pref label: Fürstin
related: Herrscherin
related: Adel

Fürstin
type: Label
in scheme: travel!digital Thesaurus

Herrscherin
type: Concept
in scheme: travel!digital Thesaurus
pref label: Herrscherin
definition: Duden: weibliche Form zu Herrscher
related: Herrscher
alt label: Herrin
alternative label: Herrin

Herrscherin
type: Label
in scheme: travel!digital Thesaurus

Herrscher
type: Concept
narrower: Mahrattenherrscher
in scheme: travel!digital Thesaurus
alt label: Machthaber
alt label: Herr
alternative label: Herr
alternative label: Gewalthaber
alternative label: Landesbeherrscher
alt label: Beherrscher
definition: Duden: jemand, der herrscht (1), der die Macht innehat; Machthaber, Regent
alt label: Landesbeherrscher
alternative label: Beherrscher
pref label: Herrscher
alternative label: Machthaber
alt label: Gewalthaber
narrower: Afghanenherrscher

Mahrattenherrscher
type: Concept
definition: bdk: siehe Mahratte, Herrscher
related: Mahratte
pref label: Mahrattenherrscher
in scheme: travel!digital Thesaurus
related: Peshwâ

Mahrattenherrscher
type: Label
in scheme: travel!digital Thesaurus

Peshwâ
type: Concept
pref label: Peshwâ
in scheme: travel!digital Thesaurus
definition: Meyers Großes Konversations-Lexikon 1908: Peschwa (Peischwa), ursprünglich der brahman. Minister der Mahratthen (s. d.), dessen Amt um 1714 erblich wurde. Von 1733 an machte er von seiner Residenz Puna aus die Mahratthenstaaten von sich abhängig, infolgedessen sie später in ein Vasallenverhältnis zu ihm traten; aus der Auflösung des Mahratthenreiches (seit 1761) gingen als die mächtigsten Staaten jene des Sindia in Gwalior und des Holkar in Indor hervor. Durch den Vertrag von Bassein (31. Dez. 1802) kam der P. in Abhängigkeit von der Englisch-Ostindischen Kompanie. Im Mai 1818 entsagte der letzte P., Badschi Rao, der Regierung und nahm von den Engländern einen Jahresgehalt von 800,000 Rupien an; als Residenz wurde ihm Bithur bei Khanpur angewiesen. Sein Adoptivsohn war Nana Sahib (s. d.). | Quelle: Meyers Großes Konversations-Lexikon, Band 15. Leipzig 1908, S. 641. | Permalink: http://www.zeno.org/nid/20007236735

Peshwâ
type: Label
in scheme: travel!digital Thesaurus

Machthaber
type: Label
in scheme: travel!digital Thesaurus

Herr
type: Label
in scheme: travel!digital Thesaurus

Beherrscher
type: Label
in scheme: travel!digital Thesaurus

Landesbeherrscher
type: Label
in scheme: travel!digital Thesaurus

Herrscher
type: Label
in scheme: travel!digital Thesaurus

Gewalthaber
type: Label
in scheme: travel!digital Thesaurus

Afghanenherrscher
type: Concept
in scheme: travel!digital Thesaurus
related: Afghane
definition: bdk: siehe Afghane, Herrscher
pref label: Afghanenherrscher

Afghanenherrscher
type: Label
in scheme: travel!digital Thesaurus

Herrin
type: Label
in scheme: travel!digital Thesaurus

Fürstenhaus
type: Label
in scheme: travel!digital Thesaurus

Fürst
type: Concept
narrower: Mamlukenfürst
narrower: Kurfürst
alt label: Nebenfürst
narrower: Chandra-Fürst
alt label: Nachbarfürst
related: Adel
narrower: Gaufürst
alternative label: Teilfürst
alt label: Teilfürst
definition: Duden: 1. seit dem Mittelalter nach dem Kaiser oder König rangierender, an der Herrschaft über das Reich beteiligter Angehöriger des hohen Adels | 2. Angehöriger des Adels im Rang zwischen Graf und Herzog | 3. Herrscher, Monarch | Meyers Großes Konversations-Lexikon 1907: Fürst (althochd. furisto, engl. the first, »der vorderste, erste, oberste«, wie sich auch im Deutschen der Ausdruck »First« erhalten hat, lat. princeps, franz. prince), war zur Zeit des alten Deutschen Reiches Titel einer Klasse von Personen, die den höchsten Rang nach dem Kaiser einnahmen. Erst im Laufe des 11. Jahrh. wurde es üblich, die Mitglieder der vornehmsten Aristokratie des Reiches als Fürsten zu bezeichnen; zu derselben gehörten die Herzoge, Markgrafen, Pfalzgrafen, Landgrafen, Burggrafen und einfachen Grafen sowie die Erzbischöfe, Bischöfe und die Äbte der reichsunmittelbaren Abteien. Gegen Ende des 12. Jahrh. bildete sich dann der sogen. jüngere Reichsfürstenstand aus, dem die einfachen Grafen nicht mehr angehörten, sondern nur ein noch enger begrenzter Kreis bestimmter Familien, unter denen anfangs nicht einmal alle Markgrafen waren. Auf den Reichstagen hatten die Fürsten Sitz und persönliche (Viril-) Stimme und saßen auf der Fürstenbank (s.d.); sie schieden sich in geistliche Fürsten (Bischöfe und Äbte), die erst durch ihre Wahl diese Würde erhielten, und weltliche Fürsten, denen dieselbe durch Geburtsrecht zustand. Zu ihren Vorrechten gehörte unter andern ein besonderer Gerichtsstand, den in erster Instanz die sogen. Austrägalgerichte bildeten, von denen die Appellation an eins der beiden höchsten Reichsgerichte ging. Aus dem Kreis der Fürsten sonderten sich im 13. Jahrh. sieben der mächtigsten ab, die das Recht, den Kaiser zu wählen, erlangten; sie wurden Kurfürsten (s.d.) genannt und standen im Rang über den andern Fürsten, die somit von der zweiten zu der dritten Stelle im Reiche herabsanken. Die weltlichen Fürstenhäuser zerfielen später in alte und neue: unter jenen verstand man …
pref label: Fürst
narrower: Drusenfürst
alt label: Fürstlichkeit
narrower: Malayenfürst
narrower: Dekkhan-Fürst
alternative label: Nebenfürst
narrower: Eyyubiden-Fürst
narrower: Râjputenfürst
narrower: Philisterfürst
in scheme: travel!digital Thesaurus
alternative label: Fürstlichkeit
related: Herrscher
narrower: Berberfürst
alternative label: Nachbarfürst
narrower: Seleucidenfürst

Mamlukenfürst
type: Concept
pref label: Mamlukenfürst
alternative label: Mamelukenfürst
definition: bdk: siehe Mamluke, Fürst
related: Fürstengeschlecht
in scheme: travel!digital Thesaurus
alt label: Mamelukenfürst
related: Mamluke

Mamlukenfürst
type: Label
hasVariant: Mamelukenfürst
in scheme: travel!digital Thesaurus

Mamelukenfürst
type: Label
isVariantOf: Mamlukenfürst
in scheme: travel!digital Thesaurus

Kurfürst
type: Concept
definition: bdk: siehe Fürst | Duden: Fürst, der zusammen mit anderen berechtigt ist, den deutschen König zu wählen
in scheme: travel!digital Thesaurus
pref label: Kurfürst

Kurfürst
type: Label
in scheme: travel!digital Thesaurus

Nebenfürst
type: Label
in scheme: travel!digital Thesaurus

Chandra-Fürst
type: Concept
in scheme: travel!digital Thesaurus
pref label: Chandra-Fürst
definition: bdk: siehe Fürst | bdk: Fürst aus dem Herrschergeschlecht der Chandra in Bengalen
related: Fürstengeschlecht

Chandra-Fürst
type: Label
in scheme: travel!digital Thesaurus

Nachbarfürst
type: Label
in scheme: travel!digital Thesaurus

Gaufürst
type: Concept
definition: bdk: siehe Fürst | Duden: Gau: 1. (besonders Geschichte) in sich geschlossene Landschaft, großer landschaftlicher Bezirk | Meyers Großes Konversations-Lexikon 1907: Gau (got. gavi, althochd. gowi, gawi, altsächs. u. friesisch gâ, gô, mittelhochd. gou, gen), altdeutsches Wort, bezeichnet einen Bezirk Landes und entspricht dem lateinischen pagus (dem französischen pays). Der G. ist ursprünglich eine Unterabteilung der staatsrechtlichen Einheit der Germanen, der Volksgemeinde, civitas, vielleicht entstanden aus der Niederlassung einer Tausendschaft, aber frühzeitig schon zu territorialer Bedeutung gelangt. An der Spitze des Gaues stehen Fürsten als Unterkönige unter dem über die civitas herrschenden König. Die Bewohner des Gaues sind in eine Anzahl kleinerer persönlicher Verbände, Hundertschaften, geteilt, die in erster Linie den Zwecken des Heerwesens, in zweiter Linie denen der Rechtspflege dienen. An seiner Spitze stand der Graf (grafio, comes, auch Gaugraf). Die Gerichtsversammlung des Gaues, die von allen Gerichtspflichtigen besucht werden mußte, hieß Ga u- (Go-) oder Landesdinge. Die Gauverfassung, die Grundlage der karolingischen Staatsverwaltung, löste sich seit dem 11. Jahrh. insbes. infolge der Bildung geistlicher Immunitäten (s.d.) mehr und mehr auf. Die Gaue hatten meist natürliche Grenzen und erhielten ihren Namen bald von Städten (z. B. Wormsgau, Speyergau, Zürichgau), bald von Flüssen (z. B. Rheingau, Aargau) oder Gebirgen (Eifelgau), bald von der Himmelsgegend (Nordgau, West- oder Westergau), bald von der Abstammung der Bewohner (Schwabengau, Hessengau, Nordthüringer Gau). Erinnerungen an die Gauverfassung haben sich bis auf unsre Zeit in Namen wie Breisgau, Rheingau, Sundgau, Aargau etc. erhalten. Vgl. Thudichum, Die Gau- und Markverfassung in Deutschland (Gieß. 1860); Wersebe, Beschreibung der Gaue zwischen Elbe, Saale, Unstrut, Weser und Werra (Hannov. 1829); Longnon, Géographie de la Gaule au VI. siécle (1878); Baumann, Die Gaugrafschaften im wirtem…
in scheme: travel!digital Thesaurus
pref label: Gaufürst

Gaufürst
type: Label
in scheme: travel!digital Thesaurus

Teilfürst
type: Label
in scheme: travel!digital Thesaurus

Fürst
type: Label
in scheme: travel!digital Thesaurus

Drusenfürst
type: Concept
definition: bdk: siehe Druse, Fürst
in scheme: travel!digital Thesaurus
pref label: Drusenfürst
related: Druse
related: Drusen-Religion

Drusenfürst
type: Label
in scheme: travel!digital Thesaurus

Druse
type: Concept
preferred label: drûzi @ar
alt label: Drusenfamilie
related: Drusen-Religion
alternative label: Drusenfamilie
in scheme: travel!digital Thesaurus
narrower: Drusenfrau
definition: Duden: Angehöriger einer islamischen Glaubensgemeinschaft im Libanon und in Syrien | Meyers Großes Konversations-Lexikon 1906: Drusen, eine Völkerschaft und religiöse Sekte in Syrien, bewohnt den westlichen Abhang des Libanon und einen Teil des Antilibanon von Beirut bis Saida und vom Mittelmeer bis gegen Damaskus, ist aber auch im Hauran (besonders seit 1861) in ansehnlicher Zahl ansässig. Sie selbst nennen sich Unitarier. Die D. wohnen südlich von den ihnen feindlichen Maroniten, teils in eignen Ortschaften, teils mit jenen vermischt, und werden auf etwa 100,000 Seelen geschätzt, wovon 50,000 im Hauran und 28,000 im Libanon (nach P. Moyse, 1883) sitzen. Ihre Sprache ist das Arabische. Während v. Luschan ihre Abstammung als vorsemitisch bezeichnet, tritt v. Oppenheim (»Vom Mittelmeer zum Persischen Golf«, Bd. 1, Berl. 1899) für eine arabische ein; und nach Socin sind die D. »eine seit Jahrhunderten losgetrennte Kaste der syrisch-arabischen Mischbevölkerung, in der jedoch das altsyrische Element entschieden überwiegt«. In verschiedene Stämme unter Scheichs geschieden, lebten sie bis vor kurzem miteinander häufig in Fehde und bilden ein ziemlich unabhängiges Volk mit einer patriarchalischen, halb feudalen Regierungsform, das von jeher jeden Druck der Pforte durch Aufstand abgewehrt hat. Sie sind gute Freunde der Engländer. | Eigentümlich ist die Religion der D. Ihre Lehren sind in heiligen Büchern niedergeschrieben, die, obwohl sorgfältig geheimgehalten, in Europa doch durch Abschriften bekannt geworden sind. Sie bestehen aus 111 Abhandlungen, die in sechs Bücher zerfallen; ein siebentes, in einer ägyptischen Schule entdecktes haben sie 1817 dazu erhalten. Die Religionslehre der D. ist danach mohammedanischer Gnostizismus mit allerlei dem Christentum und alten philosophischen Systemen sowie dem persischen Magismus entlehnten Ideen. Das am meisten charakteristische Dogma ist das von der Einheit des Wesens Gottes, der nur von seinen berufenen Kindern erkannt werden kan…
pref label: drûzi
pref label: Druse
narrower: Haurândruse

Drusenfamilie
type: Label
in scheme: travel!digital Thesaurus

Drusenfrau
type: Concept
definition: bdk: siehe Druse
in scheme: travel!digital Thesaurus
pref label: Drusenfrau
related: Drusen-Religion

Drusenfrau
type: Label
in scheme: travel!digital Thesaurus

drûzi
type: Label
in scheme: travel!digital Thesaurus
isTranslationOf: Druse

Druse
type: Label
in scheme: travel!digital Thesaurus
hasTranslation: drûzi

Haurândruse
type: Concept
definition: bdk: siehe Haurânier, Druse
in scheme: travel!digital Thesaurus
pref label: Haurândruse
related: Haurânier
related: Drusen-Religion

Haurândruse
type: Label
in scheme: travel!digital Thesaurus

Fürstlichkeit
type: Label
in scheme: travel!digital Thesaurus

Malayenfürst
type: Concept
in scheme: travel!digital Thesaurus
related: Malaye
definition: bdk: siehe Malaye, Fürst
pref label: Malayenfürst
related: Fürstengeschlecht

Malayenfürst
type: Label
in scheme: travel!digital Thesaurus

Dekkhan-Fürst
type: Concept
definition: bdk: siehe Fürst, Dekkhan-Dynastie
related: Dekkhan-Dynastie
pref label: Dekkhan-Fürst
related: Fürstengeschlecht
in scheme: travel!digital Thesaurus

Dekkhan-Dynastie
type: Concept
related match: Deccan sultanates
definition: Meyers Großes Konversations-Lexikon 1906: Dekhan (Deccan, v. sanskr. Dakschinā, die »rechte, d. h. südliche Weltgegend«), südlicher Teil Vorderindiens, das Dreieck, das im N. von der südlich des Tapti streichenden Kette und ihrer Fortsetzung, dem Hügelland am rechten Ufer des Godaweri, im O. von den Ostghats, im W. von den Westghats begrenzt wird, im S. in der Senkung Phalgat endet, welche die Eisenbahn von Madras nach Kalikut durchzieht. Es ist ein nach O. abgedachtes Tafelland, rauh und stark gewellt im W., mit ausgedehnten Ebenen im O.; im W. 1000–1300 m, im Innern 500–600 m hoch. Alle Flüsse entspringen in den Westghats und münden in den Bengalischen Meerbusen. Der Boden besteht vorwiegend aus schwarzer Erde (Zersetzungsprodukt der für D. charakteristischen weiten Basaltdecken) oder aus rotem Laterit. Beide sind fruchtbar, bedürfen aber künstlicher Bewässerung. Die Jahrestemperatur liegt zwischen 27,8 und 27,8°. Politisch gehört D. zu den Zentralprovinzen, den Präsidentschaften Bombay und Madras, zu Haidarabad und Maissur. – Um 500 n. Chr. soll sich Dschayasimha 1., aus Nordindien kommend, auf Kosten der drawidischen Pallawa im D. festgesetzt und das Hindureich der Tschâlukya gegründet haben, das schon um 600 den größten Teil des D. (zwischen Konkan und Orissa) umfaßte. 630 fand eine Zweiteilung statt: das östliche Tschâlukyareich bestand bis 1060, wo es den Tschola erlag; das westliche erlitt 747 durch die Râschtrakûta von Gudscharat eine schwere Schlappe, erholte sich aber seit 973 unter Tailapa, dem Stifter der spätern Tschalukyadynastie, gab einer Anzahl von Nebenlinien und Kleinstaaten das Leben und erlosch gegen 1200. Inzwischen überschwemmten seit 1001 mohammedanische Scharen Nordindien und drangen allmählich immer weiter auch nach dem D. vor. 1347 erklärte sich der schiitische Afghane Hasan Gango, Vizekönig Mohammeds ibn Toghluq in Dauladabad, unabhängig und begründete die Bahmanidynastie von Kulbarga; sein Nachfolger Mahmud Shah II. herrschte[596] 1482 …
narrower: Tschâlukya-Dynastie
pref label: Dekkhan-Dynastie
narrower: Adil Shâh
in scheme: travel!digital Thesaurus

Tschâlukya-Dynastie
type: Concept
in scheme: travel!digital Thesaurus
pref label: Tschâlukya-Dynastie
definition: bdk: siehe Dekkhan-Dynastie | bdk: Herrschergeschlecht in Indien

Tschâlukya-Dynastie
type: Label
in scheme: travel!digital Thesaurus

Dekkhan-Dynastie
type: Label
in scheme: travel!digital Thesaurus

Adil Shâh
type: Concept
pref label: Adil Shâh
in scheme: travel!digital Thesaurus
definition: bdk: siehe Dekkhan-Dynastie | bdk: Herrschergeschlecht in Indien | Meyers Großes Konversations-Lexikon 1905: Bidschapur (Bedschapur), Hauptort des Distrikts Kaladgi in der britisch-ind. Präsidentschaft Bombay, Bahnstation, 510 m ü. M., mit (1891) 16,759 Einw. (meist Hindu). Die Stadt war einst Residenz der Könige von B., einem 1488 von Jussuf, Sohn des Sultans Murad II., gegründeten Reich, das bis Ende des 17. Jahrh. blühte. B. soll damals 1 Mill. Einw. gezählt haben, schloß mit seinen hohen, noch erhaltenen Mauern ein mächtiges Fort, 1600 Moscheen und eine Menge von Prachtbauten ein und hieß im Sanskrit Widschajapura (»Siegesstadt«). Von Aurangzeb 1686 zerstört, kam B. Anfang des 18. Jahrh. an die Marathen und wurde 1818 an England, an den Nizam von Haidarabad und den Radscha von Satára verteilt. Nach des letztern Tode fiel sein Gebiet an England. Seitdem ist viel zur Erhaltung der verfallenen Prachtbauten geschehen, von denen jetzt viele als Regierungsgebäude dienen. Die bemerkenswertesten sind das von Jussuf erbaute Fort mit 109 Türmen, einem in den Fels gehauenen Graben und der Zitadelle mit einem ebenfalls aus dem Fels gehauenen Tempel aus vormohammedanischer Zeit, das Grabmal des Sultans Ibrahim Adil Schah II. (1579–1626), das an die Peterskirche zu Rom erinnernde Grabmal Mohammed Adil Schahs (1626–60), die Hauptmoschee. | Quelle: Meyers Großes Konversations-Lexikon, Band 2. Leipzig 1905, S. 830. | Permalink: http://www.zeno.org/nid/20006326846

Adil Shâh
type: Label
in scheme: travel!digital Thesaurus

Dekkhan-Fürst
type: Label
in scheme: travel!digital Thesaurus

Eyyubiden-Fürst
type: Concept
definition: bdk: siehe Eijubide, Fürst
in scheme: travel!digital Thesaurus
pref label: Eyyubiden-Fürst
related: Eijubide
related: Fürstengeschlecht

Eyyubiden-Fürst
type: Label
in scheme: travel!digital Thesaurus

Eijubide
type: Concept
alternative label: Eyyubide
alt label: Eyyubide
pref label: Eijubide
in scheme: travel!digital Thesaurus
definition: Meyers Großes Konversations-Lexikon 1906: Ejjub, Kurde, Vater des Sultans Saladin (s. d.), war Stammvater der mosleminischen Dynastie der Ejjubiden, die von 1171 an über Ägypten regierten, aber von den Mamelucken 1250 gestürzt wurden. Hervorzuheben ist von diesen noch der Sultan E., der 1244 den Ritterorden in Palästina eine Niederlage beibrachte und während des (sechsten) Kreuzzugs Ludwigs IX. von Frankreich 1249 starb. | Quelle: Meyers Großes Konversations-Lexikon, Band 5. Leipzig 1906, S. 582. | Permalink: http://www.zeno.org/nid/20006542239

Eyyubide
type: Label
isVariantOf: Eijubide
in scheme: travel!digital Thesaurus

Eijubide
type: Label
hasVariant: Eyyubide
in scheme: travel!digital Thesaurus

Râjputenfürst
type: Concept
alternative label: Râjputâna-Fürst
pref label: Râjputenfürst
alt label: Râjputâna-Fürst
related: Râjputendynastie
alternative label: Rajputana-Fürst
alt label: Rajputana-Fürst
in scheme: travel!digital Thesaurus
related: Fürstengeschlecht
definition: bdk: siehe Râjpute, Fürst
related: Râjpute

Râjputenfürst
type: Label
in scheme: travel!digital Thesaurus

Râjputâna-Fürst
type: Label
hasVariant: Rajputana-Fürst
in scheme: travel!digital Thesaurus

Rajputana-Fürst
type: Label
isVariantOf: Râjputâna-Fürst
in scheme: travel!digital Thesaurus

Râjputendynastie
type: Concept
related: Râjpute
in scheme: travel!digital Thesaurus
alt label: Râjputen-Dynastie
pref label: Râjputendynastie
related match: Rajput
alternative label: Râjputen-Dynastie
definition: bdk: siehe Râjpute, Dynastie

Râjputen-Dynastie
type: Label
isVariantOf: Râjputendynastie
in scheme: travel!digital Thesaurus

Râjputendynastie
type: Label
hasVariant: Râjputen-Dynastie
in scheme: travel!digital Thesaurus

Philisterfürst
type: Concept
definition: bdk: siehe Philister, Fürst
in scheme: travel!digital Thesaurus
pref label: Philisterfürst
related: Philister

Philisterfürst
type: Label
in scheme: travel!digital Thesaurus

Berberfürst
type: Concept
definition: bdk: siehe Berber, Fürst
related: Berber
in scheme: travel!digital Thesaurus
related: Fürstengeschlecht
pref label: Berberfürst

Berberfürst
type: Label
in scheme: travel!digital Thesaurus

Seleucidenfürst
type: Concept
definition: bdk: siehe Seleukide, Fürst
in scheme: travel!digital Thesaurus
pref label: Seleucidenfürst
related: Seleukide
related: Fürstengeschlecht

Seleucidenfürst
type: Label
in scheme: travel!digital Thesaurus

Seleukide
type: Concept
alternative label: Seleucide
related match: Seleucid Empire
pref label: Seleukide
in scheme: travel!digital Thesaurus
alt label: Seleucide
definition: Duden: Angehöriger einer makedonischen Dynastie in Syrien | Pierer's Universal-Lexikon 1862: Seleukiden, Herrscherfamilie von Syrien, welche 312 v. Chr. mit Seleukos (s.d. 3) Nikator begann, durch die Schlacht bei Ipsos 301 ihre Macht vollends befestigte u. bis 79 v. Chr. herrschte, s. Syrien (Gesch.). Vgl. Vaillant, Seleucidarum imperium, Par. 1681, Haag 1732; Reineccius, Familia Seleucidarum, Wittenb. 1571. | Quelle: Pierer's Universal-Lexikon, Band 15. Altenburg 1862, S. 816. | Permalink: http://www.zeno.org/nid/20010905987

Seleukide
type: Label
hasVariant: Seleucide
in scheme: travel!digital Thesaurus

Seleucide
type: Label
isVariantOf: Seleukide
in scheme: travel!digital Thesaurus

Fürstengeschlecht
type: Label
in scheme: travel!digital Thesaurus

Kutb Shâh
type: Label
hasVariant: Kutb Shâhî
in scheme: travel!digital Thesaurus

Kutb Shâhî
type: Label
isVariantOf: Kutb Shâh
in scheme: travel!digital Thesaurus

Merinide
type: Concept
in scheme: travel!digital Thesaurus
pref label: Merinide
definition: Meyers Großes Konversations-Lexikon 1908: Meriniden, Gruppe barbarischer Stämme in Marokko, deren Häuptlinge 1269 das Kalifat der Almohaden (s. Almoraviden) vernichteten und eine neue Dynastie gründeten, die 1470 zunächst von der ihnen verwandten Dynastie der Wat'asiden und seit 1509 durch die Sa'diten verdrängt wurde, bis die Scherifen 1544 das ganze Reich von Fez und Marokko in Händen hatten. Vgl. Meakin, The land of the Moors, Bd. 1 (Lond. 1901); A. Bel, Les Benou-Ghauya, etc., et leur lutte contre l'empire almohade (Par. 1903). | Quelle: Meyers Großes Konversations-Lexikon, Band 13. Leipzig 1908, S. 635. | Permalink: http://www.zeno.org/nid/2000707705X

Merinide
type: Label
in scheme: travel!digital Thesaurus

Sakya
type: Concept
in scheme: travel!digital Thesaurus
pref label: Sakya
related: Fürstengeschlecht
definition: Pierer's Universal-Lexikon 1859: Gautăma, ist ein Name des Sâkyamuni, des Begründers der Buddhistischen Religion; er führt denselben nach dem Stammvater des in Maghada[18] (Behar) herrschenden Königsgeschlechts der Sâkya, aus welchem Sâkyamuni stammte. Häufig finden sich die Verbindungen Gautama-Buddha (d.i. der Buddha G.) od. Sramana-Gautama (d.i. der Einsiedler G. in den heiligen Schriften der Buddhisten). | Quelle: Pierer's Universal-Lexikon, Band 7. Altenburg 1859, S. 18-19. | Permalink: http://www.zeno.org/nid/20009981039

Sakya
type: Label
in scheme: travel!digital Thesaurus

Pândya
type: Concept
definition: Meyers Großes Konversations-Lexikon 1907: Karnatik (englische Verderbung des aus dem Sanskrit, richtiger wohl aus dem Drawidischen stammenden Karnataka, »schwarzes Land«), 1) Bezeichnung für die in der britisch-ind. Präsidentschaft Madras, am Bengalischen Golf und dem Meerbusen von Manar gelegenen Landschaft, umfaßt die Distrikte Tinnevelli, Madura, Tritschinapalli, Tandschur, Salem, Süd- und Nordarcot, Tschingelpat und Nellor von zusammen 143,998 qkm, mit (1901) 18,152,375 Einw., die zum drawidischen Volksstamm gehören und Tamil und Telugu sprechen. Ursprünglich wurde der Name auf das Tafelland zwischen Ost- und Westghats südlich von 18° nördl. Br. angewendet. – 2) Landschaft im S. der britisch-ind. Präsidentschaft Bombay, 38,662 qkm, mit (1901) 2,842,676 Einw.; Hauptort ist Hubli (s. d.). Das jetzige K. umfaßt das alte Hindureich Karnata nebst den Reichen Tschola und Pandya, die von der Gaudigama bis Kap Komorin reichten, aber im 11. Jahrh. zerstört wurden. Fortan bildete das K. einen Teil des von den Belala gegründeten Radschputenreiches Widschayanagar mit der Hauptstadt Widschayawanapura (»Stadt des Triumphes«; 45 km nordwestlich von Bellary), deren Trümmer 15 km im Umfang messen. Dieses Reich wurde in der Mitte des 16. Jahrh. durch die mohammedanischen Herrscher von Bidschapur und Golkonda erobert und ging nach Einverleibung dieser Länder in das Reich Aurangzebs (1686) in dem Saubah von Dekhan auf. In den spätern Kämpfen um den Besitz des Landes, das gegen 1750 einen fast unabhängigen Kleinstaat unter dem Nawab von Arkot bildete, erscheinen die Franzosen und die Engländer, bis 1856 nach dem Tode des letzten Nawab das K. dem britisch-indischen Reich einverleibt wurde. Vgl. E. Schmidt im 2. Bande von Helmolts »Weltgeschichte« (Leipz. 1902). | Quelle: Meyers Großes Konversations-Lexikon, Band 10. Leipzig 1907, S. 663. | Permalink: http://www.zeno.org/nid/20006872484
pref label: Pândya
in scheme: travel!digital Thesaurus

Pândya
type: Label
in scheme: travel!digital Thesaurus

Sassanide
type: Concept
related match: Sasanian Empire
definition: Duden: Angehöriger eines persischen Herrschergeschlechts (224–651) | Meyers Großes Konversations-Lexikon 1909: Sasaniden, pers. Königsdynastie, von Artaxerxes (Ardaschîr), dem Enkel Sâsâns, nach dem Sturz der Arsakiden 224 n. Chr. gegründet und 636–644 durch den Kalifen Omar wieder gestürzt. S. Persien, S. 615. | Quelle: Meyers Großes Konversations-Lexikon, Band 17. Leipzig 1909, S. 620. | Permalink: http://www.zeno.org/nid/20007403704
pref label: Sassanide
in scheme: travel!digital Thesaurus

Sassanide
type: Label
in scheme: travel!digital Thesaurus

Nebendynastie
type: Label
in scheme: travel!digital Thesaurus

Saiyid
type: Concept
in scheme: travel!digital Thesaurus
pref label: Saiyid
definition: bdk: Herrschergeschlecht in Indien

Saiyid
type: Label
in scheme: travel!digital Thesaurus

Hohenstaufe
type: Concept
in scheme: travel!digital Thesaurus
pref label: Hohenstaufe
definition: Duden: Angehöriger eines deutschen Fürstengeschlechts | Meyers Großes Konversations-Lexikon 1907: Hohenstaufen (Staufer), Herrschergeschlecht, das von 1138–1254 den deutschen Königsthron innehatte. Der erste Ahnherr war der Ritter Friedrich von Büren um die Mitte des 11. Jahrh., so genannt nach dem Ort Büren, d. h. Wäschenbeuren, jetzt dem sogen. Wäscherschlößchen bei Lorch in Schwaben; sein Sohn Friedrich von Staufen (gest. 1105) baute auf dem benachbarten Hohenstaufen die neue Burg, die fortan dem Geschlecht den Namen gab, erhielt von Kaiser Heinrich IV. wegen der ihm bewiesenen Treue 1079 das Herzogtum Schwaben, seine Tochter Agnes zur Gemahlin und, als der Kaiser 1081 zur Bekämpfung des Papstes über die Alpen zog, die Stellvertretung in Deutschland. Bertold, der Sohn des Gegenkönigs Rudolf, und Bertold II. von Zähringen machten Friedrich den Besitz Schwabens streitig, und erst nach langen, wechselvollen Kämpfen (bei Höchstädt erlitt er 1081 eine Niederlage) erhielt er 1097 nochmals eine feierliche Belehnung. Seine Söhne Friedrich II. (gest. 1147) oder der Einäugige, den Heinrich IV. als Herzog von Schwaben bestätigte, und Konrad, den Heinrich V. mit dem Herzogtum Franken belehnte, unterstützten den Kaiser beim Investiturstreit und in den Kämpfen mit dem Herzog Lothar von Sachsen. Mit dem Tode Heinrichs V. fielen dessen Hausgüter infolge der Vermählung seiner Schwester Agnes an die H.; Friedrich trat 1125 auf dem Wahltag zu Mainz als Bewerber um die Königskrone auf, unterlag aber seinem Nebenbuhler Lothar von Sachsen. Langwierige Kämpfe zwischen dem König, den Heinrich der Stolze, Herzog von Bayern, unterstützte, und den beiden H. waren die Folge: Konrad zog mit Heeresmacht nach Italien und erreichte 1128 in Monza seine Krönung zum König von Italien; allein die Welfen und der Papst bedrängten ihn hart, und am Ende mußten die H. nachgeben. Konrad verzichtete 1135 auf die Königswürde, erhielt nebst seinem Bruder vom Kaiser Verzeihung und Rückgabe seiner Besitzungen…

Hohenstaufe
type: Label
in scheme: travel!digital Thesaurus

borgitisch
type: Concept
definition: Pierer's Universal-Lexikon 1857: Bordschiten, zweite Mameluken-Dynastie in Ägypten, s.d. (Gesch.) VII. B), gegründet von dem Circassier Baxkok, reg. 1381 bis 1516. | Quelle: Pierer's Universal-Lexikon, Band 3. Altenburg 1857, S. 91. | Permalink: http://www.zeno.org/nid/20009566120
pref label: borgitisch
in scheme: travel!digital Thesaurus

borgitisch
type: Label
in scheme: travel!digital Thesaurus

Angelos-Dynastie
type: Concept
alternative label: Angelosdynastie
definition: bdk: siehe Dynastie | bdk: byzantinisches Adelsgeschlecht | Pierer's Universal-Lexikon 1857: Angĕlos (gr.), 1) Bote, Gesandter; 2) Engel; 3) Beiname einer Dynastie byzantinischer Kaiser (die Angelen), zu welcher Isaak II., Alexios III. u. IV. gehören, s. Byzantinisches Reich; 4) so v.w. Angelus. | Quelle: Pierer's Universal-Lexikon, Band 1. Altenburg 1857, S. 488. | Permalink: http://www.zeno.org/nid/20009366199
in scheme: travel!digital Thesaurus
alt label: Angelosdynastie
pref label: Angelos-Dynastie

Angelosdynastie
type: Label
isVariantOf: Angelos-Dynastie
in scheme: travel!digital Thesaurus

Angelos-Dynastie
type: Label
hasVariant: Angelosdynastie
in scheme: travel!digital Thesaurus

hafsidisch
type: Concept
in scheme: travel!digital Thesaurus
pref label: hafsidisch
related: Hafside
definition: bdk: die Hafsiden betreffend; von den Hafsiden stammend, zu ihnen gehörend

hafsidisch
type: Label
in scheme: travel!digital Thesaurus

Hafside
type: Concept
definition: Pierer's Universal-Lexikon 1857: Abu Hassi, span. Maure, welcher zu Anfang des 13. Jahrh. Tunis eroberte u. hier die Dynastie der Hafsiden gründete, welche von 1206-1537 herrschte; s. Tunis (Gesch.). | Quelle: Pierer's Universal-Lexikon, Band 1. Altenburg 1857, S. 61. | Permalink: http://www.zeno.org/nid/20009293418
in scheme: travel!digital Thesaurus
pref label: Hafside

Hafside
type: Label
in scheme: travel!digital Thesaurus

almohadisch
type: Concept
definition: bdk: die Almohaden betreffend; von den Almohaden stammend, zu ihnen gehörend
in scheme: travel!digital Thesaurus
related: Almohade
pref label: almohadisch

Almohade
type: Concept
related match: Almohad Caliphate
in scheme: travel!digital Thesaurus
pref label: Almohade
related: Almoravide
definition: bdk: siehe: Almoravide

Almohade
type: Label
in scheme: travel!digital Thesaurus

Almoravide
type: Concept
pref label: Almoravide
related: Berbersekte
in scheme: travel!digital Thesaurus
definition: Meyers Großes Konversations-Lexikon 1905: Almoraviden und Almohaden, Namen zweier nordafrikanisch-span. Dynastien. Moraviden (arab. murabitîn, eigentlich Grenzwächter, dann Vorkämpfer, eifrige Gottesdiener, Einsiedler) nannten sich die Anhänger des im 11. Jahrh. unter den Berberstämmen zwischen Senegal und Atlas puritanisch missionierenden muslimischen Glaubenseiferers Abdallah ibn Jasin. Ihr erster, von Abdallah eingesetzter, Herrscher, Abu Bekr, gründete nach Abdallahs Tod (1059) Marokko (1062). Sein Nachfolger Jusuf ibn Taschfin erweiterte die Macht der Almoraviden, schlug, von dem Emir von Sevilla (s. Abbadiden) zu Hilfe gerufen, die Christen 1086 bei Sallaka und unterwarf sich, 1090 zum zweitenmal herbeigerufen, das ganze arabische Spanien. Bald aber wurde die Macht der Almoraviden wieder gestürzt von einer neuen, von Mohammed ibn Tumart im Atlasgebirge gestifteten fanatischen Sekte, den Muwahhedin oder Almohaden (»Anbeter des Einen wahren Gottes«), die 1147 unter des »Kalifen« Abd el Mumen Anführung Marokko eroberten, den letzten Almoraviden, Ishak, töteten und ihre Macht dann auch über Spanien ausbreiteten. Unter Jakub el Manßûr (Almansor) gewannen sie 1195 bei Alarcos einen großen Sieg über die Kastilier, wurden aber unter Jakubs Nachfolger Mohammeden Naßir von den verbündeten Königen von Kastilien, Aragonien und Navarra bei Navas de Tolosa jenseit der-Sierra Morena 1212 aufs Haupt geschlagen. Mit dieser Niederlage ist der Verfall der muslimischen Macht in Spanien entschieden; die nächste Folge war die Vernichtung der Herrschaft der Almohaden auf der Pyrenäischen Halbinsel. Auch in Afrika war sie nicht mehr von langer Dauer: innere Zwiste lähmten die Kraft der Dynastie, und die inmitten dieser Kämpfe aufgekommenen Benu Merin (s. Meriniden) machten der Herrschaft der Almohaden 1269 ein Ende. Vgl. Dozy, History of the Almohades (2. Ausg., Leiden 1881); Derselbe, Geschichte der Mauren in Spanien, Bd. 2 (deutsch, Leipz. 1874); A. Müller, Der Islam, Bd. 2 (Berl. …

Almoravide
type: Label
in scheme: travel!digital Thesaurus

Berbersekte
type: Concept
definition: bdk: siehe Berber, Sekte
pref label: Berbersekte
related: Berber
in scheme: travel!digital Thesaurus

Berbersekte
type: Label
in scheme: travel!digital Thesaurus

almohadisch
type: Label
in scheme: travel!digital Thesaurus

merinidisch
type: Concept
definition: bdk: die Meriniden betreffend; von den Meriniden stammend, zu ihnen gehörend
in scheme: travel!digital Thesaurus
related: Merinide
pref label: merinidisch

merinidisch
type: Label
in scheme: travel!digital Thesaurus

Omaijade
type: Concept
alternative label: ʿOmayyade
alt label: ʿOmayyade
related match: Umayyad Caliphate
pref label: Omaijade
in scheme: travel!digital Thesaurus
definition: Duden: Angehöriger eines arabischen Herrschergeschlechtes | Meyers Großes Konversations-Lexikon 1908: Omaijaden (Omejjaden, Omajjiden), arab. Geschlecht, aus dem mehrere Herrscherdynastien hervorgingen, gehörte zum Stamm Koreisch (s. d.). Stammvater war Omaija, Sohn des Abd Schems. Als Mohammed in Mekka auftrat, hatten die O. bedeutendes Ansehen daselbst, und ihr Oberhaupt Abu Sufjân, Omaijas Enkel, war einer der Anführer der Koreischiten im Kampf gegen Mohammed, dem er sich erst 630 unterwarf. Abu Sufjâns Sohn Moâwija ward von Omar zum Statthalter von Syrien ernannt, trat nach Othmâns Ermordung 656 als Bluträcher für ihn auf und versagte Ali die Anerkennung. Nach dem unentschiedenen Kampfe mit Ali bei Siffîn 657 wußte er diesen immer mehr zurückzudrängen und bemächtigte sich nach Alis Ermordung und der Abdankung von dessen schwächlichem Sohne Hassan 661 des Kalifats. Mit ihm beginnt die erste Dynastie der O. im Araberreich, die, in Damaskus residierend, dem Reich 14 Kalifen gab, die Herrschaft des Islams zur höchsten Blüte und Ausbreitung brachte, Künste und Wissenschaften pflegte und mit Merwân II. 750 durch die Abbasiden unterging (s. Kalifen, S. 464). Der abbasidischen Verfolgung entgingen wenige Mitglieder, von denen das eine, Ab der Rahmân (s. d. 2), nach Spanien entkam und 756 der Begründer der zweiten Dynastie der O. in Cordoba wurde; die Herrschaft derselben (756–1031) endigte mit der Thronentsagung Hischâms III. (s. Spanien [Geschichte] und Kalifen). Vgl. Wellhausen, Das arabische Reich und sein Sturz (Berl. 1902). | Quelle: Meyers Großes Konversations-Lexikon, Band 15. Leipzig 1908, S. 56. | Permalink: http://www.zeno.org/nid/20007183267

ʿOmayyade
type: Label
isVariantOf: Omaijade
in scheme: travel!digital Thesaurus

Omaijade
type: Label
hasVariant: ʿOmayyade
in scheme: travel!digital Thesaurus

Mermnade
type: Concept
related match: List of kings of Lydia
in scheme: travel!digital Thesaurus
pref label: Mermnade
definition: Meyers Großes Konversations-Lexikon 1908: Mermnāden, lydisches Königsgeschlecht, das, von den Herakliden (Sandoniden) vertrieben, mit karischer Hilfe diese stürzte und mit Gyges 687 v. Chr. den lydischen Königsthron bestieg. Es machte nach Vertreibung der Kimmerier die Lydier zum mächtigsten Volk Kleinasiens. Der letzte Mermnade, Krösos, wurde von dem Perserkönig Kyros 546 seiner Herrschaft beraubt. | Quelle: Meyers Großes Konversations-Lexikon, Band 13. Leipzig 1908, S. 641. | Permalink: http://www.zeno.org/nid/20007077750

Mermnade
type: Label
in scheme: travel!digital Thesaurus

Ptolemäer
type: Concept
definition: Duden: Angehöriger eines makedonischen Herrschergeschlechtes im hellenistischen Ägypten | Meyers Großes Konversations-Lexikon 1908: Ptolemäos, gemeinschaftlicher Name der mazedonisch-griech. Beherrscher Ägyptens (Ptolemäer oder Lagiden), deren man im ganzen 16 zählt. Der erste ist P. J., der Sohn des Lagos (Lagi), auch Sotēr (»Retter«) genannt, welchen Beinamen ihm die Rhodier erteilten, denen er Hilfe gegen Demetrios Poliorketes leistete (305 v. Chr.), einer der Feldherren Alexanders d. Gr., der sich besonders auf den Feldzügen in Baktrien und Indien auszeichnete und nach dem Tod Alexanders 323 Ägypten und Libyen als Regent im Namen des Philippus Arrhidäus und Alexanders II., des Sohnes Alexanders d. Gr. später für letztern allein, verwaltete. Nach dem 311 erfolgten Tod Alexanders II. nahm er 305 v. Chr. den Königstitel an. P. beseitigte den frühern Unterstatthalter Kleomenes, der sich durch Habsucht und Erpressung den Haß des Volkes zugezogen, und benutzte den von diesem zusammengeraubten Schatz von 8000 Talenten zur Verschönerung und Befestigung der neuen Hauptstadt Alexandria; er legte den Grund in dem weltberühmten Museum, das mit dem Königspalast in Verbindung stand und die Räume für die alexandrinische Bibliothek sowie die Wohnungen für die Gelehrten und Dichter enthielt. Auch unterwarf sich die Kyrenaika seiner Herrschaft. Nach dem Tode des Antipatros (318) suchte er durch ein Bündnis mit Kassandros und Antigonos sich den Besitz des schon eroberten Syrien zu sichern, verband sich aber bald mit Seleukos gegen Antigonos und besiegte dessen Sohn Demetrios bei Gaza (312); 306 jedoch erlitt seine Flotte durch Demetrios eine Niederlage bei Salamis auf Cypern. 302 beteiligte er sich an dem Vizekönigsbündnis gegen Antigonos, ging aber infolge seines zweideutigen Benehmens, das seine Verbündeten gegen ihn aufgebracht hatte, in dem Friedensschluß, welcher der Niederlage des Antigonos bei Ipsos folgte, leer aus, nahm später an den Kämpfen des Lysimachos und Seleukos ge…
in scheme: travel!digital Thesaurus
pref label: Ptolemäer

Ptolemäer
type: Label
in scheme: travel!digital Thesaurus

Hilalide
type: Concept
related match: Banu Hilal
related: Beni Hilal
in scheme: travel!digital Thesaurus
pref label: Hilalide
definition: bdk: siehe Beni Hilal

Hilalide
type: Label
in scheme: travel!digital Thesaurus

Husseinit
type: Concept
in scheme: travel!digital Thesaurus
definition: Pierer's Universal-Lexikon 1859: Hussein (Hussayn, Husseyn). I. Orientalische Fürsten. A) Khalif: 1) Sohn Alis u. der Fatime, von den Aliden zu Kufah nach dem Tode seines Bruders Hassan zum Khalifen ernannt. Der omajjadische Khalif Dschezid verfolgte H., u. sein Befehlshaber Obeidallah überfiel ihn bei Kerbela, wo H. verdurstete 681. Er ist der dritte Imam der Schiiten, welche glauben, daß er einst wieder auferstehen u. ihrem Glauben den Sieg verschaffen werde, u. welche ihm daher besondere Feste veranstalten. Am Aschurafest trägt man in Hindostan ein Bild seines Kopfes auf einer Lanze herum, wie dieses auf Befehl Jezids geschehen war; man ahmt den Lauf seines Renners nach, mit einem, aus verschiedenen edlen u. unedlen Metallen verfertigten Hufeisen (Mal Szachib, d.i. Freund Hufeisen); ein Ebenbild seines Mausoleums, mit dem Dome zu Kerbelah, wird vom Großwessir herumgetragen. In Persien theilt man ihm zu Ehren am. 10. des Muharrem ein Gericht aus sieben verschiedenen Früchten od. Kräutern (Heft Daneh) an Nachbarn u. Arme aus u. dergl. m.; H. u. Hassan werden oft von den Schiiten angerufen wie Allah. B) Dey von Algier: 2) H., geb. 1764 zu Vourla in Natolien, war vorher Kanonier in Constantinopel, dann Tabakshändler od. Aufwärter in einem Kaffeehause in Algier u. wurde 1818 Dey von Algier; er kam mit den Franzosen in Krieg, welcher sich mit der Eroberung Algiers 1830 endigte, darüber, wie über seine Regierung, s. Algier (Gesch.) III. Er verließ darauf mit Schatz u. Harem Algier u. lebte in Livorno; 1831 besuchte er Paris, kehrte im Oct. wieder nach Italien zurück u. st. 1834 bei Alessandria. C) König von Persien: 3) H., regierte 1694–1722, mit ihm endigte die Dynastieder Sosis, s.u. Persien (Gesch). II. Feldherr. 4) H. Pascha, zog 1797 als Kapudan Pascha gegen den Empörer Paswan Oglu u. belagerte Widdin vergebens, half 1826 die Janitscharen unterdrücken, commandirte 1828 als Seraskier gegen die Russen bei Schumla u. 1832 kürze Zeit in Syrien gegen Ibrahim Pascha, s.u…
pref label: Husseinit

Husseinit
type: Label
in scheme: travel!digital Thesaurus

nasridisch
type: Concept
definition: bdk: die Nasriden betreffend; von den Nasriden stammend, zu ihnen gehörend
related: Nasride
in scheme: travel!digital Thesaurus
pref label: nasridisch

Nasride
type: Concept
alt label: Nasriden-Dynastie
in scheme: travel!digital Thesaurus
alternative label: Nasriden-Dynastie
pref label: Nasride
alt label: Nasridendynastie
alternative label: Nasridendynastie
definition: Meyers Großes Konversations-Lexikon 1908: Naßriden, Benu Naßr, spanisch-arab. Geschlecht, das seinen Ursprung auf Sa'd ibn Obâda, einen der ältesten medinischen Anhänger des Propheten Mohammed, zurückführte. In den auf die Vertreibung der Almohaden aus Spanien (s. Almoraviden) folgenden Bürgerkriegen gelang es dem Naßriden Mohammed ibn el Ahmar, sich 1238 Granadas und eines Teiles von Andalusien zu bemächtigen, wo seine Nachkommen, während das übrige Spanien bereits wieder christlich war, sich noch bis 1492 (s. Boabdil) hielten. Sie waren ein kunstsinniges Geschlecht; ihr Königsschloß, die Alhambra (s. d.), ist bis heute die Perle unter den erhaltenen mohammedanischen Bauwerken außerhalb Indiens. | Quelle: Meyers Großes Konversations-Lexikon, Band 14. Leipzig 1908, S. 438. | Permalink: http://www.zeno.org/nid/20007136323

Nasriden-Dynastie
type: Label
hasVariant: Nasridendynastie
in scheme: travel!digital Thesaurus

Nasridendynastie
type: Label
isVariantOf: Nasriden-Dynastie
in scheme: travel!digital Thesaurus

Nasride
type: Label
in scheme: travel!digital Thesaurus

nasridisch
type: Label
in scheme: travel!digital Thesaurus

Tantalide
type: Concept
in scheme: travel!digital Thesaurus
pref label: Tantalide
definition: Meyers Großes Konversations-Lexikon 1909: Tantălos, im griech. Mythus König des phrygischen Sipylos, Sohn des Zeus und der Pluto, Vater des Pelops und der Niobe, Großvater des Atreus und Thyestes, durfte als Liebling der Götter an ihren Mahlen und Beratungen teilnehmen, bis sie ihn wegen eines Frevels in die Unterwelt verstießen, weil er ihnen, um ihre Allwissenheit zu prüfen, das Fleisch seines Sohnes vorgesetzt, oder weil er des Zeus geheime Ratschlüsse ausgeplaudert oder Nektar und Ambrosia entwendet und Freunden mitgeteilt hatte. In der Unterwelt büßt er nach Homer durch ungestillten Hunger und Durst: bis zum Kinn steht er in Wasser, die schönsten Früchte hängen ihm vor den Augen; will er aber essen oder trinken, so weichen [313] Früchte und Wasser zurück. Bei Pindar, andern Lyrikern und den Tragikern quält ihn ein über seinem Haupte hängender, stets den Sturz drohender Felsblock. | Quelle: Meyers Großes Konversations-Lexikon, Band 19. Leipzig 1909, S. 313-314. | Permalink: http://www.zeno.org/nid/20007561881

Tantalide
type: Label
in scheme: travel!digital Thesaurus

Tomar
type: Concept
definition: Meyers Großes Konversations-Lexikon 1907: Gwalĭor, Hauptstadt des gleichnamigen britisch-ind. Vasallenstaates (s. oben), liegt 16 im ü. M. am Fuß eines frei stehenden, 104 m hohen, oben 1895 m langen und 609 m breiten Felsens mit einer der stärksten, von den Engländern besetzten Festungen Indiens. Am Ostabhang des Felsens liegt die sehr schmutzige Altstadt und die Laschkar genannte Neustadt, mit zwei großen Dschainatempeln, einem großen Palast des Maharadscha und (1901) 89,154 Einw. (67,899 Hindu, 18,849 Mohammedaner, 208 Christen), die bedeutende Fabrikation von Waffen, Papier u. a. betreiben. Auch befindet sich hier eine katholische Mission. – Die Gründung der Stadt und des Staates fällt in das Jahr 275 n. Chr.; der Gründer Toramana, anfangs ein Vasall der Gupta-Dynastie in Hindostan, hinterließ seinem Nachfolger ein selbständiges Reich, das sich bis zur Narbada ausdehnte, aber nach ihm verfiel. 1196 kam die Stadt durch Kapitulation[557] an den mohammedanischen (tatarischen) Mamelucken Kutb ed-din Eibek; 1232 wurde sie von dem Türken Altamsch eingenommen und blieb bis 1398 im Besitz der mohammedanischen Tatarenfürsten von Dehli, die aus der starken Feste von G. ein Staatsgefängnis machten. Damals setzte sich ein Tomara auf den Thron, und diese Dynastie behielt die Regierung, bis 1724 der Mahratthe Ranudschi Sindia davon Besitz nahm. War das Land schon unter den Tomaras das Durchzugsland der Heere der Großmoguls, deren Einfluß sich jene nicht entziehen konnten, so wurde es unter den Sindias noch schlimmer. Am 5. Aug. 1780 wurde die Feste G. im ersten Mahratthenkriege durch Major Popham erstürmt und der Sindia geschlagen. Als »Zeit der Wirren« bezeichnet der Volksmund die Zeit von 1800–18. Von den Folgen der Verwüstungen dieser Zeit (Wellesley, Hastings) erholte sich Malwa erst seit der zweiten Hälfte des 19. Jahrh.; mit der Niederwerfung der Mahratthen in Zentralindien und der Ausrichtung der englischen Herrschaft an der Narbada kehrte Ruhe ein. Der Umfang des Reic…
pref label: Tomar
in scheme: travel!digital Thesaurus

Tomar
type: Label
in scheme: travel!digital Thesaurus

Antistier
type: Concept
in scheme: travel!digital Thesaurus
pref label: Antistier
definition: Pierer's Universal-Lexikon 1857: Antistĭus. Die Antistĭa gens war ein angesehenes plebejisches Geschlecht in Rom, mit den Familien der Labeo, Reginus, Turpio u. Vetus. Von ihnen zu bemerken: 1) Publius, 88 v. Chr., Volkstribun, Vater der Antistia 2), 84 als Sullas Anhänger von Marius getödtet; er war als Redner u. Sachwalter berühmt. 2) Titus, Quästor in Macedonien; als Pompejus kam, zog er sich in das Innere des Landes zurück, um nicht gemeinschaftliche Sache mit ihm zu machen; nach dessen Besiegung von Cäsar nach Rom gerufen, starb er auf der Reise auf Korcyra 45 v. Chr. 3) Cajus A. Vetus, Anhänger Cäsars, stand 57 v. Chr. auf Ciceros Seite gegen Clodius u. focht in den Bürgerkriegen in Syrien gegen Cäcilius Bassus. 4) A. Labeo, Theilnehmer an der Verschwörung gegen Cäsar, ermordete sich nach der Schlacht bei Philippi selbst. 5) A. Labeo, Sohn des Vor., Schüler des Trebatius, Jurist, unter Augustus Prätor; schrieb Mehreres, das nach seinem Tode als Posteriora erschien; veranlaßte mit seinem Schüler Sempr. Proculus die Secte der Proculejaner, griff den Schlendrian der alten Juristen an, brachte die Auslegung der Gesetze auf allgemeine Grundsätze zurück, gab den Begriffen eine genauere Bestimmung u. der Jurisprudeuz durch Hülfe der Geschichtskunde eine bessere Gestalt. Über ihn schrieb Thomasius, Lpz. 1683f.; van Eck, Franeker 1692; Wolfhardt, Rinteln 1741, u. Biener, Lpz. 1786. 6) Lucius A. Vetus, 58 n. Chr. Consul, führte mit Paulinus Pompejus ein Heer nach Germanien;[573] er wurde seit der Ermordung seines Schwiegersohnes, Rubellius Plautus, 62 n. Chr., dem Nero immer verhaßter; von seinem Freigelassenen Fortunatus u. Claudius Damianus angeklagt, floh er auf seine Villa bei Formiä, u. nach fruchtlosen Versuchen, des Kaisers Gnade wieder zu erlangen, öffneten er, seine Schwiegermutter Sextia, u. seine Tochter Antistia, Gemahlin des Rubellius Plautus, Letztere in Asien, sich 67 n. Chr. die Adern. 7) A. Sosianus, 59 u. Chr. Volkstribun, dann Prätor; wegen satyrische…

Antistier
type: Label
in scheme: travel!digital Thesaurus

Idriside
type: Concept
in scheme: travel!digital Thesaurus
pref label: Idriside
definition: Meyers Großes Konversations-Lexikon 1906: Edrisiden (Idrisiden), arab. Dynastie, die ihren Ursprung von Ali herleitete, machte sich um 788 n. Chr. im nordwestlichen Afrika (Marokko) unabhängig und wurde 974 von den spanischen Omajjaden gestürzt. Ein Zweig der E., die Hammuditen, suchte sich sodann in Spanien eine Herrschaft zu gründen, indem sich der Hammudite Ali 1016 zum Kalifen von Cordoba aufwarf. Später besaßen noch einige Fürsten des Geschlechts Herrschaften im südlichen Spanien und in Nordafrika. | Quelle: Meyers Großes Konversations-Lexikon, Band 5. Leipzig 1906, S. 381. | Permalink: http://www.zeno.org/nid/20006529364

Idriside
type: Label
in scheme: travel!digital Thesaurus

Atabeke
type: Concept
pref label: Atabeke
in scheme: travel!digital Thesaurus
definition: Duden: Atabeg: ehemaliger türkischer Titel für Emire | Meyers Großes Konversations-Lexikon 1905: Atabek (türk., »Vaterfürst«), ursprünglich Name der Prinzenerzieher an den Höfen der seldschukischen Sultane, die sich später zu unabhängigen Herren machten und im Norden Persiens und in Mesopotamien mit Glück regierten. | Quelle: Meyers Großes Konversations-Lexikon, Band 2. Leipzig 1905, S. 17. | Permalink: http://www.zeno.org/nid/20006262171 | Pierer's Universal-Lexikon 1857: Atabek (arab., pers. Atabaklan), bei den Seldschucken Erzieher des Fürsten, Oberhofmeister; die A-s wurden durch die Gunst u. Schwäche der Sultane zu solcher Macht erhoben, daß sie in Asien 4 Fürstenstämme (in Irak, Adserbidschan, Farsistan u. Laristan) bildeten, vom 11. bis Mitte des 14. Jahrh., s. Persien (Gesch.). | Quelle: Pierer's Universal-Lexikon, Band 1. Altenburg 1857, S. 864. | Permalink: http://www.zeno.org/nid/20009421319

Atabeke
type: Label
in scheme: travel!digital Thesaurus

Attalide
type: Concept
definition: bdk: Herrschergeschlecht zur Zeit des Hellenismus | Meyers Großes Konversations-Lexikon 1905: Attălos, Name mehrerer Könige von Pergamon: 1) A. I., geb. 269 v. Chr., gest. 197, folgte 241 seinem Vater Eumenes I. in der Herrschaft und nahm nach dem Sieg über die Vorderasien plündernden Kelten bei Sardes um 239 den Königstitel an. In seinem Kampf gegen Antiochos Hierax bei Koloë siegreich (227), ward er bald danach durch Seleukos III. Soter und Antiochos III. aus dem eben gewonnenen seleukidischen Kleinasien wieder verdrängt und schloß sich 211 an die Römer an. Als er auch im zweiten Makedonischen Krieg in Griechenland gegen Philipp V. focht, wurde er 197 zu Theben vom Schlage gerührt. Zum Gedächtnis seines Galliersieges stiftete er vier Gruppen auf die Akropolis in Athen (den Kampf der Götter gegen die Giganten, des Theseus gegen die Amazonen, die Schlacht bei Marathon und seinen eignen Sieg), wovon einige Statuen noch in den Museen zu Venedig und Neapel, im Vatikan und im Louvre vorhanden sind, und begann den Bau des großen Zeusaltars, den sein Sohn Eumenes II. vollendete, und dessen Skulpturen sich jetzt in Berlin befinden (s. Pergamon). | 2) A. II. Philadelphos, geb. 210 v. Chr., gest. 138, zweiter Sohn des vorigen, folgte 159 seinem Bruder Eumenes II., nachdem er das Wohl seiner Heimat in Rom vertreten hatte. Er setzte den vertriebenen Ariarathes Philopator von Kappadokien wieder ein. Gegen Prusias von Bithynien erbat er Roms Hilfe, begünstigte den Sturz des Prusias durch dessen Sohn Nikomedes (148) und hatte Anteil an der Erhebung des Alexander Balas (Theopator Euergetes, 150–145) auf den syrischen Thron. Den Römern half A. bei Vertreibung des Pseudo-Philippos, bei Bekämpfung der Achäer und der Eroberung Korinths. | 3) A. III. Philometor, Sohn Eumenes' II., Neffe und Nachfolger des vorigen, wütete gegen Anverwandte und Freunde, trieb aber bald darauf, von Schwermut ergriffen, nur noch Gärtnerei, Bildhauerei und Erzgießerei. Er starb 133. In seinem Testament (Fäl…
pref label: Attalide
in scheme: travel!digital Thesaurus

Attalide
type: Label
in scheme: travel!digital Thesaurus

Karamanli
type: Concept
related: Karaman
pref label: Karamanli
in scheme: travel!digital Thesaurus
definition: bdk: siehe Karaman

Karamanli
type: Label
in scheme: travel!digital Thesaurus

Branchide
type: Concept
in scheme: travel!digital Thesaurus
pref label: Branchide
definition: bdk: Priestergeschlecht zur Zeit des Hellenismus | Meyers Großes Konversations-Lexikon 1905: Branchīden, hellen. Priestergeschlecht, das sich von Branchos (»der Heisere«), einem Seher des Apollon, ableitete und das von Äoliern und Ioniern wie von Barbaren gleichgefeierte Apollonorakel zu Didymoi (s.d.) im milesischen Gebiet verwaltete. | Quelle: Meyers Großes Konversations-Lexikon, Band 3. Leipzig 1905, S. 311. | Permalink: http://www.zeno.org/nid/20006361668

Branchide
type: Label
in scheme: travel!digital Thesaurus

Djambelât
type: Concept
pref label: Djambelât
in scheme: travel!digital Thesaurus
definition: bdk: Herrschergeschlecht im Libanon

Djambelât
type: Label
in scheme: travel!digital Thesaurus

Flavier
type: Concept
definition: Duden: Angehöriger eines römischen Kaisergeschlechtes | Meyers Großes Konversations-Lexikon 1906: Flavĭer, röm. Kaiserhaus, dem die Kaiser Titus Flavius Vespasianus (69–79 n. Chr.), Titus (79–81) und Domitianus (81–96) angehörten, und das mit des letztern Ermordung unterging. | Quelle: Meyers Großes Konversations-Lexikon, Band 6. Leipzig 1906, S. 667. | Permalink: http://www.zeno.org/nid/20006615198
in scheme: travel!digital Thesaurus
pref label: Flavier

Flavier
type: Label
in scheme: travel!digital Thesaurus

omaijadisch
type: Concept
alternative label: ʿomayyadisch
alt label: omayyadisch
alt label: ʿomayyadisch
alternative label: omayyadisch
pref label: omaijadisch
in scheme: travel!digital Thesaurus
definition: bdk: die Omaijaden betreffend; von den Omaijaden stammend, zu ihnen gehörend
related: Omaijade

omayyadisch
type: Label
hasVariant: ʿomayyadisch
isVariantOf: omaijadisch
in scheme: travel!digital Thesaurus

ʿomayyadisch
type: Label
hasVariant: omayyadisch
isVariantOf: omaijadisch
in scheme: travel!digital Thesaurus

omaijadisch
type: Label
hasVariant: ʿomayyadisch
hasVariant: omayyadisch
in scheme: travel!digital Thesaurus

Kuschândynastie
type: Concept
pref label: Kuschândynastie
related match: Kushan Empire
alternative label: Kuschân-Dynastie
in scheme: travel!digital Thesaurus
definition: bdk: siehe Kuschân, Dynastie
related: Kuschân
alt label: Kuschân-Dynastie

Kuschândynastie
type: Label
hasVariant: Kuschân-Dynastie
in scheme: travel!digital Thesaurus

Kuschân-Dynastie
type: Label
isVariantOf: Kuschândynastie
in scheme: travel!digital Thesaurus

Kuschân
type: Concept
related match: Kushan Empire
pref label: Kuschân
in scheme: travel!digital Thesaurus
definition: bdk: Herrschergeschlecht in Indien

Kuschân
type: Label
in scheme: travel!digital Thesaurus

Zijaniden-Dynastie
type: Concept
definition: bdk: siehe Zijanide, Dynastie
related: Zijanide
in scheme: travel!digital Thesaurus
pref label: Zijaniden-Dynastie

Zijaniden-Dynastie
type: Label
in scheme: travel!digital Thesaurus

Dynastie
type: Label
in scheme: travel!digital Thesaurus

Medici
type: Concept
pref label: Medici
in scheme: travel!digital Thesaurus
definition: Duden: Angehörige[r] eines florentinischen Geschlechts | Meyers Großes Konversations-Lexikon 1908: Medici (spr. mēditschi, Mediceer), das berühmteste florentinische Geschlecht, das aus dem Mugello, dem Hügelland nördlich von Florenz, gebürtig, schon im 13. Jahrh. durch glückliche Handelsunternehmungen zu Reichtum und Macht gelangt war. Die M. gehörten zu den angesehenen Popolanenfamilien, welche die Herrschaft der Grandi bekämpften. Nach dem Wappen der M., den palle (roten Kugeln), hießen ihre Anhänger Palleschi. Zuerst 1291 erscheint ein Ardingo de' M. unter den Prioren der Zünfte von Florenz. 1314 war Averardo de' M. Gonfaloniere der Stadt, 1348 Francesco, Ardingos Sohn, der 1343 nach der Vertreibung Walters von Brienne einer der zur Neuordnung der Verfassung bestimmten Bürger war. Bartolomeo de' M. versuchte 1360 vergeblich eine Erhebung gegen die herrschende Guelfenoligarchie. Sein Bruder Salvestro de' M., 1378 Gonfaloniere di Giustizia, unternahm eine Änderung der oligarchisch-aristokratischen Verfassung im volkstümlichen Sinn und gab dadurch Veranlassung zu der Bewegung, die in dem Aufstand der Ciompi gipfelte; nach dessen Niederwerfung wurde er 1382 verbannt. Bedeutendes Ansehen genoß sein Verwandter Vieri de' M., der es 1393 ablehnte, sich an die Spitze einer Erhebung gegen die Albizzi und die Aristokraten zu stellen, und 1395 starb. Eine noch größere Stellung nahm zu Anfang des 15. Jahrh., als eigentliches Haupt der Volkspartei, Giovanni di Bicci de' M. ein, Averardos Sohn (geb. 1360), der durch glückliche Handelsgeschäfte ein außerordentlich großes Vermögen erworben und als Diplomat seiner Vaterstadt große Verdienste geleistet hatte; er schuf eine neue Ordnung des Steuerkatasters, war dreimal Prior und 1421 Gonfaloniere. Nach seinem Tode (20. Febr. 1429) trat sein Sohn Cosimo de' M., geb. 1389 (vgl. Fabroni, Cosmi Medicei vita, Pisa 1780), an die Spitze der Volkspartei und verschaffte sich durch Freigebigkeit einen starken Anhang. Als jedoch 1433 Rinaldo A…

Medici
type: Label
in scheme: travel!digital Thesaurus

Komnene
type: Concept
in scheme: travel!digital Thesaurus
pref label: Komnene
definition: Pierer's Universal-Lexikon 1860: Komnenen, griechische Kaiserfamilie, von italischer Abstammung, deren Vorfahren aber nach Asien gezogen waren. Ihre Erbgüter lagen im Gebiete von Kastamona unweit des Pontos Euxinos. A) Die Familie kam 1057 durch Isaak, Sohn Michaels Komnenos, in Folge einer Revolution gegen den Kaiser Michael VI., auf den Byzantinischen Thron u. regierte mit kurzer Unterbrechung (1059_–1081) seit Alexis I. bis 1185 im Mannesstamm, dann fortgesetzt durch die von weiblicher Seite von den K. stammenden Angelen bis 1204, wo sie durch die Lateiner gestürzt wurden, s.u. Byzantinisches Reich II. C) u. D). Als Schriftstellerin zeichnete sich aus diesem Geschlecht Anna Komnena, Tochter des Alexis I., aus, s. Anna 64). B) Nach der Vertreibung der K. aus Constantinopel gründete ein Prinz aus dem Hause der K., Alexius, 1204 in Trapezunt, wo er damals byzantinischer Statthalter war, ein selbständiges Reich u. seine Nachkommen regierten dort als Kaiser bis 1461, wo der letzte Komnene, Kaiser David, vom Sultan Muhammed II. gestürzt u. 1462 mit seiner ganzen Familie hingerichtet wurde. Nach der Sage wurde damals ein K., 1) Georg Nikophoros, gerettet, ging nach der Maina u. seine Nachkommen führten dort fortwährend Krieg gegen die Türken; 2) Constantin, ein Nachkomme des Vorigen, verließ 1675 die Maina, wanderte nach Genua aus u. ging zuletzt nach Corsica, wo er Paormia erwarb u. seine Nachkommen bis 1729 als Capitani dort walteten; einer seiner Söhne, Kalomeros, soll nach Toscana übergesiedelt u. dort der Stammvater der Familie Bonaparte (die italienische Übersetzung von Kalomeros) geworden sein. 3) Demetrios Komnenos, angeblich ein Nachkomme des Vorigen, geb. 1750 auf Corsica, wurde von Ludwig XVI. durch ein königliches Schreiben 1782 als Nachkomme des David K. anerkannt, weil es der französischen Regierung nützlich schien, für den Fall der Vertreibung der Türken aus Constantinopel, einen Prätendenten des türkischen Throns im Lande zu haben. Beim Ausbruch der Revo…

Komnene
type: Label
in scheme: travel!digital Thesaurus

Karamanlidynastie
type: Concept
related: Karaman
related: Karamanli
in scheme: travel!digital Thesaurus
pref label: Karamanlidynastie
definition: bdk: siehe Karaman

Karamanlidynastie
type: Label
in scheme: travel!digital Thesaurus

Bragança
type: Concept
related match: Duke of Braganza
in scheme: travel!digital Thesaurus
pref label: Bragança
definition: Meyers Großes Konversations-Lexikon 1905: Bragança, Stammname der bis 1853 in Portugal und bis 1889 in Brasilien regierenden Dynastie, genannt nach der Stadt B. Ihr Stammvater ist Alfons von Portugal, Herzog von B. (gest. 1461), natürlicher Sohn Johanns I. von Portugal. So der herrschenden Dynastie verwandt, stieg das Haus, zumal es im Besitz großer Reichtümer war, zu großem Ansehen, so daß der dritte Herzog, Fernando II., sich 1483 an der Spitze des Adels gegen König Johann II. aufzulehnen wagte. Obwohl er aber sein Unternehmen[302] mit dem Tode büßte, blieb das Haus so angesehen, daß 1580 beim Aussterben der Königsfamilie Herzog Johann von B., als Gemahl einer Enkelin Manuels d. Gr., gegen Philipp II. von Spanien Anspruch auf den portugiesischen Thron erhob. Erst nach der Losreißung Portugals 1640 bestieg das Haus B. mit Johann IV. den portugiesischen Thron, der aber unter der neuen Dynastie mehr und mehr herabsank. Napoleon I. erklärte 15. Nov. 1807 das Haus B. des Thrones verlustig, weshalb König Johann VI. nach Brasilien flüchtete; doch wurde nach dem Sturz Napoleons 1814 der Thron der B. in Portugal hergestellt. Als König Johann VI. 1821 nach Portugal zurückkehrte, ließ er in Brasilien seinen ältesten Sohn, Dom Pedro, zurück, der am 12. Okt. 1822 zum selbständigen Kaiser von Brasilien ausgerufen wurde. So spaltete sich das Haus B. in zwei Linien, die portugiesische und die brasilische. Nach dem Tode Johanns VI. 1826 verzichtete Dom Pedro 2. Mai auf den portugiesischen Thron zu gunsten seiner Tochter Maria da Gloria. Diese bestieg nach dem Sturz des Infanten Dom Miguel, zweiten Sohnes von Johann VI., den Thron von Portugal 23. Sept. 1833 und vermählte sich 26. Jan. 1836 mit dem Herzog August von Leuchtenberg und nach dessen Tode mit dem Prinzen Ferdinand von Sachsen-Koburg. Mit ihrem Tode (15. Nov. 1853) erlosch das Haus B. in Portugal, und es folgte mit Pedro V. das Haus Koburg. Doch hinterließ Dom Miguel (s.d.) einen Sohn, Prinz Miguel (geb. 19. Sept. 1853), …

Bragança
type: Label
in scheme: travel!digital Thesaurus

Sertier
type: Concept
pref label: Sertier
in scheme: travel!digital Thesaurus
definition: bdk: Geschlecht in Timgad | Meyers Großes Konversations-Lexikon 1909: Timgad (Temgad, Thamgad), große Ruinenstätte in der alger. Provinz Constantine, 96 km südlich von der Stadt Constantine, am Nordfuß des Dschebel Aures, in welliger Ebene, die römische Colonia Marciana Trajana Thamugas (von Plinius Thanutada, von Antonin Thamugadi [s. d.] genannt), die nach Trajans Siegen über die Parther durch dessen Legaten L. Munitius Gallus 100 v. Chr. als Militärstation mit römischen Veteranen der 13. Legion Ulpia Victrix gegründet und Knotenpunkt von sechs Römerstraßen wurde, von denen zwei über Lambäsis (das heutige Lambessa, s. d.), eine dritte über Diana Veteranorum (Zama) nach Setif, eine vierte und fünfte über Mascula (Ain Khenchela) nach Theveste, eine sechste nach Constantine führten. Gegenüber Lambäsis, dem militärischen Mittelpunkt Numidiens, wurde T. Mittelpunkt des Handels und des Ackerbaues dieses Teiles des Tell. Ausgegraben sind schöne, an Pompeji erinnernde Bauwerke und Bildsäulen, unter anderm eine mächtige von dem byzantinischen Feldherrn Salomon (535), Triumphbogen, Amphitheater, Säulen des Forum, Jupitertempel, Kirche (546), Bäder, Schleusen etc. Vgl. Boeswillwald, Cagnat und Ballu, T., une cité africaine (Par. 1891–1905, Lief. 1–8); Ballu, Les ruines de T. (das. 1897, neue Folge 1904); Brossard, Colonies françaises (Par. 1906); Holtzinger, T. und die römische Provinzialarchitektur in Nordafrika (Stuttg. 1906). | Quelle: Meyers Großes Konversations-Lexikon, Band 19. Leipzig 1909, S. 557. | Permalink: http://www.zeno.org/nid/20007586884

Sertier
type: Label
in scheme: travel!digital Thesaurus

seldschukisch
type: Concept
definition: bdk: die Seldschuken betreffend; von den Seldschuken stammend, zu ihnen gehörend
in scheme: travel!digital Thesaurus
pref label: seldschukisch
related: Seldschuke

seldschukisch
type: Label
in scheme: travel!digital Thesaurus

Seldschuke
type: Concept
in scheme: travel!digital Thesaurus
definition: Duden: Angehöriger eines türkischen Volksstammes | Meyers Großes Konversations-Lexikon 1909: Seldschuken (Seldschukiden), aus Bochara gebürtiger türk. Stamm, den um 1000 Seldschuk (gest. 1030), der Sohn Jakaks, zum Islam bekehrte. Seldschuks Sohn Arslan und seine Enkel Dschaghirbey und Toghrilbey stürzten das Ghasnawidenreich und eroberten Turan und Iran; Toghrilbey (gest. 1063) wurde, 1060 vom Kalifen Alkaim zu Hilfe gerufen, nach dessen Vertreibung Emir al Omra, König des Westens und Ostens und schlug seine Residenz in Ispahan auf. Ihm folgte sein Neffe Alp Arslan (1063–72), der Syrien und Kleinasien (Sultanat Rum mit der Hauptstadt Konia) eroberte, diesem sein Sohn Melikschah (1072–92), der wissenschaftliche Studien förderte und als Großsultan vom Ägäischen Meer bis zum Indus, vom Persischen Golf bis zum Jaxartes herrschte. Nach seinem Tode zerfiel das Reich. Die Nachkommen Melikschahs, Barkjarok (gest. 1104), Mohammed (gest. 1119) und Sandschar (gest. 1158), behaupteten die östlichen Provinzen, das Hochland von Iran; der letzte, Togrulschah, erlag 1194 den Chowaresmiern. Jüngere Zweige des Hauses oder abgefallene Emire gründeten Herrschaften in Syrien, Mesopotamien und Kleinasien, so das Seldschukenreich von Ikonion in Kleinasien, das 1073 Suleiman, der Sohn Kultusmisch', gründete, ferner die von Antiochia, Damaskus und Aleppo, von Edessa und Mosul, die teils im 12. Jahrh. von Saladin, teils im 13. Jahrh. von den Osmanen vernichtet wurden. Vgl. Mirchonds[319] »Geschichte der S.« (a. d. Pers. von J. A. Vullers, Gießen 1837); Houtsma, Recueil de textes relatifs à l'histoire des Seldjoucides (Leiden 1887 ff.) und Histoire des Seldjoucides d'Asie Mineure d'après Ibn-Bibi (das. 1903); Sarre, Reise in Kleinasien. Forschungen zur seldjukischen Kunst und Geographie des Landes (Berl. 1896). | Quelle: Meyers Großes Konversations-Lexikon, Band 18. Leipzig 1909, S. 319-320. | Permalink: http://www.zeno.org/nid/20007461836
related: Seldschuk
alt label: Seldjukide
alt label: Seldjuke
alternative label: Seldjukide
pref label: Seldschuke
alternative label: Seldjuke

Seldschuk
type: Concept
definition: bdk: siehe Seldschuke
in scheme: travel!digital Thesaurus
pref label: Seldschuk

Seldschuk
type: Label
in scheme: travel!digital Thesaurus

Seldjukide
type: Label
in scheme: travel!digital Thesaurus
isVariantOf: Seldjuke

Seldjuke
type: Label
hasVariant: Seldjukide
isVariantOf: Seldschuke
in scheme: travel!digital Thesaurus

Seldschuke
type: Label
hasVariant: Seldjuke
in scheme: travel!digital Thesaurus

Thayhri
type: Concept
alternative label: Zegri
pref label: Thayhri
related match: Abencerrages
alt label: Zegri
in scheme: travel!digital Thesaurus
definition: Pierer's Universal-Lexikon 1865: Zegris, maurisches Geschlecht in Granada, s.u. Abenceragen, vgl. Spanien S. 362. | Quelle: Pierer's Universal-Lexikon, Band 19. Altenburg 1865, S. 544. | Permalink: http://www.zeno.org/nid/20011328517 | Meyers Großes Konversations-Lexikon 1905: Abencerragen, edles arab. Geschlecht in Granada, das nach Ibn Serradsch, dem Vertrauten des Königs Mohammed VII. von Granada (1392–1407), den Namen A. erhielt. Die A. waren mit dem Geschlechte der Zegris in Zwist geraten und standen auch dem König Abul Hassan (gegen 1480) in geheimer Feindschaft gegenüber. Als nun letzterer von der Liebschaft zwischen einem der A. und seiner Schwester Zoraïde erfahren hatte, ließ er die A. in die Alhambra locken und ermorden. Noch heute heißt ein Teil der Alhambra (s. d.) »Saal der A.«. Diese (historisch nicht bezeugte) Begebenheit liegt Chateaubriands Erzählung: »Les aventures du dernier des Abencérages« zu Grunde, wonach Jouy das Textbuch zu Cherubinis Oper »Die A.« bearbeitete. | Quelle: Meyers Großes Konversations-Lexikon, Band 1. Leipzig 1905, S. 25. | Permalink: http://www.zeno.org/nid/20006184154

Thayhri
type: Label
hasVariant: Zegri
in scheme: travel!digital Thesaurus

Zegri
type: Label
isVariantOf: Thayhri
in scheme: travel!digital Thesaurus

Tomardynastie
type: Concept
related: Tomar
pref label: Tomardynastie
in scheme: travel!digital Thesaurus
definition: bdk: siehe Tomar, Dynastie

Tomardynastie
type: Label
in scheme: travel!digital Thesaurus

Paläologos
type: Concept
pref label: Paläologos
in scheme: travel!digital Thesaurus
definition: Meyers Großes Konversations-Lexikon 1908: Paläolōgen, die letzte Dynastie des Oströmischen Reiches (s. d., S. 237), deren Stifter Michael VIII. Paläologos 1259 als Mitregent des unmündigen Kaisers Johann IV. Laskaris, den er später blenden ließ, den Kaiserthron von Nikäa bestieg und 1261 nach Vernichtung des lateinischen Kaisertums auch in Konstantinopel zur Herrschaft kam, und deren letzter Kaiser, Konstantin XI., 1453 bei der Eroberung Konstantinopels durch die Osmanen seinen Tod fand. Ein Zweig dieses Geschlechts war 1305 durch Erbschaft in den Besitz der Grafschaft Montserrat gelangt und hat dort bis 1533 regiert. Ein dritter Zweig herrschte in Morea von 1383–1460. Nach der Eroberung der Halbinsel durch die Türken flohen die P. nach Italien, und ein Neffe Konstantins XI., Andreas Paläologos, trat 1494 dem König Karl VIII. von Frankreich, später bei seinem Tode (1502) Ferdinand dem Katholischen und Isabella von Kastilien seine Rechte auf das byzantinische Reich ab. Der letzte Nachkomme der P., Fürst Giovanni Laskaris Paläologos, starb 1874 in Turin. | Quelle: Meyers Großes Konversations-Lexikon, Band 15. Leipzig 1908, S. 316. | Permalink: http://www.zeno.org/nid/20007204620
alt label: Paläolog
alternative label: Paläolog

Paläologos
type: Label
in scheme: travel!digital Thesaurus
hasVariant: Paläolog

Paläolog
type: Label
in scheme: travel!digital Thesaurus
isVariantOf: Paläologos

Morabitîn
type: Concept
preferred label: al-morabitîn @ar
pref label: al-morabitîn
related: Almoravide
definition: Brockhaus' Kleines Konversations-Lexikon 1911: Morabīten, s.v.w. Almoraviden (s.d.). | Quelle: Brockhaus' Kleines Konversations-Lexikon, fünfte Auflage, Band 2. Leipzig 1911., S. 212. | Permalink: http://www.zeno.org/nid/20001368133
pref label: Morabitîn
in scheme: travel!digital Thesaurus

al-morabitîn
type: Label
isTranslationOf: Morabitîn
in scheme: travel!digital Thesaurus

Morabitîn
type: Label
hasTranslation: al-morabitîn
in scheme: travel!digital Thesaurus

Filali
type: Concept
definition: Pierer's Universal-Lexikon 1858: Filali, der wichtigste Stamm des im Sultanat Marokko (Afrika) wohnenden Berbervolkesder Amazirghen; nach ihm hat der District Tafilelt seinen Namen. | Quelle: Pierer's Universal-Lexikon, Band 6. Altenburg 1858, S. 273. | Permalink: http://www.zeno.org/nid/20009923330
in scheme: travel!digital Thesaurus
pref label: Filali

Filali
type: Label
in scheme: travel!digital Thesaurus

Fâtimide
type: Concept
in scheme: travel!digital Thesaurus
pref label: Fâtimide
definition: Duden: Fatimiden: vom 10. bis 12. Jahrhundert regierende islamische Dynastie in Nordafrika und im Vorderen Orient | Meyers Großes Konversations-Lexikon 1906: Fatimiden (Aliden), mohammed. Dynastie, gegründet von Abu Abdallah Hosein, einem Missionar der Ismaeliten (s.d.). Dieser warb für Obeid Allah ibn Mohammed, einen angeblichen Nachkommen der Fâtima, der Tochter des Propheten Mohammed, der jedoch in Wirklichkeit von einem persischen Augenarzt abstammte, unter den Berbern zahlreiche Anhänger und stürzte mit ihrer Hilfe die Dynastie der Aghlabiden im jetzigen Tunis (910). Obeid Allah (910 bis 934) unterwarf sich ganz Nordafrika von den Grenzen Marokkos bis an die Grenzen Ägyptens, nahm den Titel Mahdi, »Rechtgeleiteter«, an und schlug seine Residenz in dem von ihm gegründeten Mahedîa (an der Kleinen Syrte) auf. Indem er die Autorität der Abbasiden bestritt und selbst den Titel Kalif und Emîr-el-muminîn (»Fürst der Gläubigen«) annahm, wurde er der Urheber eines großen Schismas unter den Mohammedanern. Der mächtigste der Fatimiden-Kalifen war sein Urenkel Mo'izz (953 bis 975); er eroberte Fes und Sizilien und verlegte, nachdem sein Feldherr Dschauher 969 Ägypten unterworfen hatte, drei Jahre später seinen Hof nach dem neugegründeten Kairo. Er befahl, daß der Name der Abbasiden-Kalifen im Freitagsgebet durch seinen eignen ersetzt werde; man datiert daher gewöhnlich von diesem Zeitpunkt ab das Schisma der Fatimiden- und Abbasiden-Kalifen. Von Ägypten aus eroberte Mo'izz ganz Palästina und Syrien bis Damaskus. Sein Sohn Asîs (975–996), ein kluger Regent, erweiterte die Eroberungen in Syrien. Ihm folgte sein Sohn, der durch seine wahnsinnige Tyrannei berüchtigte, rätselhafte Hakim (996–1021). Er erließ die unsinnigsten Verordnungen, verfolgte Christen und Juden, zerstörte 1009 die Auferstehungskirche in Jerusalem (seine Verfolgungen der Christen waren eine der Ursachen der Kreuzzüge) und behauptete schließlich, eine neue Inkarnation Gottes zu sein; zwei seiner Anhänger, d…

Fâtimide
type: Label
in scheme: travel!digital Thesaurus

Anjou und Aragonien
type: Concept
pref label: Anjou und Aragonien
in scheme: travel!digital Thesaurus
definition: Meyers Großes Konversations-Lexikon 1905: Anjou (spr. angschu), ehemalige franz. Provinz (s. die Geschichtskarte bei »Frankreich«), von Maine, Bretagne, Poitou und Touraine umgeben, zerfiel in die Landschaften A. im engern Sinn und Saumurois und war 8975 qkm (163 QM.) groß mit etwa 400,000 Einw., umfaßt hauptsächlich das jetzige Depart. Maine-et-Loire. Hauptstadt war Angers. – A. wurde einst von den Andekaven (Andecavi) bewohnt und von den Römern unterworfen. Später herrschten hier Grafen, deren Geschlecht 1060 erlosch. Besitztümer und Titel gingen durch eine Schwester des letzten männlichen Sprößlings an das Haus Gatinais über, dem Gottfried V., der Ahnherr der Plantagenets (s. d.), angehörte. Er hinterließ A. und die Normandie 1151 seinem ältern Sohn, Heinrich, der 1154 als Heinrich II. den Thron von England bestieg, wo seine Nachkommen bis 1485 regierten (vgl. Norgate, England under the Angevin kings, Lond. 1887). A. ging schon 1204 unter Johann ohne Land mit der Normandie und fast allen britischen Besitzungen in Frankreich an Philipp II. August verloren. König Ludwig IX. belehnte damit seinen Bruder Johann und nach dessen Tod 1246 seinen zweiten Bruder, Karl, Grafen von Provence, der später König von Neapel und Stammvater des ältern Hauses A. daselbst wurde. Seine Enkelin Margarete brachte die Grafschaft A. ihrem Gemahl, Karl von Valois, dem Bruder Philipps IV. von Frankreich, zu, und dieser erhob sie 1297 zur Pairie. Margaretens und Karls Sohn ward 1328 als Philipp VI. König von Frankreich, wodurch die Linie Valois auf den französischen Thron gelangte und zugleich A. wieder mit der Krone vereinigt wurde. König Johann II. verlieh es als Herzogtum seinem zweiten Sohn, der als Ludwig I. 1382 König von Neapel und Stammvater des jüngern Hauses A. daselbst wurde. Das Herzogtum gehörte nun den Königen von Neapel, bis es nach dem Tode Renés II. (1480) durch Ludwig XI. für immer mit der französischen Krone vereinigt wurde. Seitdem führte gewöhnlich ein Prinz von Frankre…
related match: Aragon
related match: Anjou

Anjou und Aragonien
type: Label
in scheme: travel!digital Thesaurus

Maʿanîde
type: Concept
definition: bdk: Herrschergeschlecht im Libanon
pref label: Maʿanîde
in scheme: travel!digital Thesaurus

Maʿanîde
type: Label
in scheme: travel!digital Thesaurus

Sklavendynastie
type: Concept
in scheme: travel!digital Thesaurus
related: Sklave
definition: bdk: siehe Sklave, Dynastie
pref label: Sklavendynastie

Sklavendynastie
type: Label
in scheme: travel!digital Thesaurus

ptolemäisch
type: Concept
definition: bdk: die Ptolemäer betreffend; von den Ptolemäern stammend, zu ihnen gehörend
related: Ptolemäer
in scheme: travel!digital Thesaurus
pref label: ptolemäisch

ptolemäisch
type: Label
in scheme: travel!digital Thesaurus

Kara Osman Oglu
type: Concept
pref label: Kara Osman Oglu
related: Osman
definition: bdk: siehe Osman | Pierer's Universal-Lexikon 1861: Oglu (türk.), so v.w. Sohn. O. wird von Söhnen dem Vatersnamen beigefügt, wodurch der Familienname ersetzt wird. | Quelle: Pierer's Universal-Lexikon, Band 12. Altenburg 1861, S. 233. | Permalink: http://www.zeno.org/nid/20010546219
in scheme: travel!digital Thesaurus

Kara Osman Oglu
type: Label
in scheme: travel!digital Thesaurus

râjputanisch
type: Concept
in scheme: travel!digital Thesaurus
related: Râjpute
pref label: râjputanisch
definition: bdk: die Râjputen betreffend, von ihnen stammend, zu ihnen gehörend

râjputanisch
type: Label
in scheme: travel!digital Thesaurus

Geschlecht
type: Concept
narrower: Königsgeschlecht
definition: Duden: Geschlecht: 3. c. Familie, Sippe | Duden: Herrschergeschlecht: Geschlecht, das eine Reihe von Herrschern hervorgebracht hat | Meyers Großes Konversations-Lexikon 1907: Geschlecht, in der Biologie die Eigentümlichkeiten des männlichen oder des weiblichen Individuums (s. Geschlechtseigentümlichkeiten), auch wohl, aber veraltet, soviel wie Gattung (s.d.), z. B. Menschengeschlecht, Pferdegeschlecht, Ahorngeschlecht; im historischen und genealogischen Sinn (Stirps) Inbegriff von Individuen, die einem gemeinschaftlichen Stamm entspringen. Über G. im grammatischen Sinne s. Genus. – Rechtlich bewirkt das G. gegenwärtig an sich keinen Unterschied mehr in der Privatrechtsstellung, während früher das weibliche G. einer Reihe von Beschränkungen unterworfen war. Einzig beim Adel, dem Fideikommißrecht und den Bauernrechten (Anerbenrecht, Huferecht) bestehen noch Bestimmungen, durch die das weibliche G. gewissen Beschränkungen unterliegt. | Quelle: Meyers Großes Konversations-Lexikon, Band 7. Leipzig 1907, S. 683. | Permalink: http://www.zeno.org/nid/20006675476
narrower: Statthaltergeschlecht
in scheme: travel!digital Thesaurus
narrower: Fürstengeschlecht
narrower: Herrschergeschlecht
narrower: Adelsgeschlecht
pref label: Geschlecht
narrower: Priestergeschlecht

Königsgeschlecht
type: Concept
alt label: Königshaus
alternative label: Königshaus
related: königlich
pref label: Königsgeschlecht
in scheme: travel!digital Thesaurus
related: König
definition: bdk: siehe König, Geschlecht
related: Königin

Königshaus
type: Label
in scheme: travel!digital Thesaurus

königlich
type: Concept
pref label: royal
pref label: koninklijk
preferred label: koninklijk @nl
in scheme: travel!digital Thesaurus
definition: Duden: 1. a. [zu] einem König gehörend; Abkürzung: kgl. | b. einem König entsprechend; hoheitsvoll; wie ein König
preferred label: royal @en
related: König
related: Königin
pref label: königlich
narrower: vizeköniglich

royal
type: Label
hasTranslation: koninklijk
hasTranslation: royal
isTranslationOf: königlich
in scheme: travel!digital Thesaurus

koninklijk
type: Label
hasTranslation: royal
isTranslationOf: königlich
in scheme: travel!digital Thesaurus

königlich
type: Label
hasTranslation: royal
in scheme: travel!digital Thesaurus
hasTranslation: koninklijk

royal
type: Label
hasTranslation: royal
isTranslationOf: königlich
in scheme: travel!digital Thesaurus
hasTranslation: koninklijk

König
type: Concept
narrower: Hethiter-König
pref label: king
narrower: Bulgarenkönig
narrower: Maurenkönig
narrower: Exkönig
narrower: Armenierkönig
narrower: Tamilenkönig
definition: Duden: 1. a. Titel des [nach dem Kaiser] höchsten weltlichen Herrschers oder Repräsentanten in bestimmten Monarchien | b. Träger des Königstitels | Meyers Großes Konversations-Lexikon 1907: König (altdeutsch chunig, kuning, angelsächs. cyning, cyng, engl. king, v. got. chuni, »Geschlecht«; griech. Basileus, lat. Rex, franz. Roi, ital. Re, span. Rey, tschech. Král, poln. Król, russ. Korólj, ungar. Király, letztere Ausdrücke v. lat. Carolus, d. h. Karl d. Gr.), in ältester Zeit Titel des Stammesoberhauptes bei den meisten Völkern. Die königliche Macht war damals unbeschränkt und umfaßte das Amt des obersten Priesters, Richters und Feldherrn. Ursprünglich beschränkte sich die Herrschaft des Königs auf einen Stamm, ein Volk, und in diesem Sinne werden auch die Beherrscher von Völkerstämmen in Asien und Afrika Könige genannt. In Europa führen jetzt den Königstitel die Beherrscher größerer, unabhängiger Monarchien. Im Mittelalter übte der[378] deutsche Kaiser, später der Papst das Recht aus, Könige zu ernennen, wie denn namentlich die Herzoge von Böhmen und Polen diesen Titel erhielten. Erst Friedrich III., Kurfürst von Brandenburg und Herzog von Preußen, machte sich aus eigner Machtvollkommenheit 18. Jan. 1701 zum K. von Preußen. Napoleon I., der in allem das von Karl d. Gr. gestiftete römische Reich nachzuahmen suchte, hat neue Königreiche geschaffen. So entstand 1801 ein Königreich Etrurien aus dem vormaligen Großherzogtum Toskana; 1805 machte Napoleon I. sich selbst zum K. von Italien und 1806 seine Brüder Joseph und Ludwig zu Königen von Neapel und Holland. In demselben Jahr entstanden die Königreiche Bayern und Württemberg und im folgenden die Königreiche Sachsen und Westfalen. Nach Napoleons I. Sturz entstanden das Königreich der Niederlande und das Königreich Hannover; an die Stelle des Königreichs Italien traten, unter österreichischer Oberherrschaft, das Lombardisch-Venezianische Königreich, das 1866 mit Italien vereinigt wurde, und das Königreich Illyrien, das …
pref label: König
narrower: Berberkönig
in scheme: travel!digital Thesaurus
narrower: Kuschânkönig
narrower: Gegenkönig
narrower: Syrerkönig
narrower: Philisterkönig
narrower: Vizekönig
narrower: Amoriterkönig
narrower: Vandalenkönig
narrower: Ammoniterkönig
narrower: Singhalesenkönig
related: Adel
related: Herrscher
narrower: Kreuzkönig
narrower: Ghassanidenkönig
narrower: Guanchenkönig
narrower: König-Kaiser
narrower: Sikhkönig
narrower: Großkönig
narrower: Westgotenkönig
narrower: Perserkönig
narrower: Langobardenkönig
preferred label: king @en
narrower: Riesenkönig
narrower: Pagânkönig

Hethiter-König
type: Concept
alternative label: Hethiterkönig
alt label: Hethiterkönig
definition: bdk: siehe Hethiter, König
pref label: Hethiter-König
related: Hethiter
in scheme: travel!digital Thesaurus

Hethiterkönig
type: Label
isVariantOf: Hethiter-König
in scheme: travel!digital Thesaurus

Hethiter-König
type: Label
hasVariant: Hethiterkönig
in scheme: travel!digital Thesaurus

king
type: Label
in scheme: travel!digital Thesaurus
isTranslationOf: König

König
type: Label
in scheme: travel!digital Thesaurus
hasTranslation: king

Bulgarenkönig
type: Concept
related: Bulgare
pref label: Bulgarenkönig
definition: bdk: siehe Bulgare, König
in scheme: travel!digital Thesaurus

Bulgarenkönig
type: Label
in scheme: travel!digital Thesaurus

Maurenkönig
type: Concept
definition: bdk: siehe Maure, König
pref label: Maurenkönig
related: Maure
in scheme: travel!digital Thesaurus

Maurenkönig
type: Label
in scheme: travel!digital Thesaurus

Exkönig
type: Concept
in scheme: travel!digital Thesaurus
definition: bdk: siehe König
pref label: Exkönig

Exkönig
type: Label
in scheme: travel!digital Thesaurus

Armenierkönig
type: Concept
related: Armenier
in scheme: travel!digital Thesaurus
pref label: Armenierkönig
definition: bdk: siehe Armenier, König

Armenierkönig
type: Label
in scheme: travel!digital Thesaurus

Tamilenkönig
type: Concept
in scheme: travel!digital Thesaurus
related: Tamile
definition: bdk: siehe Tamile, König
pref label: Tamilenkönig

Tamilenkönig
type: Label
in scheme: travel!digital Thesaurus

Berberkönig
type: Concept
definition: bdk: siehe Berber, König
in scheme: travel!digital Thesaurus
pref label: Berberkönig
related: Berber

Berberkönig
type: Label
in scheme: travel!digital Thesaurus

Kuschânkönig
type: Concept
definition: bdk: siehe Kuschân, König
related: Kuschândynastie
pref label: Kuschânkönig
in scheme: travel!digital Thesaurus

Kuschânkönig
type: Label
in scheme: travel!digital Thesaurus

Gegenkönig
type: Concept
definition: Duden: dem herrschenden König oder der herrschenden Königin entgegengestellter, von einer Gegenpartei gewählter König
in scheme: travel!digital Thesaurus
pref label: Gegenkönig

Gegenkönig
type: Label
in scheme: travel!digital Thesaurus

Syrerkönig
type: Concept
definition: bdk: siehe Syrer, König
pref label: Syrerkönig
related: Syrer
in scheme: travel!digital Thesaurus

Syrerkönig
type: Label
in scheme: travel!digital Thesaurus

Philisterkönig
type: Concept
definition: bdk: siehe Philister, König
related: Philister
in scheme: travel!digital Thesaurus
pref label: Philisterkönig

Philisterkönig
type: Label
in scheme: travel!digital Thesaurus

Vizekönig
type: Concept
alternative label: Königstellvertreter
pref label: viceroy
in scheme: travel!digital Thesaurus
preferred label: viceroy @en
alt label: Königstellvertreter
definition: Duden: Generalgouverneur oder Statthalter als Vertreter des Monarchen | Meyers Großes Konversations-Lexikon 1909: Vize (v. lat. vicis), an der Stelle, anstatt, zeigt als Zusatz zu Amtstiteln eigentlich den Stellvertreter eines Beamten an, wird aber sehr oft nur als Titel beigegeben, z. B. Vizeadmiral, Vizekanzler, Vizepräsident, Vizedirektor etc. Mittelalterliche Titel waren: Vicecomes (Vizegraf), woraus die Würde des Vicomte (s. d.) entstand; ferner Vizedom (vicedominus, Vitzdom, Vitztum, Vicedom), der Stellvertreter auf einer Herrschaft oder einem Schloß für den damit Belehnten, besonders der Stellvertreter eines mit weltlichen Gütern belehnten Geistlichen oder Klosters, daher soviel wie Schirmherr, Schirmvogt; Vidame (gebildet aus Vizedominus), ehemals Titel des Schutzherrn und Verwesers der geistlichen Güter, dem als Beamten der französischen Bischöfe die Leitung aller Maßregeln für Bewahrung der Kirchenrechte oblag, jetzt soviel wie Stiftsamtmann, Administrator einer geistlichen Besitzung. Im Mittelalter Titel des Vicomte. Jemandes vices vertreten oder in vicibus heißt: die Stelle eines abwesenden Beamten versehen; auch ausgedrückt durch v. n. = vicario nomine, in Vertretung. Vizedomgüter wurden in Österreich auch die Domänen genannt. | Quelle: Meyers Großes Konversations-Lexikon, Band 20. Leipzig 1909, S. 201. | Permalink: http://www.zeno.org/nid/20007657358
pref label: Vizekönig
related: Herrscher

viceroy
type: Label
isTranslationOf: Vizekönig
in scheme: travel!digital Thesaurus

Vizekönig
type: Label
hasTranslation: viceroy
in scheme: travel!digital Thesaurus

Königstellvertreter
type: Label
hasTranslation: viceroy
in scheme: travel!digital Thesaurus

Amoriterkönig
type: Concept
definition: bdk: siehe Amoriter, König
in scheme: travel!digital Thesaurus
pref label: Amoriterkönig
related: Amoriter

Amoriterkönig
type: Label
in scheme: travel!digital Thesaurus

Vandalenkönig
type: Concept
definition: bdk: siehe Vandale, König
pref label: Vandalenkönig
related: Vandale
in scheme: travel!digital Thesaurus

Vandalenkönig
type: Label
in scheme: travel!digital Thesaurus

Ammoniterkönig
type: Concept
related: Ammoniter
in scheme: travel!digital Thesaurus
pref label: Ammoniterkönig
definition: bdk: siehe Ammoniter, König

Ammoniterkönig
type: Label
in scheme: travel!digital Thesaurus

Singhalesenkönig
type: Concept
in scheme: travel!digital Thesaurus
related: Singhalese
pref label: Singhalesenkönig
definition: bdk: siehe Singhalese, König

Singhalesenkönig
type: Label
in scheme: travel!digital Thesaurus

Kreuzkönig
type: Concept
definition: bdk: siehe Kreuzritter, König
in scheme: travel!digital Thesaurus
pref label: Kreuzkönig
related: Kreuzfahrer
related: Kreuzritter

Kreuzkönig
type: Label
in scheme: travel!digital Thesaurus

Kreuzfahrer
type: Concept
definition: Duden: Teilnehmer an einem Kreuzzug (1) | Duden: Kreuzzug: 1. a. im Mittelalter von der Kirche propagierter oder unterstützter Krieg gegen Ungläubige und Häretiker | b. besonders im Hochmittelalter unternommener Kriegszug (christlicher Ritter) in den Vorderen Orient zur Befreiung heiliger Stätten von islamischer Herrschaft | Meyers Großes Konversations-Lexikon 1907: Kreuzzüge, die von den christlichen Völkern des Abendlandes seit dem Ende des 11. bis gegen Ende des 13. Jahrh. zur Eroberung und Behauptung Palästinas unternommenen Kriegszüge, so genannt von dem roten Kreuz von Zeug, das die Teilnehmer an den Zügen, die Kreuzfahrer, unter Beziehung auf Luk. 14,27 auf der rechten Schulter trugen. Sie sind im wesentlichen hervorgegangen aus dem durch den Gregorianismus erweckten kirchlichen Eifer und wurden begünstigt durch die vielen wirtschaftlichen Notstände, die in den zwischen Deutschland und Frankreich gelegenen Ländern herrschten, so daß viele Tausende sich ausmachten, nicht nur um Ablaß zu gewinnen und das heilige Land den Ungläubigen zu entreißen, sondern auch um dem Elend der Heimat zu entfliehen und irdische Vorteile zu erlangen. | Schon vor Konstantin d. Gr., der in Jerusalem und andern Städten Palästinas Kirchen und Kapellen wiederherstellte oder neu erbaute, war es im Abendland Sitte geworden, dorthin zu pilgern, und die Kalifen beförderten diese Besuche, die Geld und fremde Waren ins Land brachten, und gestatteten den Pilgern, Kirchen und Herbergen zu bauen. Als aber Palästina 1076 unter die Herrschaft der Seldschuken geriet, begannen harte Bedrückungen, so daß seitdem die traurigsten Nachrichten über Entweihung der heiligen Orte und Mißhandlung der Pilger nach dem Abendland kamen, während zugleich auch Kaiser Alexios I. um Hilfe gegen die Seldschuken bat. Urban II., von der gregorianischen Partei gewählt, schenkte diesen Beschwerden um so lieber Gehör, als dadurch seine noch bestrittene Führerstellung gegenüber dem »kaiserlichen« Papst und die Macht der T…
in scheme: travel!digital Thesaurus
pref label: Kreuzfahrer
related match: Crusades

Kreuzfahrer
type: Label
in scheme: travel!digital Thesaurus

Kreuzritter
type: Concept
definition: bdk: siehe Ritter | Duden: 1. dem Ritterstand angehörender Teilnehmer an einem Kreuzzug | 2. Angehöriger eines geistlichen Ritterordens, besonders des Deutschen Ordens | Duden: Kreuzzug: 1. a. im Mittelalter von der Kirche propagierter oder unterstützter Krieg gegen Ungläubige und Häretiker | b. besonders im Hochmittelalter unternommener Kriegszug (christlicher Ritter) in den Vorderen Orient zur Befreiung heiliger Stätten von islamischer Herrschaft | Meyers Großes Konversations-Lexikon 1907: Kreuzzüge, die von den christlichen Völkern des Abendlandes seit dem Ende des 11. bis gegen Ende des 13. Jahrh. zur Eroberung und Behauptung Palästinas unternommenen Kriegszüge, so genannt von dem roten Kreuz von Zeug, das die Teilnehmer an den Zügen, die Kreuzfahrer, unter Beziehung auf Luk. 14,27 auf der rechten Schulter trugen. Sie sind im wesentlichen hervorgegangen aus dem durch den Gregorianismus erweckten kirchlichen Eifer und wurden begünstigt durch die vielen wirtschaftlichen Notstände, die in den zwischen Deutschland und Frankreich gelegenen Ländern herrschten, so daß viele Tausende sich ausmachten, nicht nur um Ablaß zu gewinnen und das heilige Land den Ungläubigen zu entreißen, sondern auch um dem Elend der Heimat zu entfliehen und irdische Vorteile zu erlangen. | Schon vor Konstantin d. Gr., der in Jerusalem und andern Städten Palästinas Kirchen und Kapellen wiederherstellte oder neu erbaute, war es im Abendland Sitte geworden, dorthin zu pilgern, und die Kalifen beförderten diese Besuche, die Geld und fremde Waren ins Land brachten, und gestatteten den Pilgern, Kirchen und Herbergen zu bauen. Als aber Palästina 1076 unter die Herrschaft der Seldschuken geriet, begannen harte Bedrückungen, so daß seitdem die traurigsten Nachrichten über Entweihung der heiligen Orte und Mißhandlung der Pilger nach dem Abendland kamen, während zugleich auch Kaiser Alexios I. um Hilfe gegen die Seldschuken bat. Urban II., von der gregorianischen Partei gewählt, schenkte diesen Beschwer…
in scheme: travel!digital Thesaurus
pref label: Kreuzritter
related: Kreuzfahrer
related match: Crusades

Kreuzritter
type: Label
in scheme: travel!digital Thesaurus

Ghassanidenkönig
type: Concept
definition: bdk: siehe Ghassanide, König
in scheme: travel!digital Thesaurus
pref label: Ghassanidenkönig
related: Ghassanide

Ghassanidenkönig
type: Label
in scheme: travel!digital Thesaurus

Guanchenkönig
type: Concept
definition: bdk: siehe Guanche, König
pref label: Guanchenkönig
in scheme: travel!digital Thesaurus
related: Guanche

Guanchenkönig
type: Label
in scheme: travel!digital Thesaurus

König-Kaiser
type: Concept
in scheme: travel!digital Thesaurus
related: Adel
definition: bdk: siehe König, Kaiser
related: Herrscher
pref label: König-Kaiser

König-Kaiser
type: Label
in scheme: travel!digital Thesaurus

Sikhkönig
type: Concept
related: Sikh
in scheme: travel!digital Thesaurus
definition: bdk: siehe Sikh, König
pref label: Sikhkönig

Sikh
type: Concept
definition: Duden: Anhänger der Sikhreligion | Meyers Großes Konversations-Lexikon, 1909: Sikh (im Sanskrit Ciksha, »Jünger«), religiose Sekte in Britisch-Indien, vornehmlich Dschat (s. d.), denen sich wahrscheinlich Sudra der niedrigsten Kasten, Radschputen und Mohammedaner anschlossen. Von ihrer (1901) 2,195,339 Kopfe betragenden Gesamtzahl wohnten 1,517,019 im Pandschab, wo die Tributärstaaten Dschind, Faridkot, Kapurthala, Kalsia, Nabha und Patiala unter Sikhherrschern stehen. Hier haben[460] sie, obschon nur 7 Proz. der Gesamtbevölkerung des Pandschab ausmachend, als religiöse Sekte wie als politische und soziale Klasse, die vorzugsweise den Kleinhandel umfaßt, einen überwiegenden Einfluß ausgeübt. Selbst die Brahmanen lesen ihre heiligen Bücher mit Ehrfurcht. Fleißige Ackerbauer im Frieden, sind sie mit den Radschputen (s. d.) die tapfersten Soldaten des angloindischen Heeres, stehen jedoch in ihrer Bildung hinter andern Volkselementen Indiens zurück. Allerdings ragen die höchsten Klassen der S. durch besondere Gelehrsamkeit hervor. | Der Stifter der ursprünglich rein religiösen Sekte war Baba Nanak, ein Hindu aus der Kriegerkaste (geb. 1469, gest. 1538 in Dera Nanak), der eine Einung der Hindu und Mohammedaner anstrebte und, sich an die Lehre von Ramanand und Kabir anschließend, einen reinen Monotheismus predigte. Das Kastensystem verwarf er gänzlich. Nach ihm sorgten zehn Guru (Prediger) für die Verbreitung der neuen Lehre, die namentlich bei den Hindu im Pandschab zahlreiche Anhänger fand. Nanak ernannte sterbend Angad zu seinem Stellvertreter, der das erste heilige Buch, Grantah, schrieb. Ramdas, der vierte, erhielt von Akbar die Erlaubnis, einen Teich, Amrita Sara (»Teich der Unsterblichkeit«), anzulegen und darin einen Tempel zu bauen, der zum religiosen Mittelpunkt der S. und zum Kern für die spätere Stadt Amritsar (s. d.) wurde. Von Ramdas an wurde die Nachfolge erblich. Sein gelehrter Sohn Ardschun(i) Moll schrieb den Adi Grantah (Granth), das Religionsbuch, in d…
related match: Sikhism
in scheme: travel!digital Thesaurus
related: Sikhreligion
pref label: Sikh

Sikhreligion
type: Concept
in scheme: travel!digital Thesaurus
pref label: Sikhreligion
definition: Duden: Sikhismus: gegen Ende des 15. Jahrhunderts gestiftete monotheistische indische Religion mit militärischer Organisation | bdk: siehe Sikh

Sikhreligion
type: Label
in scheme: travel!digital Thesaurus

Sikh
type: Label
in scheme: travel!digital Thesaurus

Sikhkönig
type: Label
in scheme: travel!digital Thesaurus

Großkönig
type: Concept
definition: bdk: siehe König
in scheme: travel!digital Thesaurus
pref label: Großkönig

Großkönig
type: Label
in scheme: travel!digital Thesaurus

Westgotenkönig
type: Concept
definition: bdk: siehe Westgote, König
pref label: Westgotenkönig
related: Westgote
in scheme: travel!digital Thesaurus

Westgotenkönig
type: Label
in scheme: travel!digital Thesaurus

Perserkönig
type: Concept
in scheme: travel!digital Thesaurus
pref label: Perserkönig
definition: bdk: siehe Perser, König
related: Perser

Perserkönig
type: Label
in scheme: travel!digital Thesaurus

Langobardenkönig
type: Concept
related match: Kingdom of the Lombards
related match: Lombards
definition: bdk: siehe König | Duden: Langobarde: Angehöriger eines westgermanischen Volkes | Meyers Großes Konversations-Lexikon 1908: Langobarden (»Langbärte«; Longobarden ist die spätere romanisierte Namensform), eine Völkerschaft suevischen Stammes, wohnte zu Anfang unsrer Zeitrechnung am linken Ufer der untern Elbe, wo der Bardengau mit Bardowiek ihren Namen bewahrt hat (s. die Karte »Germanien«, Bd. 7, S. 648). Ursprünglich hießen die L. nach einer Sage Winnili (»die Kampflustigen«). Ihre dem 7. nachchristlichen Jahrhundert angehörenden Nationalsagen sind uns zwar nicht in der ursprünglichen Form und Sprache, ooch dem Inhalt nach in der lateinisch geschriebenen Geschichte der L. von Paulus Diaconus, einem Zeitgenossen Pippins und Karls d. Gr., erhalten; sie endigt mit dem Tode Liutprands 744. In den Jahren 4–6 n. Chr. wurden sie von Tiberius als Kronprinz unterworfen, standen im Kampfe zwischen Arminius und Marbod auf des erstern Seite und führten 30 Jahre nach Marbods Niederlage den von den Cheruskern verjagten König Italicus zurück. Einige tausend L. machten sich zusammen mit andern Nordgermanen gelegentlich des großen Markomannenkriegs unter Marcus Aurelius nach Süden auf, wurden aber in Pannonien geschlagen und kehrten in die Heimat zurück. Die an der Elbe bleibenden L. gingen später in den Sachsen auf; der größere Teil des Volkes zog zu unbestimmbarer Zeit über die Mark und Böhmen nach dem Donaulande. Nach Westberg jedoch verlief die Wanderung folgendermaßen: zunächst (etwa 165 n. Chr.) nach der untern Oder hin, dann (gegen 200) nach Pommern (Scoringa) und wenig später, jedenfalls aber nach 200, über die untere Weichsel in litauische Gebiete (Galinden), wo die Namen Barterland und Bartenstein noch an den Aufenthalt der L. erinnern. Um 370 brachen die L. unter König Agelmund aus Galinden auf, überschritten die Weichsel, wurden danach (etwas nach 375) durch bulgarische Hunnen überrumpelt und trafen um 380 im Lande der Ostslawen (Anten) nördlich von den Karpathen ein. E…
in scheme: travel!digital Thesaurus
pref label: Langobardenkönig

Langobardenkönig
type: Label
in scheme: travel!digital Thesaurus

Riesenkönig
type: Concept
related: Ammoniter
in scheme: travel!digital Thesaurus
pref label: Riesenkönig
definition: bdk: siehe König

Riesenkönig
type: Label
in scheme: travel!digital Thesaurus

Pagânkönig
type: Concept
in scheme: travel!digital Thesaurus
pref label: Pagânkönig
definition: bdk: siehe König | Meyers Großes Konversations-Lexikon 1908: Pagan, ehemalige Hauptstadt des frühern Königreichs Birma, am linken Ufer des Irawadi, unterhalb Ava, jetzt ganz in Ruinen und nur noch von einigen Fischern und Schachtelmachern bewohnt, erstreckte sich mit ihren großartigen Pagoden, Terrassen, kolossalen Statuen etc. an 13 km den Fluß entlang. Die bedeutendsten Ruinen sind Reste von Tempeln aus der Zeit der P.-Dynastie vom 11.–13. Jahrh., die dem König Anuruddha oder Anòrat'āzò, der um 1050 n. Chr. das Talaingkönigreich von Sadōn eroberte, und seinen Nachfolgern ihren schönsten Schmuck verdanken. Ihr Charakter ist buddhistisch mit der Maßgabe, daß alle möglichen indischen Stile absichtlich hier kopiert sind. Die Ruinen eines zweiten P., jetzt Alt-P. genannt, gleichfalls früher Residenz, liegen 350 km weiter aufwärts. | Quelle: Meyers Großes Konversations-Lexikon, Band 15. Leipzig 1908, S. 305. | Permalink: http://www.zeno.org/nid/20007203179

Pagânkönig
type: Label
in scheme: travel!digital Thesaurus

Königin
type: Concept
pref label: Königin
narrower: Halbblut-Königin
related: König
related: Adel
in scheme: travel!digital Thesaurus
related: Herrscherin
definition: Duden: 1. a. weibliche Form zu König | b. weibliche Form zu König (sic!) | c. Gemahlin, Ehefrau eines Königs | Meyers Großes Konversations-Lexikon 1907: Königin, Gemahlin oder Witwe eines Königs, auch die selbständige Regentin eines Königreichs, wofern die Thronfolge, wie in England und Spanien, auch dem weiblichen Geschlecht offen steht (vgl. Thronfolge). Auch eine Figur im Schachspiel. Über die K. im Bienenstaat (Weisel) s. Bienen, besonders S. 835 | Quelle: Meyers Großes Konversations-Lexikon, Band 11. Leipzig 1907, S. 384. | Permalink: http://www.zeno.org/nid/20006921523
narrower: Königin-Kaiserin

Königin
type: Label
in scheme: travel!digital Thesaurus

Halbblut-Königin
type: Concept
in scheme: travel!digital Thesaurus
definition: bdk: siehe Halbblut-Indianer, Königin
pref label: Halbblut-Königin
related: Halbblut-Indianer

Halbblut-Königin
type: Label
in scheme: travel!digital Thesaurus

Königin-Kaiserin
type: Concept
in scheme: travel!digital Thesaurus
definition: bdk: siehe Königin, Kaiserin
related: König-Kaiser
pref label: Königin-Kaiserin
related: Herrscherin
related: Adel

Königin-Kaiserin
type: Label
in scheme: travel!digital Thesaurus

vizeköniglich
type: Concept
definition: bdk: zu einem Vizekönig gehörend
in scheme: travel!digital Thesaurus
pref label: vizeköniglich
related: Vizekönig

vizeköniglich
type: Label
in scheme: travel!digital Thesaurus

Königsgeschlecht
type: Label
in scheme: travel!digital Thesaurus

Statthaltergeschlecht
type: Concept
in scheme: travel!digital Thesaurus
pref label: Statthaltergeschlecht
related: Statthalter
definition: bdk: siehe Statthalter, Geschlecht

Statthaltergeschlecht
type: Label
in scheme: travel!digital Thesaurus

Statthalter
type: Concept
narrower: Provinzstatthalter
in scheme: travel!digital Thesaurus
pref label: Statthalter
definition: Duden: 1. (früher) Vertreter des Staatsoberhauptes oder der Regierung in einem Teil des Landes
related: Herrscher

Provinzstatthalter
type: Concept
definition: bdk: siehe Statthalter
pref label: Provinzstatthalter
in scheme: travel!digital Thesaurus

Provinzstatthalter
type: Label
in scheme: travel!digital Thesaurus

Statthalter
type: Label
in scheme: travel!digital Thesaurus

Herrschergeschlecht
type: Concept
alternative label: Herrscherfamilie
alt label: Herrscherhaus
definition: Duden: Geschlecht, das eine Reihe von Herrschern hervorgebracht hat
in scheme: travel!digital Thesaurus
related: Herrscher
alt label: Herrscherfamilie
related: Herrscherin
alternative label: Herrscherhaus
pref label: Herrschergeschlecht

Herrscherhaus
type: Label
in scheme: travel!digital Thesaurus

Herrscherfamilie
type: Label
in scheme: travel!digital Thesaurus

Herrschergeschlecht
type: Label
in scheme: travel!digital Thesaurus

Adelsgeschlecht
type: Concept
definition: Duden: adliges Geschlecht (3c)
alternative label: Adelsfamilie
in scheme: travel!digital Thesaurus
pref label: Adelsgeschlecht
related: Adel
alt label: Adelsfamilie

Adelsgeschlecht
type: Label
in scheme: travel!digital Thesaurus

Adelsfamilie
type: Label
in scheme: travel!digital Thesaurus

Geschlecht
type: Label
in scheme: travel!digital Thesaurus

Priestergeschlecht
type: Concept
definition: bdk: siehe Priester, Geschlecht
related: Priester
pref label: Priestergeschlecht
in scheme: travel!digital Thesaurus

Priestergeschlecht
type: Label
in scheme: travel!digital Thesaurus

herodianisch
type: Concept
pref label: herodianisch
related match: Herodian dynasty
in scheme: travel!digital Thesaurus
definition: bdk: die Herodianer betreffend; von den Herodianern stammend, zu ihnen gehörend | Pierer's Universal-Lexikon 1859: Herodianer, 1) Fürstendynastie in Palästina; s. Hebräer (Gesch.) VI. 2) H., welche in den Evangelien des Matthäus u. Marcus vorkommen u. mit den Pharisäern Jesu auflauerten, eine politische Partei, welche für den Herodes gestimmt war. | Quelle: Pierer's Universal-Lexikon, Band 8. Altenburg 1859, S. 284. | Permalink: http://www.zeno.org/nid/20010105832

herodianisch
type: Label
in scheme: travel!digital Thesaurus

Zirit
type: Concept
pref label: Zirit
in scheme: travel!digital Thesaurus
definition: bdk: Berber-Dynastie
related: Berber

Zirit
type: Label
in scheme: travel!digital Thesaurus

hasmonäisch
type: Concept
related: Hasmonäer
pref label: hasmonäisch
related: makkabäisch
in scheme: travel!digital Thesaurus
definition: bdk: die Hasmonäer betreffend; von den Hasmonäern stammend, zu ihnen gehörend

hasmonäisch
type: Label
in scheme: travel!digital Thesaurus

makkabäisch
type: Concept
related: Makkabäer
alternative label: maccabäisch
alt label: maccabäisch
pref label: makkabäisch
in scheme: travel!digital Thesaurus
definition: Duden: die Makkabäer betreffend, von ihnen stammend | [Anm.: unvollständig: die Makkabäer betreffend; von den Makkabäern stammend, zu ihnen gehörend]

maccabäisch
type: Label
isVariantOf: makkabäisch
in scheme: travel!digital Thesaurus

makkabäisch
type: Label
hasVariant: maccabäisch
in scheme: travel!digital Thesaurus

Saadit
type: Concept
definition: Pierer's Universal-Lexikon 1862: Saaditen, Dynastie in Marokko, s.d. (Gesch.). | Quelle: Pierer's Universal-Lexikon, Band 14. Altenburg 1862, S. 637. | Permalink: http://www.zeno.org/nid/2001078991X
pref label: Saadit
in scheme: travel!digital Thesaurus

Saadit
type: Label
in scheme: travel!digital Thesaurus

Berberdynastie
type: Concept
definition: bdk: siehe Berber, Dynastie
in scheme: travel!digital Thesaurus
related: Berber
pref label: Berberdynastie

Berberdynastie
type: Label
in scheme: travel!digital Thesaurus

Hammadit
type: Concept
pref label: Hammadit
in scheme: travel!digital Thesaurus
definition: Pierer's Universal-Lexikon 1857: Beni-Hammad (Beniditen), arabische Dynastie in NAfrika, Linie der Zeiriden, hatten ihren Sitz im Süden der Stadt Bugia gegen das Gebirge zu; der Erste der Dynastie war Hammad, ein Enkel des Zeiri, seit 997; der 8. nach ihm, Yahia, wurde 1152 von dem Almohaden Abdol Mumen gestürzt u. mit ihm endete die Dynastie nach 161jähriger Herrschaft. | Quelle: Pierer's Universal-Lexikon, Band 2. Altenburg 1857, S. 567. | Permalink: http://www.zeno.org/nid/20009504265
related match: Zirid dynasty

Hammadit
type: Label
in scheme: travel!digital Thesaurus

Mirdaside
type: Concept
definition: bdk: Herrschergeschlecht in Syrien
pref label: Mirdaside
in scheme: travel!digital Thesaurus

Mirdaside
type: Label
in scheme: travel!digital Thesaurus

Schehâbide
type: Concept
related: Schehâb
pref label: Schehâbide
in scheme: travel!digital Thesaurus
definition: bdk: Herrschergeschlecht im Libanon

Schehâb
type: Concept
pref label: Schehâb
in scheme: travel!digital Thesaurus
definition: bdk: Herrschergeschlecht im Libanon

Schehâb
type: Label
in scheme: travel!digital Thesaurus

Schehâbide
type: Label
in scheme: travel!digital Thesaurus

Eupatride
type: Concept
in scheme: travel!digital Thesaurus
pref label: Eupatride
definition: Meyers Großes Konversations-Lexikon 1906: Eupatrīden (»von edlen Ahnen«), in Attika seit den ältesten Zeiten der Geburtsadel und als solcher im Besitz besonderer politischer Rechte, die er indes, je mehr die Verfassung sich zur Demokratie ausbildete, allmählich verlor, so daß sich ihr Einfluß allein auf ihren Reichtum und ihren Grundbesitz gründete; die noch behaupteten priesterlichen Würden entbehrten jeder politischen Bedeutung. | Quelle: Meyers Großes Konversations-Lexikon, Band 6. Leipzig 1906, S. 166. | Permalink: http://www.zeno.org/nid/20006575730

Eupatride
type: Label
in scheme: travel!digital Thesaurus

Gatelusi
type: Concept
in scheme: travel!digital Thesaurus
pref label: Gatelusi
definition: Meyers Großes Konversations-Lexikon 1908: Mytilēne (Mitylene), im Altertum die wichtigste Stadt der asiatischen Äoler und der Insel Lesbos, hatte zwei Häfen sowie starke Befestigungen und war durch ihre hohe Bildung wie eifrige Förderung von Kunst und Wissenschaft von altersher berühmt (s. Lesbos). Nachdem Lesbos 428 unter Mytilenes Leitung von dem Attischen Seebund abgefallen war, wurde die Stadt nach langer Belagerung von den Athenern erobert, grausam bestraft und ihrer Mauern und Seemacht beraubt. Zur Zeit Alexanders d. Gr. litt M. sehr infolge der Einnahme durch die Perser und der spätern Eroberung durch die Mazedonier. Indessen erholte es sich von diesen und spätern Schlägen immer schnell wieder und wurde später von den römischen Kaisern wesentlich begünstigt. Im Mittelalter ging der Name M. (türk. Midüllü) auf die ganze Insel über. Die heutige Hauptstadt M. oder Kastro ist Sitz eines Mutessarif, eines griechischen Metropoliten und eines deutschen Vizekonsuls, hat ein großes, 1373 von Gatelusi auf der Stelle der antiken Akropolis erbautes Schloß, 14 Moscheen, 7 Kirchen und 15,000 Einw. Namentlich der Dampferverkehr ist in den letzten Jahren ganz bedeutend gestiegen. S. Karte »Kleinasien«. | Quelle: Meyers Großes Konversations-Lexikon, Band 14. Leipzig 1908, S. 350. | Permalink: http://www.zeno.org/nid/20007127928

Gatelusi
type: Label
in scheme: travel!digital Thesaurus

Chola
type: Concept
definition: Meyers Großes Konversations-Lexikon 1906: Dekhan (Deccan, v. sanskr. Dakschinā, die »rechte, d. h. südliche Weltgegend«), südlicher Teil Vorderindiens, das Dreieck, das im N. von der südlich des Tapti streichenden Kette und ihrer Fortsetzung, dem Hügelland am rechten Ufer des Godaweri, im O. von den Ostghats, im W. von den Westghats begrenzt wird, im S. in der Senkung Phalgat endet, welche die Eisenbahn von Madras nach Kalikut durchzieht. Es ist ein nach O. abgedachtes Tafelland, rauh und stark gewellt im W., mit ausgedehnten Ebenen im O.; im W. 1000–1300 m, im Innern 500–600 m hoch. Alle Flüsse entspringen in den Westghats und münden in den Bengalischen Meerbusen. Der Boden besteht vorwiegend aus schwarzer Erde (Zersetzungsprodukt der für D. charakteristischen weiten Basaltdecken) oder aus rotem Laterit. Beide sind fruchtbar, bedürfen aber künstlicher Bewässerung. Die Jahrestemperatur liegt zwischen 27,8 und 27,8°. Politisch gehört D. zu den Zentralprovinzen, den Präsidentschaften Bombay und Madras, zu Haidarabad und Maissur. – Um 500 n. Chr. soll sich Dschayasimha 1., aus Nordindien kommend, auf Kosten der drawidischen Pallawa im D. festgesetzt und das Hindureich der Tschâlukya gegründet haben, das schon um 600 den größten Teil des D. (zwischen Konkan und Orissa) umfaßte. 630 fand eine Zweiteilung statt: das östliche Tschâlukyareich bestand bis 1060, wo es den Tschola erlag; das westliche erlitt 747 durch die Râschtrakûta von Gudscharat eine schwere Schlappe, erholte sich aber seit 973 unter Tailapa, dem Stifter der spätern Tschalukyadynastie, gab einer Anzahl von Nebenlinien und Kleinstaaten das Leben und erlosch gegen 1200. Inzwischen überschwemmten seit 1001 mohammedanische Scharen Nordindien und drangen allmählich immer weiter auch nach dem D. vor. 1347 erklärte sich der schiitische Afghane Hasan Gango, Vizekönig Mohammeds ibn Toghluq in Dauladabad, unabhängig und begründete die Bahmanidynastie von Kulbarga; sein Nachfolger Mahmud Shah II. herrschte[596] 1482 …
in scheme: travel!digital Thesaurus
pref label: Chola

Chola
type: Label
in scheme: travel!digital Thesaurus

flavisch
type: Concept
in scheme: travel!digital Thesaurus
pref label: flavisch
related: Flavier
definition: bdk: die Flavier betreffend; von den Flaviern stammend, zu ihnen gehörend

flavisch
type: Label
in scheme: travel!digital Thesaurus

Tulunide
type: Concept
alternative label: Tulûnide
definition: Meyers Großes Konversations-Lexikon 1909: Tulunīden, die älteste selbständige arab. Dynastie in Ägypten, nach ihrem Gründer Achmed ibn Tulun (gest. 883) genannt, herrschte 868–905. | Quelle: Meyers Großes Konversations-Lexikon, Band 19. Leipzig 1909, S. 797. | Permalink: http://www.zeno.org/nid/20007614543
alt label: Tulûnide
pref label: Tulunide
related: Tulûn
in scheme: travel!digital Thesaurus

Tulûnide
type: Label
isVariantOf: Tulunide
in scheme: travel!digital Thesaurus

Tulunide
type: Label
hasVariant: Tulûnide
in scheme: travel!digital Thesaurus

Tulûn
type: Concept
definition: bdk: siehe Tulûnide
pref label: Tulûn
in scheme: travel!digital Thesaurus

Tulûn
type: Label
in scheme: travel!digital Thesaurus

Bahmanî
type: Concept
related match: Bahmani Sultanate
definition: Meyers Großes Konversations-Lexiko 1907: Gudscharat (Guzerat), Gebiet an der Nordwestküste von Vorderindien (s. Karte »Ostindien«), besteht aus der Insel Katsch, der Halbinsel Kathiawar und dem anstoßenden Festland, wird im N. von Radschputana, im O. von Zentralindien u. dem Distrikt Khandesch (Dekhan), im S. von der Division Konkan, im W. vom Arabischen Meerbusen begrenzt und umfaßt die britische Division G. mit einem Areal von 26,666 qkm und (1901) 2,700,719 Einw. (meist Hindu, ca. 300,000 Mohammedaner, 4500 Christen), administrativ geteilt in die Distrikte Ahmedabad, Kaira, Pantsch Mehals, Barotsch und Surat, den in viele große und kleine Parzellen zersplitterten Staat Baroda (s. d.) und die unter die Oberaufsicht des britischen Kommissars der Division gestellten Tributärstaaten Katsch, Kambay und Narukot, Kathiawar (187 einheimische Fürsten) und die Agentschaften von Mahi Kantha (59 Fürsten), Rewa Kantha (61 Fürsten), Palanpur (13 Fürsten) und Surat (3 Fürsten), zusammen (ohne Baroda) 134,853 qkm mit (1901) 4,436,492 Einw. (meist Hindu, 600,000 Mohammedaner, 1700 Christen), so daß das ganze Gebiet mit Baroda 182,824 qkm und (1901) 9,088,138 Einw. umfaßt. Dazu kommen noch die kleinen portugiesischen Besitzungen Daman an der Küste von Surat und Diu an der Südspitze von Kathiawar. Die Halbinsel Kathiawar zeigt mit Katsch (s. d.) in der Richtung ihrer ozeanischen Küste (von NW. nach SO.) wie in ihrem geologischen Aufbau große Verwandtschaft, doch ist sie höher; die Gebirge im S. steigen bis 531 m an, die nördlichern wilden granitischen Girnarberge erreichen im Goraknath 1117 m. Am Ostende der letztern, bei der Stadt Palitana, erhebt sich der isolierte doppelgipfelige, 600 m hohe Basaltfelsen Satrundschaja, der heiligste der sieben Berge der Dschain, mit prachtvollen, fast eine kleine Stadt bildenden Tempelbauten aus weißem Marmor. Gegen N. senkt sich das Land, der 110 km breite Isthmus liegt höchstens 15 m ü. M. und wird zum großen Teil von einem Salzsumpf eingenomm…
in scheme: travel!digital Thesaurus
pref label: Bahmanî

Bahmanî
type: Label
in scheme: travel!digital Thesaurus

seleukidisch
type: Concept
alternative label: seleucidisch
alt label: seleucidisch
related: Seleukide
pref label: seleukidisch
in scheme: travel!digital Thesaurus
definition: bdk: die Seleukiden betreffend, von ihnen stammend, zu ihnen gehörend

seleucidisch
type: Label
isVariantOf: seleukidisch
in scheme: travel!digital Thesaurus

seleukidisch
type: Label
hasVariant: seleucidisch
in scheme: travel!digital Thesaurus

Moghuldynastie
type: Concept
related match: Mughal Empire
definition: bdk: siehe Großmogul, Dynastie
related: Großmogul
in scheme: travel!digital Thesaurus
pref label: Moghuldynastie

Großmogul
type: Concept
in scheme: travel!digital Thesaurus
pref label: Großmogul
related: Herrscher
definition: Duden: 1. <ohne Plural> Titel nordindischer Herrscher | 2. Träger des Titels Großmogul (a) | Meyers Großes Konversations-Lexikon 1907: Großmogul, Titel der Herrscher des von Baber, einem Urenkel Timurs in Ostindien 1526 gegründeten mohammedanischen Reiches, ist von ihrem tatarischen (fälschlich mongolischen) Ursprung hergenommen; sie selbst führten den persischen Titel Schah, die Hofsprache war Persisch. Die berühmtesten Herrscher waren Baber (bis 1530), Akbar (1556–1605), Dschihangir (1605–27), Schah Dschihan (1628–57) und Aurangzeb (1658–1707). Der Reichtum des Großmoguls war sprichwörtlich. Ihr Reich zerfiel seit dem Beginn des 18. Jahrh. und erreichte 1803 sein Ende unter Schah Alam II. mit der Einnahme Dehlis durch die Engländer. Die Nachkommen der Großmoguls bezogen dann einen Jahrgehalt von England und genossen zu Dehli Hofehren. Die Beteiligung der Familie an dem Aufstand von 1857 und namentlich an den Grausamkeiten in Dehli führte ihren Sturz herbei. Die jetzigen Prinzen der einstigen Dynastie leben in Benares als englische Staatspensionäre. Vgl. Keene, History of the Mogul empire (neue Ausg., Lond. 1888); Lane-Poole, History of the Mogul emperors (das. 1892); Horn, Das Heer- und Kriegswesen der Großmoguls (Leiden 1894); Holden, The Mogul emperors of Hindostan (das. 1895); E. Schmidt im 2. Bande von Helmolts »Weltgeschichte« (Leipz. 1902). | Quelle: Meyers Großes Konversations-Lexikon, Band 8. Leipzig 1907, S. 426. | Permalink: http://www.zeno.org/nid/20006714005
related match: Mughal emperors
related match: Mughal Empire

Großmogul
type: Label
in scheme: travel!digital Thesaurus

Moghuldynastie
type: Label
in scheme: travel!digital Thesaurus

Lusignan
type: Concept
definition: Meyers Großes Konversations-Lexikon 1908: Lusignan (spr. lūsinjáng), 1) franz. Adelsgeschlecht aus dem Poitou. Der Ursprung ist unbekannt, urkundlich erscheint es seit 967. Die meisten männlichen Mitglieder der Familie hießen Hugo. Von Hugo VIII. stammen einerseits die Grafen von der Marche und Angoulême, anderseits die Könige von Jerusalem, Cypern und Kleinarmenien ab. Sein ältester Sohn, Hugo IX. (gest. 1219 auf einem Kreuzzuge), ward durch seine Gemahlin Mathilde Graf von Angoulême. Sein Sohn Hugo X. heiratete Isabella, die Witwe König Johanns ohne Land von England. Mit Guy, der von 1302 an regierte, starb 1308 der Mannesstamm dieses Zweiges der L. aus. Seine Schwester Yolande, Herrin von Pons, verkaufte die Grafschaften Marche und Angouléme 1312 an die Krone Frankreichs. | Ein jüngerer Sohn Hugos VIII., Guy, heiratete Sibylle, die Erbtochter des Königs Amalrich von Jerusalem, dessen Nachfolger er 1186 wurde. Dieses Reiches durch Saladin beraubt, kaufte er 1192 die Insel Cypern von Richard Löwenherz. Er starb 1194. Ihm folgten hier Amalrich (gest. 1205), Hugo I. (gest. 1218), Heinrich I. (gest. 1253). Dieser König begleitete Ludwig den Heiligen von Frankreich 1248 auf dessen unglücklichen Kreuzzug nach Ägypten. Mit seinem Sohn Hugo II. starb 1267 der direkte Mannesstamm dieses Zweiges der L. aus. Durch seine Mutter ein Enkel Hugos I., folgte ihm Hugo III. (gest. 1284), der den Titel eines Königs von Jerusalem wieder annahm. Hierauf regierten seine Söhne Johann I. (gest. 1285) und Heinrich II. (gest. 1324), unter dem 1291 die letzten Reste des Königreichs Jerusalem verloren gingen. Ihm folgte der fünfte Sohn Hugos III., Hugo IV., der 1360 abdankte, und diesem sein ältester Sohn, Peter I., der in Europa umherreiste, um Hilfe gegen die Mohammedaner zu erlangen, aber vergebens gegen die Ägypter und Syrer kämpfte; er wurde 1369 ermordet, und sein Sohn [866] Peter II. starb kinderlos 1382. Jakob I., ein jüngerer Sohn Hugos IV. (gest. 1398), hinterließ das Reich Cypern …
pref label: Lusignan
in scheme: travel!digital Thesaurus

Lusignan
type: Label
in scheme: travel!digital Thesaurus

Löwendynastie
type: Concept
related match: Sinhalese people
definition: bdk: siehe Dynastie | Meyers Großes Konversations-Lexikon 1905: Ceylon (im Sanskrit nach dem Beinamen des arischen Eroberers Singhala [»Löwenwohnort«] oder Tamraparni, woher das griechische Taprobane, bei den Eingebornen Lankadiva, arabisch Serendib), britische Insel im Indischen Ozean, an der Südspitze von Vorderindien, von dem sie durch den Golf von Manaar und die 93 km breite Palksstraße getrennt wird, zwischen 5°55'- 9°51' nördl. Br. und 79°41'- 81°54' östl. L., von N. nach S. 445 km lang, 160–235 km breit und 65,610 qkm groß (s. das Kärtchen). C. bildete einst einen Teil des Kontinents. Jetzt zieht sich, wo Insel und Festland sich am meisten nähern, noch die sogen. Adamsbrücke (s.d.) hin. Fast das ganze nördliche Drittel der Insel ist eine prächtig bewaldete Ebene; ein breiter Gürtel von Tiefland umgibt das Bergland auch im südlichen[853] Teil, das in Ausläufern bis zur Süd- und Ostküste reicht und bei einer Länge von 95- 103, einer Breite von 75–90 km, im Durchschnitt 650 m hoch, rund 9000 qkm bedeckt. Auf der innern, 220 qkm großen Hochebene Neura Ellya erheben sich zahlreiche Gipfel, darunter der 2241 m hohe Adamspik (s.d.), der Pedrotallagalla (2538 m), der Kirigallpolla (2380 m), der Totapolla (2353 m). Zwischen den Bergen dehnen sich schöne und fruchtbare Täler aus. Die Nordküste, vor deren Nordende zahllose kleine grüne Inseln legen, und die mit Kokospalmen bedeckte Westküste sind flach, die Süd- und Ostküste steil und felsig; hier bietet der vorzügliche Hafen von Trinkomali Raum und Schutz für die größte Flolte. [...] | Quelle: Meyers Großes Konversations-Lexikon, Band 3. Leipzig 1905, S. 853-855. | Permalink: http://www.zeno.org/nid/20006409857
pref label: Löwendynastie
in scheme: travel!digital Thesaurus

Löwendynastie
type: Label
in scheme: travel!digital Thesaurus

Ichschide
type: Concept
pref label: Ichschide
in scheme: travel!digital Thesaurus
definition: Pierer's Universal-Lexikon 1859: Ikschiden, arabische Dynastie in Ägypten u. Syrien 934–968, deren Stifter Muhammed Ikschid (934–945) war. | Quelle: Pierer's Universal-Lexikon, Band 8. Altenburg 1859, S. 817. | Permalink: http://www.zeno.org/nid/20010167358

Ichschide
type: Label
in scheme: travel!digital Thesaurus

abdelwaditisch
type: Concept
pref label: abdelwaditisch
in scheme: travel!digital Thesaurus
related: Abdelwadit
definition: bdk: die Abdelwaditen betreffend; von den Abdelwaditen stammend, zu ihnen gehörend

abdelwaditisch
type: Label
in scheme: travel!digital Thesaurus

Abdelwadit
type: Concept
in scheme: travel!digital Thesaurus
pref label: Abdelwadit
definition: bdk: muslimische Dynastie in Algerien

Abdelwadit
type: Label
in scheme: travel!digital Thesaurus

Okeilide
type: Concept
definition: bdk: Herrschergeschlecht in Syrien
pref label: Okeilide
in scheme: travel!digital Thesaurus

Okeilide
type: Label
in scheme: travel!digital Thesaurus

Mamlukendynastie
type: Concept
definition: bdk: siehe Mamluke, Dynastie
alternative label: Mamluken-Dynastie
pref label: Mamlukendynastie
alt label: Mamluken-Dynastie
related: Mamluke
in scheme: travel!digital Thesaurus

Mamlukendynastie
type: Label
hasVariant: Mamluken-Dynastie
in scheme: travel!digital Thesaurus

Mamluken-Dynastie
type: Label
isVariantOf: Mamlukendynastie
in scheme: travel!digital Thesaurus

Hindudynastie
type: Concept
in scheme: travel!digital Thesaurus
pref label: Hindudynastie
definition: bdk: siehe Hindu, Dynastie
related: Hindu

Hindudynastie
type: Label
in scheme: travel!digital Thesaurus

Gupta-Dynastie
type: Concept
related match: Gupta Empire
definition: bdk: siehe Dynastie | Brockhaus' Kleines Konversations-Lexikon 1911: Tschandragupta, ind. Fürst, der Sandrakottas (Sandrokottos) der Griechen, Gründer der Mauryadynastie, vertrieb die Satrapen Alexanders d.Gr. aus Indien und wurde zwischen 322 und 312 v. Chr. zum Könige gekrönt. Sein Enkel war Açoka (s.d.). | Quelle: Brockhaus' Kleines Konversations-Lexikon, fünfte Auflage, Band 2. Leipzig 1911., S. 870. | Permalink: http://www.zeno.org/nid/20001634801
pref label: Gupta-Dynastie
in scheme: travel!digital Thesaurus

Gupta-Dynastie
type: Label
in scheme: travel!digital Thesaurus

Abencerrage
type: Concept
alternative label: Beni Serrâdsch
alt label: Beni Serrâdsch
definition: Meyers Großes Konversations-Lexikon 1905: Abencerragen, edles arab. Geschlecht in Granada, das nach Ibn Serradsch, dem Vertrauten des Königs Mohammed VII. von Granada (1392–1407), den Namen A. erhielt. Die A. waren mit dem Geschlechte der Zegris in Zwist geraten und standen auch dem König Abul Hassan (gegen 1480) in geheimer Feindschaft gegenüber. Als nun letzterer von der Liebschaft zwischen einem der A. und seiner Schwester Zoraïde erfahren hatte, ließ er die A. in die Alhambra locken und ermorden. Noch heute heißt ein Teil der Alhambra (s. d.) »Saal der A.«. Diese (historisch nicht bezeugte) Begebenheit liegt Chateaubriands Erzählung: »Les aventures du dernier des Abencérages« zu Grunde, wonach Jouy das Textbuch zu Cherubinis Oper »Die A.« bearbeitete. | Quelle: Meyers Großes Konversations-Lexikon, Band 1. Leipzig 1905, S. 25. | Permalink: http://www.zeno.org/nid/20006184154
pref label: Abencerrage
in scheme: travel!digital Thesaurus

Beni Serrâdsch
type: Label
in scheme: travel!digital Thesaurus

Abencerrage
type: Label
in scheme: travel!digital Thesaurus

Djefnide
type: Concept
pref label: Djefnide
in scheme: travel!digital Thesaurus
related: Ghassanide
definition: bdk: Herrschergeschlecht in Südarabien

Djefnide
type: Label
in scheme: travel!digital Thesaurus

fatimidisch
type: Concept
alternative label: fâtimidisch
alt label: fâtimidisch
related: Fâtimide
pref label: fatimidisch
in scheme: travel!digital Thesaurus
definition: Duden: die Fatimiden betreffend, zu ihnen gehörend, für sie charakteristisch | [Anm.: unvollständig: die Fatimiden betreffend; von den Fatimiden stammend, zu ihnen gehörend]

fâtimidisch
type: Label
isVariantOf: fatimidisch
in scheme: travel!digital Thesaurus

fatimidisch
type: Label
hasVariant: fâtimidisch
in scheme: travel!digital Thesaurus

ghassanidisch
type: Concept
definition: bdk: die Ghassaniden betreffend; von den Ghassaniden stammend, zu ihnen gehörend
pref label: ghassanidisch
related: Ghassanide
in scheme: travel!digital Thesaurus

ghassanidisch
type: Label
in scheme: travel!digital Thesaurus

Kachvâhâ
type: Concept
definition: bdk: Herrschergeschlecht in Indien
in scheme: travel!digital Thesaurus
pref label: Kachvâhâ

Kachvâhâ
type: Label
in scheme: travel!digital Thesaurus

Ilchan
type: Concept
pref label: Ilchan
in scheme: travel!digital Thesaurus
definition: Duden: Titel der mongolischen Herrscher in Persien (13. und 14. Jahrhundert) | Meyers Großes Konversations-Lexikon 1907: Ilchân (mongol., »Provinzfürst«), Beiname der Fürsten der in Persien im 13. und 14. Jahrh. herrschenden Mongolendynastie; vgl. Hulagu. | Quelle: Meyers Großes Konversations-Lexikon, Band 9. Leipzig 1907, S. 751. | Permalink: http://www.zeno.org/nid/20006810268

Ilchan
type: Label
in scheme: travel!digital Thesaurus

Haus
type: Label
in scheme: travel!digital Thesaurus

Klasse
type: Concept
alt label: Classe
narrower: Menschenklasse
alternative label: Classe
in scheme: travel!digital Thesaurus
pref label: Klasse
definition: Duden: 2. (Soziologie) Gruppe der Bevölkerung, deren Angehörige sich in der gleichen ökonomischen und sozialen Lage befinden

Classe
type: Label
isVariantOf: Klasse
in scheme: travel!digital Thesaurus

Klasse
type: Label
hasVariant: Classe
in scheme: travel!digital Thesaurus

Menschenklasse
type: Concept
definition: bdk: siehe Mensch, Klasse
pref label: Menschenklasse
related: Mensch
in scheme: travel!digital Thesaurus

Menschenklasse
type: Label
in scheme: travel!digital Thesaurus

Mensch
type: Concept
related: Menschheit
preferred label: insân @ar
pref label: orang
pref label: insân
narrower: Kulturmensch
preferred label: âdmî @hi
in scheme: travel!digital Thesaurus
definition: Duden: 2. menschliches Lebewesen, Individuum | Meyers Großes Konversations-Lexikon 1908: | Mensch (Homo sapiens L.), das höchst entwickelte irdische Wesen, das alle verwandten Lebewesen in geistiger Hinsicht bei weitem überragt, ohne jedoch von ihnen durch tiefer gehende körperliche Unterschiede getrennt zu sein. Denn der M. bietet den Typus der Wirbeltiere und im besondern der Säugetiere dar, mit denen er das warme Blut, den doppelten Kreislauf, Lungenatmung, Behaarung, Erzeugung lebendiger Jungen und Ernährung derselben durch ein von den Brustdrüsen abgesondertes Sekret (Milch) und doppelte Hinterhauptsgelenkhöcker (s. Tafel »Skelett des Menschen II«, Fig. 4) gemeinsam hat. Der M. besitzt also den gleichen Bau und dieselben Organe wie die höhern Tiere, wenngleich hinsichtlich deren Form mehr oder weniger deutliche Unterschiede vorhanden sind. Im Vergleich zu den dem Menschen in der Tierreihe am nächsten stehenden menschenähnlichen Affen (Anthropoiden) sind diese Unterschiede noch unbedeutender. Fundamentale Unterschiede zwischen beiden Gruppen gibt es eigentlich nur zwei, bez. nur einen, denn der erstere ist nur die Folge des zweiten; das ist der aufrechte Gang des Menschen und[603] seine mächtige Gehirnentwickelung. Nur der M. ist imstande, sich aufrecht zu halten; der Anthropoide geht zumeist auf allen vieren, und wenn er einmal sich aufrecht zu halten versucht, vermag er dieses nur auf kurze Zeit und in beschränktem Maße (mit nicht durchgedrückten Knieen). Der aufrechte Gang des Menschen wird durch die Lage des Hinterhauptloches am Grunde des Schädels bedingt; diese Erscheinung ist wiederum eine Folge der Abknickung des Schädelgrundes. Durch das übermäßige Wachstum des Gehirns, im besondern des Vorder- oder Großhirns (das menschliche Gehirn ist dreimal so groß wie das des Anthropoiden), wurde die Schädelbasis nach unten scharf abgeknickt, und das Hinterhauptloch kam nach unten zu liegen. Mit dem aufrechten Gang stehen Veränderungen seines Baues und der Entwicke…
preferred label: orang @ms
pref label: Mensch
pref label: âdmî

Menschheit
type: Concept
definition: Duden: Gesamtheit der Menschen | Pierer's Universal-Lexikon 1860: Menschheit, 1) die Wesenheit des Menschen, die menschliche Natur, od. der Inbegriff Alles dessen, wodurch derselbe sich von andern Geschöpfen unterscheidet, s. Mensch; 2) der Inbegriff aller auf Erden von jeher zum Dasein gelangter u. noch jetzt lebender Menschen. | Quelle: Pierer's Universal-Lexikon, Band 11. Altenburg 1860, S. 135. | Permalink: http://www.zeno.org/nid/20010429328
alt label: Menschengeschlecht
in scheme: travel!digital Thesaurus
alternative label: Menschengeschlecht
pref label: Menschheit

Menschengeschlecht
type: Label
in scheme: travel!digital Thesaurus

Menschheit
type: Label
in scheme: travel!digital Thesaurus

orang
type: Label
hasTranslation: insân
isTranslationOf: Mensch
in scheme: travel!digital Thesaurus
hasTranslation: âdmî

insân
type: Label
hasTranslation: orang
hasTranslation: âdmî
isTranslationOf: Mensch
in scheme: travel!digital Thesaurus

âdmî
type: Label
hasTranslation: insân
isTranslationOf: Mensch
in scheme: travel!digital Thesaurus
hasTranslation: orang

Mensch
type: Label
hasTranslation: insân
hasTranslation: orang
hasTranslation: âdmî
in scheme: travel!digital Thesaurus

Kulturmensch
type: Concept
in scheme: travel!digital Thesaurus
pref label: Kulturmensch
definition: Duden: Mensch der eine Kultur (1a) ausgebildet hat

Kulturmensch
type: Label
in scheme: travel!digital Thesaurus

dynastisch
type: Concept
related: Dynastie
pref label: dynastisch
in scheme: travel!digital Thesaurus
definition: Duden: den Dynasten, die Dynastie betreffend

dynastisch
type: Label
in scheme: travel!digital Thesaurus

Bettler
type: Concept
narrower: Straßenbettler
in scheme: travel!digital Thesaurus
definition: Duden: jemand, der bettelt, vom Betteln lebt | Duden: betteln: 1. um Almosen bitten | 2. inständig bitten | Pierer's Universal-Lexikon 1857: Bettelwesen. Selten ist dringendes Bedürfniß des Nöthigsten, sondern gewöhnlich Luft zum Müßiggang u. Neigung, sich Gegenstände des Luxus zu erzeugen, die Ursache der Bettelei, wie denn die ärmsten Gegenden Europas, Schweben u. Norwegen, die wenigsten, u. die reichsten, Italien u. Brabant, die meisten Bettler zählen. Bettelei ist aber eine Last für die übrigen Staatsbürger, ohne den Bettelnden dauernde Vortheile zu schaffen. Wenigstens ist daher öffentliches u. Straßenbetteln unbedingt abzuschaffen, da sie in hohem Grade demoralisirend wirken, für die wirklich Bedürftigen aber ist durch Armenpflege (vgl. Armenwesen) zu sorgen. Die Strafe des öffentlichen Bettelns besteht gewöhnlich in kurzem Gefängniß, nach Befinden körperlicher Züchtigung, bei wiederholtem Rückfall tritt Einbringung in eine Correctionsanstalt ein. Betteln unter betrügerischem Vorgeben, z.B. erdichteten Unglücksfällen, kann selbst criminelle Bestrafung nach sich ziehen. Sind die Bettelnden Kinder, so müssen die Eltern für sie bestraft, sind es Fremde, sie nach überstandener Strafe auf dem Schub in ihre Heimath gebracht werden. Bes. streng muß die Aufsicht über das Betteln auf dem Lande sein, da dort der Landmann weniger im Stande ist, sich gegen die Zudringlichkeiten der Bettler zu schützen, daher leicht die Bettelei in Erpressungen ausartet u. sich Bettler daselbst auch Gelegenheit zum Stehlell u. sonstigen Unfug erspähen. Eine gute Gensdarmerie u. fleißiges Durchsuchen der Forste, der einzelnen Häuser u. Herbergen leistet hier die besten Dienste. Schwieriger ist der Hansbettelei zu wehren. Sie collidirt zu sehr mit der jedem Staatsbürger überlassenen Mildthätigkeit, nimmt zu oft die Maske von Ausspielen, Anleihen, Kaufanträgen etc. vor, als daß es möglich wäre ihr ganz zu steuern. Bes. gilt dies von den vornehmen Bettlern u. Hochstaplern, die häufig die Welt …
alternative label: Bettlergestalt
alt label: Bettlergestalt
pref label: Bettler
narrower: Bettelkind

Straßenbettler
type: Concept
definition: bdk: siehe Bettler
in scheme: travel!digital Thesaurus
pref label: Straßenbettler

Straßenbettler
type: Label
in scheme: travel!digital Thesaurus

Bettlergestalt
type: Label
in scheme: travel!digital Thesaurus

Bettler
type: Label
in scheme: travel!digital Thesaurus

Bettelkind
type: Concept
definition: bdk: siehe Bettler
pref label: Bettelkind
in scheme: travel!digital Thesaurus

Bettelkind
type: Label
in scheme: travel!digital Thesaurus

Unterkunft/Restaurant
type: Concept
narrower: Drechsler
narrower: Hotel de Paris & Impérial
narrower: Prospect House
narrower: Hygeia Hotel
narrower: Boar’s Head
narrower: Hotel du Commerce & d’Isly
narrower: Savoy Hotel
narrower: Water Gap House
narrower: Belváros
narrower: Hotel Alameda
narrower: Fenimore House
narrower: Duquesne
narrower: Jägerhorn
narrower: Grand Cañon Hotel
narrower: Ottawa House
narrower: Kenmore
narrower: Delmonico’s
narrower: Taverne Gruber
narrower: Reisser
narrower: Crag Hotel
narrower: Wachusett House
narrower: Kenilworth Inn
narrower: Wutzler's Royal Hotel
narrower: Hotel do Porto
narrower: Nicoli
narrower: Arlington
narrower: Profile
narrower: Stockbridge Inn
narrower: London
narrower: United States
narrower: Powers Hotel
narrower: Hotel der Nederlanden
narrower: Victoria
narrower: Alcazar
narrower: Astor House
narrower: Camp Pine Knot
narrower: Brasserie du Phénix
narrower: Murray Hill
narrower: Hotel Grande Bretagne
narrower: Pino de Oro Hotel
narrower: Hotel Martianez
narrower: Roger’s Rock Hotel
narrower: Thompson’s Spa
narrower: New York
narrower: Ackerley House
narrower: Florence Hotel
narrower: New Imperial Hotel
narrower: Hotel d’Athènes
narrower: Blue Mountain House
narrower: Berkshire Inn
narrower: Hotel Royal Danieli
narrower: Leon d’Oro
narrower: Hámor
narrower: Everett
narrower: Petit Vefour
narrower: Hotel de Russie & d'Angleterre
narrower: Ponce de Leon
narrower: The Portland
narrower: Ampersand Hotel
narrower: Redoutengebäude
narrower: Mohican House
narrower: Crawford House
narrower: Hotel Metropole
narrower: Hotel Hermes
narrower: Pilsener Urquell
narrower: Eastern Exchange Hotel
narrower: Gasthof zu Stadt Jerusalem
narrower: The Moulton
definition: bdk: empfehlenswerte Unterkünfte und Restaurants
narrower: Grand Hotel
narrower: Hotel St. George
narrower: Hotel Royal
narrower: Westminster
narrower: Solari
narrower: Cliff House
narrower: Seminole Hotel
narrower: Hotel de la Minerve
narrower: Janni

Drechsler
type: Concept
in scheme: travel!digital Thesaurus
pref label: Drechsler
definition: bdk: touristische Infrastruktur

Drechsler
type: Label
in scheme: travel!digital Thesaurus

Hotel de Paris & Impérial
type: Concept
in scheme: travel!digital Thesaurus
pref label: Hotel de Paris & Impérial
definition: bdk: touristische Infrastruktur

Hotel de Paris & Impérial
type: Label
in scheme: travel!digital Thesaurus

Prospect House
type: Concept
pref label: Prospect House
in scheme: travel!digital Thesaurus
definition: bdk: touristische Infrastruktur

Prospect House
type: Label
in scheme: travel!digital Thesaurus

Hygeia Hotel
type: Concept
pref label: Hygeia Hotel
in scheme: travel!digital Thesaurus
definition: bdk: touristische Infrastruktur

Hygeia Hotel
type: Label
in scheme: travel!digital Thesaurus

Boar’s Head
type: Concept
pref label: Boar’s Head
in scheme: travel!digital Thesaurus
definition: bdk: touristische Infrastruktur

Boar’s Head
type: Label
in scheme: travel!digital Thesaurus

Hotel du Commerce & d’Isly
type: Concept
in scheme: travel!digital Thesaurus
pref label: Hotel du Commerce & d’Isly
definition: bdk: touristische Infrastruktur

Hotel du Commerce & d’Isly
type: Label
in scheme: travel!digital Thesaurus

Savoy Hotel
type: Concept
in scheme: travel!digital Thesaurus
pref label: Savoy Hotel
definition: bdk: touristische Infrastruktur

Savoy Hotel
type: Label
in scheme: travel!digital Thesaurus

Water Gap House
type: Concept
pref label: Water Gap House
in scheme: travel!digital Thesaurus
definition: bdk: touristische Infrastruktur

Water Gap House
type: Label
in scheme: travel!digital Thesaurus

Belváros
type: Concept
in scheme: travel!digital Thesaurus
pref label: Belváros
definition: bdk: touristische Infrastruktur

Belváros
type: Label
in scheme: travel!digital Thesaurus

Hotel Alameda
type: Concept
in scheme: travel!digital Thesaurus
pref label: Hotel Alameda
definition: bdk: touristische Infrastruktur

Hotel Alameda
type: Label
in scheme: travel!digital Thesaurus

Fenimore House
type: Concept
pref label: Fenimore House
in scheme: travel!digital Thesaurus
definition: bdk: touristische Infrastruktur

Fenimore House
type: Label
in scheme: travel!digital Thesaurus

Duquesne
type: Concept
pref label: Duquesne
in scheme: travel!digital Thesaurus
definition: bdk: touristische Infrastruktur

Duquesne
type: Label
in scheme: travel!digital Thesaurus

Jägerhorn
type: Concept
in scheme: travel!digital Thesaurus
pref label: Jägerhorn
definition: bdk: touristische Infrastruktur

Jägerhorn
type: Label
in scheme: travel!digital Thesaurus

Grand Cañon Hotel
type: Concept
pref label: Grand Cañon Hotel
in scheme: travel!digital Thesaurus
definition: bdk: touristische Infrastruktur

Grand Cañon Hotel
type: Label
in scheme: travel!digital Thesaurus

Ottawa House
type: Concept
pref label: Ottawa House
in scheme: travel!digital Thesaurus
definition: bdk: touristische Infrastruktur

Ottawa House
type: Label
in scheme: travel!digital Thesaurus

Kenmore
type: Concept
pref label: Kenmore
in scheme: travel!digital Thesaurus
definition: bdk: touristische Infrastruktur

Kenmore
type: Label
in scheme: travel!digital Thesaurus

Delmonico’s
type: Concept
pref label: Delmonico’s
in scheme: travel!digital Thesaurus
definition: bdk: touristische Infrastruktur

Delmonico’s
type: Label
in scheme: travel!digital Thesaurus

Taverne Gruber
type: Concept
in scheme: travel!digital Thesaurus
pref label: Taverne Gruber
definition: bdk: touristische Infrastruktur

Taverne Gruber
type: Label
in scheme: travel!digital Thesaurus

Reisser
type: Concept
pref label: Reisser
in scheme: travel!digital Thesaurus
definition: bdk: touristische Infrastruktur

Reisser
type: Label
in scheme: travel!digital Thesaurus

Crag Hotel
type: Concept
in scheme: travel!digital Thesaurus
pref label: Crag Hotel
definition: bdk: touristische Infrastruktur

Crag Hotel
type: Label
in scheme: travel!digital Thesaurus

Wachusett House
type: Concept
pref label: Wachusett House
in scheme: travel!digital Thesaurus
definition: bdk: touristische Infrastruktur

Wachusett House
type: Label
in scheme: travel!digital Thesaurus

Kenilworth Inn
type: Concept
pref label: Kenilworth Inn
in scheme: travel!digital Thesaurus
definition: bdk: touristische Infrastruktur

Kenilworth Inn
type: Label
in scheme: travel!digital Thesaurus

Wutzler's Royal Hotel
type: Concept
in scheme: travel!digital Thesaurus
pref label: Wutzler's Royal Hotel
definition: bdk: touristische Infrastruktur

Wutzler's Royal Hotel
type: Label
in scheme: travel!digital Thesaurus

Hotel do Porto
type: Concept
in scheme: travel!digital Thesaurus
pref label: Hotel do Porto
definition: bdk: touristische Infrastruktur

Hotel do Porto
type: Label
in scheme: travel!digital Thesaurus

Nicoli
type: Concept
in scheme: travel!digital Thesaurus
pref label: Nicoli
definition: bdk: touristische Infrastruktur

Nicoli
type: Label
in scheme: travel!digital Thesaurus

Arlington
type: Concept
pref label: Arlington
in scheme: travel!digital Thesaurus
definition: bdk: touristische Infrastruktur

Arlington
type: Label
in scheme: travel!digital Thesaurus

Profile
type: Concept
pref label: Profile
in scheme: travel!digital Thesaurus
definition: bdk: touristische Infrastruktur

Profile
type: Label
in scheme: travel!digital Thesaurus

Stockbridge Inn
type: Concept
pref label: Stockbridge Inn
in scheme: travel!digital Thesaurus
definition: bdk: touristische Infrastruktur

Stockbridge Inn
type: Label
in scheme: travel!digital Thesaurus

London
type: Concept
in scheme: travel!digital Thesaurus
pref label: London
definition: bdk: touristische Infrastruktur

London
type: Label
in scheme: travel!digital Thesaurus

United States
type: Concept
pref label: United States
in scheme: travel!digital Thesaurus
definition: bdk: touristische Infrastruktur

United States
type: Label
in scheme: travel!digital Thesaurus

Powers Hotel
type: Concept
pref label: Powers Hotel
in scheme: travel!digital Thesaurus
definition: bdk: touristische Infrastruktur

Powers Hotel
type: Label
in scheme: travel!digital Thesaurus

Hotel der Nederlanden
type: Concept
in scheme: travel!digital Thesaurus
pref label: Hotel der Nederlanden
definition: bdk: touristische Infrastruktur

Hotel der Nederlanden
type: Label
in scheme: travel!digital Thesaurus

Victoria
type: Concept
pref label: Victoria
in scheme: travel!digital Thesaurus
definition: bdk: touristische Infrastruktur

Victoria
type: Label
in scheme: travel!digital Thesaurus

Alcazar
type: Concept
pref label: Alcazar
in scheme: travel!digital Thesaurus
definition: bdk: touristische Infrastruktur

Alcazar
type: Label
in scheme: travel!digital Thesaurus

Astor House
type: Concept
pref label: Astor House
in scheme: travel!digital Thesaurus
definition: bdk: touristische Infrastruktur

Astor House
type: Label
in scheme: travel!digital Thesaurus

Camp Pine Knot
type: Concept
pref label: Camp Pine Knot
in scheme: travel!digital Thesaurus
definition: bdk: touristische Infrastruktur

Camp Pine Knot
type: Label
in scheme: travel!digital Thesaurus

Brasserie du Phénix
type: Concept
in scheme: travel!digital Thesaurus
pref label: Brasserie du Phénix
definition: bdk: touristische Infrastruktur

Brasserie du Phénix
type: Label
in scheme: travel!digital Thesaurus

Murray Hill
type: Concept
pref label: Murray Hill
in scheme: travel!digital Thesaurus
definition: bdk: touristische Infrastruktur

Murray Hill
type: Label
in scheme: travel!digital Thesaurus

Hotel Grande Bretagne
type: Concept
in scheme: travel!digital Thesaurus
pref label: Hotel Grande Bretagne
definition: bdk: touristische Infrastruktur

Hotel Grande Bretagne
type: Label
in scheme: travel!digital Thesaurus

Pino de Oro Hotel
type: Concept
in scheme: travel!digital Thesaurus
pref label: Pino de Oro Hotel
definition: bdk: touristische Infrastruktur

Pino de Oro Hotel
type: Label
in scheme: travel!digital Thesaurus

Hotel Martianez
type: Concept
in scheme: travel!digital Thesaurus
pref label: Hotel Martianez
definition: bdk: touristische Infrastruktur

Hotel Martianez
type: Label
in scheme: travel!digital Thesaurus

Roger’s Rock Hotel
type: Concept
pref label: Roger’s Rock Hotel
in scheme: travel!digital Thesaurus
definition: bdk: touristische Infrastruktur

Roger’s Rock Hotel
type: Label
in scheme: travel!digital Thesaurus

Thompson’s Spa
type: Concept
pref label: Thompson’s Spa
in scheme: travel!digital Thesaurus
definition: bdk: touristische Infrastruktur

Thompson’s Spa
type: Label
in scheme: travel!digital Thesaurus

New York
type: Concept
in scheme: travel!digital Thesaurus
pref label: New York
definition: bdk: touristische Infrastruktur

New York
type: Label
in scheme: travel!digital Thesaurus

Ackerley House
type: Concept
pref label: Ackerley House
in scheme: travel!digital Thesaurus
definition: bdk: touristische Infrastruktur

Ackerley House
type: Label
in scheme: travel!digital Thesaurus

Florence Hotel
type: Concept
in scheme: travel!digital Thesaurus
pref label: Florence Hotel
definition: bdk: touristische Infrastruktur

Florence Hotel
type: Label
in scheme: travel!digital Thesaurus

New Imperial Hotel
type: Concept
in scheme: travel!digital Thesaurus
pref label: New Imperial Hotel
definition: bdk: touristische Infrastruktur

New Imperial Hotel
type: Label
in scheme: travel!digital Thesaurus

Hotel d’Athènes
type: Concept
in scheme: travel!digital Thesaurus
pref label: Hotel d’Athènes
definition: bdk: touristische Infrastruktur

Hotel d’Athènes
type: Label
in scheme: travel!digital Thesaurus

Blue Mountain House
type: Concept
pref label: Blue Mountain House
in scheme: travel!digital Thesaurus
definition: bdk: touristische Infrastruktur

Blue Mountain House
type: Label
in scheme: travel!digital Thesaurus

Berkshire Inn
type: Concept
pref label: Berkshire Inn
in scheme: travel!digital Thesaurus
definition: bdk: touristische Infrastruktur

Berkshire Inn
type: Label
in scheme: travel!digital Thesaurus

Hotel Royal Danieli
type: Concept
in scheme: travel!digital Thesaurus
pref label: Hotel Royal Danieli
definition: bdk: touristische Infrastruktur

Hotel Royal Danieli
type: Label
in scheme: travel!digital Thesaurus

Leon d’Oro
type: Concept
pref label: Leon d’Oro
in scheme: travel!digital Thesaurus
definition: bdk: touristische Infrastruktur

Leon d’Oro
type: Label
in scheme: travel!digital Thesaurus

Hámor
type: Concept
in scheme: travel!digital Thesaurus
pref label: Hámor
definition: bdk: touristische Infrastruktur

Hámor
type: Label
in scheme: travel!digital Thesaurus

Everett
type: Concept
pref label: Everett
in scheme: travel!digital Thesaurus
definition: bdk: touristische Infrastruktur

Everett
type: Label
in scheme: travel!digital Thesaurus

Petit Vefour
type: Concept
pref label: Petit Vefour
in scheme: travel!digital Thesaurus
definition: bdk: touristische Infrastruktur

Petit Vefour
type: Label
in scheme: travel!digital Thesaurus

Hotel de Russie & d'Angleterre
type: Concept
in scheme: travel!digital Thesaurus
pref label: Hotel de Russie & d'Angleterre
definition: bdk: touristische Infrastruktur

Hotel de Russie & d'Angleterre
type: Label
in scheme: travel!digital Thesaurus

Ponce de Leon
type: Concept
pref label: Ponce de Leon
in scheme: travel!digital Thesaurus
definition: bdk: touristische Infrastruktur

Ponce de Leon
type: Label
in scheme: travel!digital Thesaurus

The Portland
type: Concept
pref label: The Portland
in scheme: travel!digital Thesaurus
definition: bdk: touristische Infrastruktur

The Portland
type: Label
in scheme: travel!digital Thesaurus

Ampersand Hotel
type: Concept
pref label: Ampersand Hotel
in scheme: travel!digital Thesaurus
definition: bdk: touristische Infrastruktur

Ampersand Hotel
type: Label
in scheme: travel!digital Thesaurus

Redoutengebäude
type: Concept
in scheme: travel!digital Thesaurus
pref label: Redoutengebäude
definition: bdk: touristische Infrastruktur

Redoutengebäude
type: Label
in scheme: travel!digital Thesaurus

Mohican House
type: Concept
pref label: Mohican House
in scheme: travel!digital Thesaurus
definition: bdk: touristische Infrastruktur

Mohican House
type: Label
in scheme: travel!digital Thesaurus

Crawford House
type: Concept
pref label: Crawford House
in scheme: travel!digital Thesaurus
definition: bdk: touristische Infrastruktur

Crawford House
type: Label
in scheme: travel!digital Thesaurus

Hotel Metropole
type: Concept
pref label: Hotel Metropole
in scheme: travel!digital Thesaurus
definition: bdk: touristische Infrastruktur

Hotel Metropole
type: Label
in scheme: travel!digital Thesaurus

Hotel Hermes
type: Concept
in scheme: travel!digital Thesaurus
pref label: Hotel Hermes
definition: bdk: touristische Infrastruktur

Hotel Hermes
type: Label
in scheme: travel!digital Thesaurus

Pilsener Urquell
type: Concept
in scheme: travel!digital Thesaurus
pref label: Pilsener Urquell
definition: bdk: touristische Infrastruktur

Pilsener Urquell
type: Label
in scheme: travel!digital Thesaurus

Eastern Exchange Hotel
type: Concept
in scheme: travel!digital Thesaurus
pref label: Eastern Exchange Hotel
definition: bdk: touristische Infrastruktur

Eastern Exchange Hotel
type: Label
in scheme: travel!digital Thesaurus

Gasthof zu Stadt Jerusalem
type: Concept
in scheme: travel!digital Thesaurus
definition: bdk: touristische Infrastruktur
pref label: Gasthof zu Stadt Jerusalem

Gasthof zu Stadt Jerusalem
type: Label
in scheme: travel!digital Thesaurus

The Moulton
type: Concept
pref label: The Moulton
in scheme: travel!digital Thesaurus
definition: bdk: touristische Infrastruktur

The Moulton
type: Label
in scheme: travel!digital Thesaurus

Grand Hotel
type: Concept
alternative label: Grand Hôtel
narrower: Grand Hotel Britannia
alt label: Grand Hôtel
narrower: Grand Hotel Villa Politi
narrower: Grand Hotel de l'Europe
in scheme: travel!digital Thesaurus
narrower: Mount Lavinia Grand Hotel
narrower: Grand Hotel du Vesuve
narrower: Grand Hotel Krämer Palace
pref label: Grand Hotel
narrower: Grand Canal Hôtel & Monaco
narrower: Grand Hotel Huck
narrower: Grand Central Hotel
narrower: Grand-Hotel Hungaria
narrower: Grand-Hotel du Louvre & de la Paix
narrower: Grand-Hotel Noailles & Métropole
narrower: Grand Hotel Humboldt
alt label: Grand-Hôtel
narrower: Grand Hotel Quisisana
definition: bdk: touristische Infrastruktur
narrower: Grand-Hotel Miramare
narrower: Grand-Hotel Royal
narrower: Grand Hotel Villa Igiea
alternative label: Grand-Hôtel
narrower: Grand Hotel d’Angleterre
narrower: Grand Eden Hotel
narrower: Grand Oriental Hotel
narrower: Grand Hotel d’ Italie-Bauer
narrower: Grand Hotel Victoria

Grand Hotel Britannia
type: Concept
in scheme: travel!digital Thesaurus
pref label: Grand Hotel Britannia
definition: bdk: touristische Infrastruktur

Grand Hotel Britannia
type: Label
in scheme: travel!digital Thesaurus

Grand Hôtel
type: Label
isVariantOf: Grand Hotel
in scheme: travel!digital Thesaurus
hasVariant: Grand-Hôtel

Grand Hotel
type: Label
hasVariant: Grand-Hôtel
in scheme: travel!digital Thesaurus
hasVariant: Grand Hôtel

Grand-Hôtel
type: Label
isVariantOf: Grand Hotel
in scheme: travel!digital Thesaurus
hasVariant: Grand Hôtel

Grand Hotel Villa Politi
type: Concept
in scheme: travel!digital Thesaurus
pref label: Grand Hotel Villa Politi
definition: bdk: touristische Infrastruktur

Grand Hotel Villa Politi
type: Label
in scheme: travel!digital Thesaurus

Grand Hotel de l'Europe
type: Concept
in scheme: travel!digital Thesaurus
pref label: Grand Hotel de l'Europe
definition: bdk: touristische Infrastruktur

Grand Hotel de l'Europe
type: Label
in scheme: travel!digital Thesaurus

Mount Lavinia Grand Hotel
type: Concept
in scheme: travel!digital Thesaurus
pref label: Mount Lavinia Grand Hotel
definition: bdk: touristische Infrastruktur

Mount Lavinia Grand Hotel
type: Label
in scheme: travel!digital Thesaurus

Grand Hotel du Vesuve
type: Concept
in scheme: travel!digital Thesaurus
pref label: Grand Hotel du Vesuve
definition: bdk: touristische Infrastruktur

Grand Hotel du Vesuve
type: Label
in scheme: travel!digital Thesaurus

Grand Hotel Krämer Palace
type: Concept
in scheme: travel!digital Thesaurus
pref label: Grand Hotel Krämer Palace
definition: bdk: touristische Infrastruktur

Grand Hotel Krämer Palace
type: Label
in scheme: travel!digital Thesaurus

Grand Canal Hôtel & Monaco
type: Concept
in scheme: travel!digital Thesaurus
pref label: Grand Canal Hôtel & Monaco
definition: bdk: touristische Infrastruktur

Grand Canal Hôtel & Monaco
type: Label
in scheme: travel!digital Thesaurus

Grand Hotel Huck
type: Concept
in scheme: travel!digital Thesaurus
pref label: Grand Hotel Huck
definition: bdk: touristische Infrastruktur

Grand Hotel Huck
type: Label
in scheme: travel!digital Thesaurus

Grand Central Hotel
type: Concept
pref label: Grand Central Hotel
in scheme: travel!digital Thesaurus
definition: bdk: touristische Infrastruktur

Grand Central Hotel
type: Label
in scheme: travel!digital Thesaurus

Grand-Hotel Hungaria
type: Concept
in scheme: travel!digital Thesaurus
pref label: Grand-Hotel Hungaria
definition: bdk: touristische Infrastruktur

Grand-Hotel Hungaria
type: Label
in scheme: travel!digital Thesaurus

Grand-Hotel du Louvre & de la Paix
type: Concept
in scheme: travel!digital Thesaurus
pref label: Grand-Hotel du Louvre & de la Paix
definition: bdk: touristische Infrastruktur

Grand-Hotel du Louvre & de la Paix
type: Label
in scheme: travel!digital Thesaurus

Grand-Hotel Noailles & Métropole
type: Concept
in scheme: travel!digital Thesaurus
pref label: Grand-Hotel Noailles & Métropole
definition: bdk: touristische Infrastruktur

Grand-Hotel Noailles & Métropole
type: Label
in scheme: travel!digital Thesaurus

Grand Hotel Humboldt
type: Concept
in scheme: travel!digital Thesaurus
pref label: Grand Hotel Humboldt
definition: bdk: touristische Infrastruktur

Grand Hotel Humboldt
type: Label
in scheme: travel!digital Thesaurus

Grand Hotel Quisisana
type: Concept
in scheme: travel!digital Thesaurus
pref label: Grand Hotel Quisisana
definition: bdk: touristische Infrastruktur

Grand Hotel Quisisana
type: Label
in scheme: travel!digital Thesaurus

Grand-Hotel Miramare
type: Concept
alternative label: Grand Hotel Miramare
in scheme: travel!digital Thesaurus
pref label: Grand-Hotel Miramare
alt label: Grand Hotel Miramare
definition: bdk: touristische Infrastruktur

Grand-Hotel Miramare
type: Label
hasVariant: Grand Hotel Miramare
in scheme: travel!digital Thesaurus

Grand Hotel Miramare
type: Label
isVariantOf: Grand-Hotel Miramare
in scheme: travel!digital Thesaurus

Grand-Hotel Royal
type: Concept
in scheme: travel!digital Thesaurus
pref label: Grand-Hotel Royal
definition: bdk: touristische Infrastruktur

Grand-Hotel Royal
type: Label
in scheme: travel!digital Thesaurus

Grand Hotel Villa Igiea
type: Concept
in scheme: travel!digital Thesaurus
pref label: Grand Hotel Villa Igiea
definition: bdk: touristische Infrastruktur

Grand Hotel Villa Igiea
type: Label
in scheme: travel!digital Thesaurus

Grand Hotel d’Angleterre
type: Concept
in scheme: travel!digital Thesaurus
pref label: Grand Hotel d’Angleterre
definition: bdk: touristische Infrastruktur

Grand Hotel d’Angleterre
type: Label
in scheme: travel!digital Thesaurus

Grand Eden Hotel
type: Concept
alternative label: Grand Eden-Hotel
in scheme: travel!digital Thesaurus
pref label: Grand Eden Hotel
alt label: Grand Eden-Hotel
definition: bdk: touristische Infrastruktur

Grand Eden Hotel
type: Label
hasVariant: Grand Eden-Hotel
in scheme: travel!digital Thesaurus

Grand Eden-Hotel
type: Label
isVariantOf: Grand Eden Hotel
in scheme: travel!digital Thesaurus

Grand Oriental Hotel
type: Concept
in scheme: travel!digital Thesaurus
pref label: Grand Oriental Hotel
definition: bdk: touristische Infrastruktur

Grand Oriental Hotel
type: Label
in scheme: travel!digital Thesaurus

Grand Hotel d’ Italie-Bauer
type: Concept
in scheme: travel!digital Thesaurus
pref label: Grand Hotel d’ Italie-Bauer
definition: bdk: touristische Infrastruktur

Grand Hotel d’ Italie-Bauer
type: Label
in scheme: travel!digital Thesaurus

Grand Hotel Victoria
type: Concept
in scheme: travel!digital Thesaurus
pref label: Grand Hotel Victoria
definition: bdk: touristische Infrastruktur

Grand Hotel Victoria
type: Label
in scheme: travel!digital Thesaurus

Hotel St. George
type: Concept
in scheme: travel!digital Thesaurus
pref label: Hotel St. George
definition: bdk: touristische Infrastruktur

Hotel St. George
type: Label
in scheme: travel!digital Thesaurus

Hotel Royal
type: Concept
in scheme: travel!digital Thesaurus
pref label: Hotel Royal
definition: bdk: touristische Infrastruktur

Hotel Royal
type: Label
in scheme: travel!digital Thesaurus

Westminster
type: Concept
pref label: Westminster
in scheme: travel!digital Thesaurus
definition: bdk: touristische Infrastruktur

Westminster
type: Label
in scheme: travel!digital Thesaurus

Solari
type: Concept
pref label: Solari
in scheme: travel!digital Thesaurus
definition: bdk: touristische Infrastruktur

Solari
type: Label
in scheme: travel!digital Thesaurus

Cliff House
type: Concept
pref label: Cliff House
in scheme: travel!digital Thesaurus
definition: bdk: touristische Infrastruktur

Cliff House
type: Label
in scheme: travel!digital Thesaurus

Seminole Hotel
type: Concept
pref label: Seminole Hotel
in scheme: travel!digital Thesaurus
definition: bdk: touristische Infrastruktur

Seminole Hotel
type: Label
in scheme: travel!digital Thesaurus

Hotel de la Minerve
type: Concept
in scheme: travel!digital Thesaurus
pref label: Hotel de la Minerve
definition: bdk: touristische Infrastruktur

Hotel de la Minerve
type: Label
in scheme: travel!digital Thesaurus

Janni
type: Concept
in scheme: travel!digital Thesaurus
pref label: Janni
definition: bdk: touristische Infrastruktur

Janni
type: Label
in scheme: travel!digital Thesaurus

Lake Placid House
type: Concept
pref label: Lake Placid House
in scheme: travel!digital Thesaurus
definition: bdk: touristische Infrastruktur

Lake Placid House
type: Label
in scheme: travel!digital Thesaurus

Hotel Netto
type: Concept
in scheme: travel!digital Thesaurus
pref label: Hotel Netto
definition: bdk: touristische Infrastruktur

Hotel Netto
type: Label
in scheme: travel!digital Thesaurus

Hotel Beers
type: Concept
pref label: Hotel Beers
in scheme: travel!digital Thesaurus
definition: bdk: touristische Infrastruktur

Hotel Beers
type: Label
in scheme: travel!digital Thesaurus

Saranac Inn
type: Concept
pref label: Saranac Inn
in scheme: travel!digital Thesaurus
definition: bdk: touristische Infrastruktur

Saranac Inn
type: Label
in scheme: travel!digital Thesaurus

Raffles Hotel
type: Concept
in scheme: travel!digital Thesaurus
pref label: Raffles Hotel
definition: bdk: touristische Infrastruktur

Raffles Hotel
type: Label
in scheme: travel!digital Thesaurus

Glen House
type: Concept
pref label: Glen House
in scheme: travel!digital Thesaurus
definition: bdk: touristische Infrastruktur

Glen House
type: Label
in scheme: travel!digital Thesaurus

Hotel Santa Lucia
type: Concept
in scheme: travel!digital Thesaurus
pref label: Hotel Santa Lucia
definition: bdk: touristische Infrastruktur

Hotel Santa Lucia
type: Label
in scheme: travel!digital Thesaurus

Hotel Colón
type: Concept
in scheme: travel!digital Thesaurus
pref label: Hotel Colón
definition: bdk: touristische Infrastruktur

Hotel Colón
type: Label
in scheme: travel!digital Thesaurus

Cascade Lake House
type: Concept
pref label: Cascade Lake House
in scheme: travel!digital Thesaurus
definition: bdk: touristische Infrastruktur

Cascade Lake House
type: Label
in scheme: travel!digital Thesaurus

Raymond
type: Concept
pref label: Raymond
in scheme: travel!digital Thesaurus
definition: bdk: touristische Infrastruktur

Raymond
type: Label
in scheme: travel!digital Thesaurus

Griffou
type: Concept
pref label: Griffou
in scheme: travel!digital Thesaurus
definition: bdk: touristische Infrastruktur

Griffou
type: Label
in scheme: travel!digital Thesaurus

Hôtel Rennert
type: Concept
pref label: Hôtel Rennert
in scheme: travel!digital Thesaurus
definition: bdk: touristische Infrastruktur

Hôtel Rennert
type: Label
in scheme: travel!digital Thesaurus

Chamberlain’s Hotel
type: Concept
pref label: Chamberlain’s Hotel
in scheme: travel!digital Thesaurus
definition: bdk: touristische Infrastruktur

Chamberlain’s Hotel
type: Label
in scheme: travel!digital Thesaurus

Shepheard’s Hotel
type: Concept
in scheme: travel!digital Thesaurus
pref label: Shepheard’s Hotel
definition: bdk: touristische Infrastruktur

Shepheard’s Hotel
type: Label
in scheme: travel!digital Thesaurus

Clifton House
type: Concept
pref label: Clifton House
in scheme: travel!digital Thesaurus
definition: bdk: touristische Infrastruktur

Clifton House
type: Label
in scheme: travel!digital Thesaurus

Hotel Bellevue
type: Concept
alternative label: Bellevue Hotel
definition: bdk: touristische Infrastruktur
alt label: Hôtel Bellevue
alternative label: Hôtel Bellevue
pref label: Hotel Bellevue
in scheme: travel!digital Thesaurus
alternative label: Bellevue
alt label: Bellevue
alt label: Bellevue Hotel

Hôtel Bellevue
type: Label
in scheme: travel!digital Thesaurus
isVariantOf: Hotel Bellevue
hasVariant: Bellevue
hasVariant: Bellevue Hotel

Hotel Bellevue
type: Label
hasVariant: Bellevue
in scheme: travel!digital Thesaurus
hasVariant: Bellevue Hotel
hasVariant: Hôtel Bellevue

Bellevue
type: Label
isVariantOf: Hotel Bellevue
in scheme: travel!digital Thesaurus
hasVariant: Bellevue Hotel
hasVariant: Hôtel Bellevue

Bellevue Hotel
type: Label
in scheme: travel!digital Thesaurus
isVariantOf: Hotel Bellevue
hasVariant: Bellevue
hasVariant: Hôtel Bellevue

Davis House
type: Concept
pref label: Davis House
in scheme: travel!digital Thesaurus
definition: bdk: touristische Infrastruktur

Davis House
type: Label
in scheme: travel!digital Thesaurus

Hotel Bragança
type: Concept
in scheme: travel!digital Thesaurus
pref label: Hotel Bragança
definition: bdk: touristische Infrastruktur

Hotel Bragança
type: Label
in scheme: travel!digital Thesaurus

Cliffs Hotel
type: Concept
pref label: Cliffs Hotel
in scheme: travel!digital Thesaurus
definition: bdk: touristische Infrastruktur

Cliffs Hotel
type: Label
in scheme: travel!digital Thesaurus

Laurel House
type: Concept
pref label: Laurel House
in scheme: travel!digital Thesaurus
definition: bdk: touristische Infrastruktur

Laurel House
type: Label
in scheme: travel!digital Thesaurus

Jewropéiskaja
type: Concept
in scheme: travel!digital Thesaurus
pref label: Jewropéiskaja
definition: bdk: touristische Infrastruktur

Jewropéiskaja
type: Label
in scheme: travel!digital Thesaurus

Worden
type: Concept
pref label: Worden
in scheme: travel!digital Thesaurus
definition: bdk: touristische Infrastruktur

Worden
type: Label
in scheme: travel!digital Thesaurus

Halfway House
type: Concept
pref label: Halfway House
in scheme: travel!digital Thesaurus
definition: bdk: touristische Infrastruktur

Halfway House
type: Label
in scheme: travel!digital Thesaurus

Mount Kineo Hotel
type: Concept
pref label: Mount Kineo Hotel
in scheme: travel!digital Thesaurus
definition: bdk: touristische Infrastruktur

Mount Kineo Hotel
type: Label
in scheme: travel!digital Thesaurus

Hotel Royal des Etrangers
type: Concept
in scheme: travel!digital Thesaurus
pref label: Hotel Royal des Etrangers
definition: bdk: touristische Infrastruktur

Hotel Royal des Etrangers
type: Label
in scheme: travel!digital Thesaurus

Maiden's Metropolitan Hotel
type: Concept
in scheme: travel!digital Thesaurus
pref label: Maiden's Metropolitan Hotel
definition: bdk: touristische Infrastruktur

Maiden's Metropolitan Hotel
type: Label
in scheme: travel!digital Thesaurus

Normandie-by-the-Sea
type: Concept
pref label: Normandie-by-the-Sea
in scheme: travel!digital Thesaurus
definition: bdk: touristische Infrastruktur

Normandie-by-the-Sea
type: Label
in scheme: travel!digital Thesaurus

Deer Park Hotel
type: Concept
pref label: Deer Park Hotel
in scheme: travel!digital Thesaurus
definition: bdk: touristische Infrastruktur

Deer Park Hotel
type: Label
in scheme: travel!digital Thesaurus

Macpherson’s
type: Concept
in scheme: travel!digital Thesaurus
pref label: Macpherson’s
definition: bdk: touristische Infrastruktur

Macpherson’s
type: Label
in scheme: travel!digital Thesaurus

Brevoort House
type: Concept
pref label: Brevoort House
in scheme: travel!digital Thesaurus
definition: bdk: touristische Infrastruktur

Brevoort House
type: Label
in scheme: travel!digital Thesaurus

Avenida Palace
type: Concept
in scheme: travel!digital Thesaurus
pref label: Avenida Palace
definition: bdk: touristische Infrastruktur

Avenida Palace
type: Label
in scheme: travel!digital Thesaurus

Galle Face Hotel
type: Concept
in scheme: travel!digital Thesaurus
pref label: Galle Face Hotel
definition: bdk: touristische Infrastruktur

Galle Face Hotel
type: Label
in scheme: travel!digital Thesaurus

Elmer House
type: Concept
pref label: Elmer House
in scheme: travel!digital Thesaurus
definition: bdk: touristische Infrastruktur

Elmer House
type: Label
in scheme: travel!digital Thesaurus

Ryan
type: Concept
pref label: Ryan
in scheme: travel!digital Thesaurus
definition: bdk: touristische Infrastruktur

Ryan
type: Label
in scheme: travel!digital Thesaurus

Hotel de Paris
type: Concept
in scheme: travel!digital Thesaurus
pref label: Hotel de Paris
definition: bdk: touristische Infrastruktur

Hotel de Paris
type: Label
in scheme: travel!digital Thesaurus

Parker's Hotel
type: Concept
in scheme: travel!digital Thesaurus
pref label: Parker's Hotel
definition: bdk: touristische Infrastruktur

Parker's Hotel
type: Label
in scheme: travel!digital Thesaurus

Hotel de France
type: Concept
in scheme: travel!digital Thesaurus
pref label: Hotel de France
definition: bdk: touristische Infrastruktur

Hotel de France
type: Label
in scheme: travel!digital Thesaurus

Ocean House
type: Concept
pref label: Ocean House
in scheme: travel!digital Thesaurus
definition: bdk: touristische Infrastruktur

Ocean House
type: Label
in scheme: travel!digital Thesaurus

The Inn
type: Concept
pref label: The Inn
in scheme: travel!digital Thesaurus
definition: bdk: touristische Infrastruktur

The Inn
type: Label
in scheme: travel!digital Thesaurus

Pemigewasset House
type: Concept
pref label: Pemigewasset House
in scheme: travel!digital Thesaurus
definition: bdk: touristische Infrastruktur

Pemigewasset House
type: Label
in scheme: travel!digital Thesaurus

Rossíja
type: Concept
in scheme: travel!digital Thesaurus
pref label: Rossíja
definition: bdk: touristische Infrastruktur

Rossíja
type: Label
in scheme: travel!digital Thesaurus

Maplewood
type: Concept
pref label: Maplewood
in scheme: travel!digital Thesaurus
definition: bdk: touristische Infrastruktur

Maplewood
type: Label
in scheme: travel!digital Thesaurus

Fast’s Hotel
type: Concept
in scheme: travel!digital Thesaurus
pref label: Fast’s Hotel
definition: bdk: touristische Infrastruktur

Fast’s Hotel
type: Label
in scheme: travel!digital Thesaurus

Plankinton House
type: Concept
pref label: Plankinton House
in scheme: travel!digital Thesaurus
definition: bdk: touristische Infrastruktur

Plankinton House
type: Label
in scheme: travel!digital Thesaurus

Hotel de Madrid
type: Concept
in scheme: travel!digital Thesaurus
pref label: Hotel de Madrid
definition: bdk: touristische Infrastruktur

Hotel de Madrid
type: Label
in scheme: travel!digital Thesaurus

Hotel Suisse
type: Concept
in scheme: travel!digital Thesaurus
pref label: Hotel Suisse
definition: bdk: touristische Infrastruktur

Hotel Suisse
type: Label
in scheme: travel!digital Thesaurus

Fountain Geyser Hotel
type: Concept
pref label: Fountain Geyser Hotel
in scheme: travel!digital Thesaurus
definition: bdk: touristische Infrastruktur

Fountain Geyser Hotel
type: Label
in scheme: travel!digital Thesaurus

Purssell
type: Concept
pref label: Purssell
in scheme: travel!digital Thesaurus
definition: bdk: touristische Infrastruktur

Purssell
type: Label
in scheme: travel!digital Thesaurus

Hotel St.-Georges
type: Concept
in scheme: travel!digital Thesaurus
pref label: Hotel St.-Georges
definition: bdk: touristische Infrastruktur

Hotel St.-Georges
type: Label
in scheme: travel!digital Thesaurus

Hôtel Martin
type: Concept
pref label: Hôtel Martin
in scheme: travel!digital Thesaurus
definition: bdk: touristische Infrastruktur

Hôtel Martin
type: Label
in scheme: travel!digital Thesaurus

Hotel Rafael
type: Concept
pref label: Hotel Rafael
in scheme: travel!digital Thesaurus
definition: bdk: touristische Infrastruktur

Hotel Rafael
type: Label
in scheme: travel!digital Thesaurus

Tampa Bay Hotel
type: Concept
pref label: Tampa Bay Hotel
in scheme: travel!digital Thesaurus
definition: bdk: touristische Infrastruktur

Tampa Bay Hotel
type: Label
in scheme: travel!digital Thesaurus

Clark's Hotel
type: Concept
in scheme: travel!digital Thesaurus
pref label: Clark's Hotel
definition: bdk: touristische Infrastruktur

Clark's Hotel
type: Label
in scheme: travel!digital Thesaurus

La Reserve
type: Concept
in scheme: travel!digital Thesaurus
pref label: La Reserve
definition: bdk: touristische Infrastruktur

La Reserve
type: Label
in scheme: travel!digital Thesaurus

Woodland's Hotel
type: Concept
in scheme: travel!digital Thesaurus
pref label: Woodland's Hotel
definition: bdk: touristische Infrastruktur

Woodland's Hotel
type: Label
in scheme: travel!digital Thesaurus

St. Hubert’s Inn
type: Concept
pref label: St. Hubert’s Inn
in scheme: travel!digital Thesaurus
definition: bdk: touristische Infrastruktur

St. Hubert’s Inn
type: Label
in scheme: travel!digital Thesaurus

Hotel des Palmes
type: Concept
in scheme: travel!digital Thesaurus
pref label: Hotel des Palmes
definition: bdk: touristische Infrastruktur

Hotel des Palmes
type: Label
in scheme: travel!digital Thesaurus

West End
type: Concept
pref label: West End
in scheme: travel!digital Thesaurus
definition: bdk: touristische Infrastruktur

West End
type: Label
in scheme: travel!digital Thesaurus

Stevens House
type: Concept
pref label: Stevens House
in scheme: travel!digital Thesaurus
definition: bdk: touristische Infrastruktur

Stevens House
type: Label
in scheme: travel!digital Thesaurus

Hotel Haßler
type: Concept
in scheme: travel!digital Thesaurus
pref label: Hotel Haßler
definition: bdk: touristische Infrastruktur

Hotel Haßler
type: Label
in scheme: travel!digital Thesaurus

Dorlon
type: Concept
pref label: Dorlon
in scheme: travel!digital Thesaurus
definition: bdk: touristische Infrastruktur

Dorlon
type: Label
in scheme: travel!digital Thesaurus

Hotel Papandajan
type: Concept
in scheme: travel!digital Thesaurus
pref label: Hotel Papandajan
definition: bdk: touristische Infrastruktur

Hotel Papandajan
type: Label
in scheme: travel!digital Thesaurus

Mammoth Hot Springs Hotel
type: Concept
pref label: Mammoth Hot Springs Hotel
in scheme: travel!digital Thesaurus
definition: bdk: touristische Infrastruktur

Mammoth Hot Springs Hotel
type: Label
in scheme: travel!digital Thesaurus

St. Petersburg
type: Concept
in scheme: travel!digital Thesaurus
pref label: St. Petersburg
definition: bdk: touristische Infrastruktur

St. Petersburg
type: Label
in scheme: travel!digital Thesaurus

Waldorf
type: Concept
pref label: Waldorf
in scheme: travel!digital Thesaurus
definition: bdk: touristische Infrastruktur

Waldorf
type: Label
in scheme: travel!digital Thesaurus

Hotel Grande Bretagne & Angleterre
type: Concept
in scheme: travel!digital Thesaurus
pref label: Hotel Grande Bretagne & Angleterre
definition: bdk: touristische Infrastruktur

Hotel Grande Bretagne & Angleterre
type: Label
in scheme: travel!digital Thesaurus

Hotel Roanoke
type: Concept
pref label: Hotel Roanoke
in scheme: travel!digital Thesaurus
definition: bdk: touristische Infrastruktur

Hotel Roanoke
type: Label
in scheme: travel!digital Thesaurus

Stratford
type: Concept
pref label: Stratford
in scheme: travel!digital Thesaurus
definition: bdk: touristische Infrastruktur

Stratford
type: Label
in scheme: travel!digital Thesaurus

Hotel Bristol
type: Concept
alternative label: Bristol
in scheme: travel!digital Thesaurus
alt label: Bristol
pref label: Hotel Bristol
definition: bdk: touristische Infrastruktur

Bristol
type: Label
isVariantOf: Hotel Bristol
in scheme: travel!digital Thesaurus

Hotel Bristol
type: Label
hasVariant: Bristol
in scheme: travel!digital Thesaurus

Poland Springs House
type: Concept
pref label: Poland Springs House
in scheme: travel!digital Thesaurus
definition: bdk: touristische Infrastruktur

Poland Springs House
type: Label
in scheme: travel!digital Thesaurus

Hotel Bristol & du Globe
type: Concept
in scheme: travel!digital Thesaurus
pref label: Hotel Bristol & du Globe
definition: bdk: touristische Infrastruktur

Hotel Bristol & du Globe
type: Label
in scheme: travel!digital Thesaurus

Overlook Mountain House
type: Concept
pref label: Overlook Mountain House
in scheme: travel!digital Thesaurus
definition: bdk: touristische Infrastruktur

Overlook Mountain House
type: Label
in scheme: travel!digital Thesaurus

Laurel in the Pines
type: Concept
pref label: Laurel in the Pines
in scheme: travel!digital Thesaurus
definition: bdk: touristische Infrastruktur

Laurel in the Pines
type: Label
in scheme: travel!digital Thesaurus

Hotel des Etrangers
type: Concept
in scheme: travel!digital Thesaurus
pref label: Hotel des Etrangers
definition: bdk: touristische Infrastruktur

Hotel des Etrangers
type: Label
in scheme: travel!digital Thesaurus

Mount Vernon
type: Concept
pref label: Mount Vernon
in scheme: travel!digital Thesaurus
definition: bdk: touristische Infrastruktur

Mount Vernon
type: Label
in scheme: travel!digital Thesaurus

Memphremagog House
type: Concept
pref label: Memphremagog House
in scheme: travel!digital Thesaurus
definition: bdk: touristische Infrastruktur

Memphremagog House
type: Label
in scheme: travel!digital Thesaurus

Mena House Hotel
type: Concept
in scheme: travel!digital Thesaurus
pref label: Mena House Hotel
definition: bdk: touristische Infrastruktur

Mena House Hotel
type: Label
in scheme: travel!digital Thesaurus

Flume House
type: Concept
pref label: Flume House
in scheme: travel!digital Thesaurus
definition: bdk: touristische Infrastruktur

Flume House
type: Label
in scheme: travel!digital Thesaurus

Königin von England
type: Concept
in scheme: travel!digital Thesaurus
pref label: Königin von England
definition: bdk: touristische Infrastruktur

Königin von England
type: Label
in scheme: travel!digital Thesaurus

The Rainier
type: Concept
pref label: The Rainier
in scheme: travel!digital Thesaurus
definition: bdk: touristische Infrastruktur

The Rainier
type: Label
in scheme: travel!digital Thesaurus

California
type: Concept
pref label: California
in scheme: travel!digital Thesaurus
definition: bdk: touristische Infrastruktur

California
type: Label
in scheme: travel!digital Thesaurus

St. Sauveur
type: Concept
pref label: St. Sauveur
definition: bdk: touristische Infrastruktur
in scheme: travel!digital Thesaurus

St. Sauveur
type: Label
in scheme: travel!digital Thesaurus

Runnymede Hotel
type: Concept
in scheme: travel!digital Thesaurus
pref label: Runnymede Hotel
definition: bdk: touristische Infrastruktur

Runnymede Hotel
type: Label
in scheme: travel!digital Thesaurus

Bancel & Pastorini
type: Concept
pref label: Bancel & Pastorini
in scheme: travel!digital Thesaurus
definition: bdk: touristische Infrastruktur

Bancel & Pastorini
type: Label
in scheme: travel!digital Thesaurus

Mountain Park Hotel
type: Concept
pref label: Mountain Park Hotel
in scheme: travel!digital Thesaurus
definition: bdk: touristische Infrastruktur

Mountain Park Hotel
type: Label
in scheme: travel!digital Thesaurus

Villa Victoria
type: Concept
in scheme: travel!digital Thesaurus
pref label: Villa Victoria
definition: bdk: touristische Infrastruktur

Villa Victoria
type: Label
in scheme: travel!digital Thesaurus

Hollywood
type: Concept
pref label: Hollywood
in scheme: travel!digital Thesaurus
definition: bdk: touristische Infrastruktur

Hollywood
type: Label
in scheme: travel!digital Thesaurus

Hotel Continental
type: Concept
in scheme: travel!digital Thesaurus
pref label: Hotel Continental
definition: bdk: touristische Infrastruktur

Hotel Continental
type: Label
in scheme: travel!digital Thesaurus

Eastern & Oriental Hotel
type: Concept
in scheme: travel!digital Thesaurus
pref label: Eastern & Oriental Hotel
definition: bdk: touristische Infrastruktur

Eastern & Oriental Hotel
type: Label
in scheme: travel!digital Thesaurus

Arlington Inn
type: Concept
pref label: Arlington Inn
in scheme: travel!digital Thesaurus
definition: bdk: touristische Infrastruktur

Arlington Inn
type: Label
in scheme: travel!digital Thesaurus

Badhotel
type: Concept
in scheme: travel!digital Thesaurus
pref label: Badhotel
definition: bdk: touristische Infrastruktur

Badhotel
type: Label
in scheme: travel!digital Thesaurus

Hotel du Sahara
type: Concept
in scheme: travel!digital Thesaurus
pref label: Hotel du Sahara
definition: bdk: touristische Infrastruktur

Hotel du Sahara
type: Label
in scheme: travel!digital Thesaurus

Stillman
type: Concept
in scheme: travel!digital Thesaurus
pref label: Stillman
definition: bdk: touristische Infrastruktur

Stillman
type: Label
in scheme: travel!digital Thesaurus

Pasaje de Oriente
type: Concept
in scheme: travel!digital Thesaurus
pref label: Pasaje de Oriente
definition: bdk: touristische Infrastruktur

Pasaje de Oriente
type: Label
in scheme: travel!digital Thesaurus

Fort William Henry Hotel
type: Concept
pref label: Fort William Henry Hotel
in scheme: travel!digital Thesaurus
definition: bdk: touristische Infrastruktur

Fort William Henry Hotel
type: Label
in scheme: travel!digital Thesaurus

Ober
type: Concept
pref label: Ober
in scheme: travel!digital Thesaurus
definition: bdk: touristische Infrastruktur

Ober
type: Label
in scheme: travel!digital Thesaurus

Hôtel Carmel
type: Concept
in scheme: travel!digital Thesaurus
definition: bdk: touristische Infrastruktur
pref label: Hôtel Carmel

Hôtel Carmel
type: Label
in scheme: travel!digital Thesaurus

Hotel Kaaterskill
type: Concept
pref label: Hotel Kaaterskill
in scheme: travel!digital Thesaurus
definition: bdk: touristische Infrastruktur

Hotel Kaaterskill
type: Label
in scheme: travel!digital Thesaurus

Hotel Costa
type: Concept
in scheme: travel!digital Thesaurus
pref label: Hotel Costa
definition: bdk: touristische Infrastruktur

Hotel Costa
type: Label
in scheme: travel!digital Thesaurus

Atamont
type: Concept
pref label: Atamont
in scheme: travel!digital Thesaurus
definition: bdk: touristische Infrastruktur

Atamont
type: Label
in scheme: travel!digital Thesaurus

Hotel Nunes
type: Concept
in scheme: travel!digital Thesaurus
pref label: Hotel Nunes
definition: bdk: touristische Infrastruktur

Hotel Nunes
type: Label
in scheme: travel!digital Thesaurus

Niagara Hotel
type: Concept
pref label: Niagara Hotel
in scheme: travel!digital Thesaurus
definition: bdk: touristische Infrastruktur

Niagara Hotel
type: Label
in scheme: travel!digital Thesaurus

Hotel Pannonia
type: Concept
in scheme: travel!digital Thesaurus
pref label: Hotel Pannonia
definition: bdk: touristische Infrastruktur

Hotel Pannonia
type: Label
in scheme: travel!digital Thesaurus

Fifth Avenue Hotel
type: Concept
pref label: Fifth Avenue Hotel
in scheme: travel!digital Thesaurus
definition: bdk: touristische Infrastruktur

Fifth Avenue Hotel
type: Label
in scheme: travel!digital Thesaurus

San Marco
type: Concept
pref label: San Marco
in scheme: travel!digital Thesaurus
definition: bdk: touristische Infrastruktur

San Marco
type: Label
in scheme: travel!digital Thesaurus

Hotel de l’Oasis
type: Concept
in scheme: travel!digital Thesaurus
pref label: Hotel de l’Oasis
definition: bdk: touristische Infrastruktur

Hotel de l’Oasis
type: Label
in scheme: travel!digital Thesaurus

Pavilion Hotel
type: Concept
pref label: Pavilion Hotel
in scheme: travel!digital Thesaurus
definition: bdk: touristische Infrastruktur

Pavilion Hotel
type: Label
in scheme: travel!digital Thesaurus

Café Brunswick
type: Concept
pref label: Café Brunswick
in scheme: travel!digital Thesaurus
definition: bdk: touristische Infrastruktur

Café Brunswick
type: Label
in scheme: travel!digital Thesaurus

Hotel Métropole & Ville
type: Concept
in scheme: travel!digital Thesaurus
pref label: Hotel Métropole & Ville
definition: bdk: touristische Infrastruktur

Hotel Métropole & Ville
type: Label
in scheme: travel!digital Thesaurus

Beach Hotel
type: Concept
narrower: Long Beach Hotel
narrower: Coronado Beach Hotel
narrower: Redondo Beach Hotel
pref label: Beach Hotel
in scheme: travel!digital Thesaurus
definition: bdk: touristische Infrastruktur

Long Beach Hotel
type: Concept
pref label: Long Beach Hotel
in scheme: travel!digital Thesaurus
definition: bdk: touristische Infrastruktur

Long Beach Hotel
type: Label
in scheme: travel!digital Thesaurus

Coronado Beach Hotel
type: Concept
pref label: Coronado Beach Hotel
in scheme: travel!digital Thesaurus
definition: bdk: touristische Infrastruktur

Coronado Beach Hotel
type: Label
in scheme: travel!digital Thesaurus

Redondo Beach Hotel
type: Concept
pref label: Redondo Beach Hotel
in scheme: travel!digital Thesaurus
definition: bdk: touristische Infrastruktur

Redondo Beach Hotel
type: Label
in scheme: travel!digital Thesaurus

Beach Hotel
type: Label
in scheme: travel!digital Thesaurus

Queen's Hotel
type: Concept
in scheme: travel!digital Thesaurus
pref label: Queen's Hotel
definition: bdk: touristische Infrastruktur

Queen's Hotel
type: Label
in scheme: travel!digital Thesaurus

Intervale House
type: Concept
pref label: Intervale House
in scheme: travel!digital Thesaurus
definition: bdk: touristische Infrastruktur

Intervale House
type: Label
in scheme: travel!digital Thesaurus

Palace Hotel
type: Concept
pref label: Palace Hotel
narrower: Taj Mahal Palace Hotel
narrower: Ghezireh Palace Hotel
narrower: Tunisia Palace Hotel
narrower: Bertolini's Palace Hotel
in scheme: travel!digital Thesaurus
definition: bdk: touristische Infrastruktur
narrower: Excelsior Palace Hotel

Palace Hotel
type: Label
in scheme: travel!digital Thesaurus

Taj Mahal Palace Hotel
type: Concept
in scheme: travel!digital Thesaurus
pref label: Taj Mahal Palace Hotel
definition: bdk: touristische Infrastruktur

Taj Mahal Palace Hotel
type: Label
in scheme: travel!digital Thesaurus

Ghezireh Palace Hotel
type: Concept
in scheme: travel!digital Thesaurus
pref label: Ghezireh Palace Hotel
definition: bdk: touristische Infrastruktur

Ghezireh Palace Hotel
type: Label
in scheme: travel!digital Thesaurus

Tunisia Palace Hotel
type: Concept
in scheme: travel!digital Thesaurus
pref label: Tunisia Palace Hotel
definition: bdk: touristische Infrastruktur

Tunisia Palace Hotel
type: Label
in scheme: travel!digital Thesaurus

Bertolini's Palace Hotel
type: Concept
in scheme: travel!digital Thesaurus
pref label: Bertolini's Palace Hotel
definition: bdk: touristische Infrastruktur

Bertolini's Palace Hotel
type: Label
in scheme: travel!digital Thesaurus

Excelsior Palace Hotel
type: Concept
in scheme: travel!digital Thesaurus
pref label: Excelsior Palace Hotel
definition: bdk: touristische Infrastruktur

Excelsior Palace Hotel
type: Label
in scheme: travel!digital Thesaurus

Hotel de Inglaterra
type: Concept
in scheme: travel!digital Thesaurus
pref label: Hotel de Inglaterra
definition: bdk: touristische Infrastruktur

Hotel de Inglaterra
type: Label
in scheme: travel!digital Thesaurus

Restaurant
type: Concept
in scheme: travel!digital Thesaurus
narrower: Restaurant de la Pêcherie
narrower: Hôtel-Restaurant Mallard
definition: bdk: touristische Infrastruktur
narrower: Bahnrestaurant
pref label: Restaurant
narrower: Restaurant Terminus
narrower: Restaurant Cassar
narrower: Sproud’s Restaurant
narrower: Hotel-Restaurant Schwabenberg
narrower: Restaurant Isnard

Restaurant de la Pêcherie
type: Concept
in scheme: travel!digital Thesaurus
pref label: Restaurant de la Pêcherie
definition: bdk: touristische Infrastruktur

Restaurant de la Pêcherie
type: Label
in scheme: travel!digital Thesaurus

Hôtel-Restaurant Mallard
type: Concept
in scheme: travel!digital Thesaurus
pref label: Hôtel-Restaurant Mallard
definition: bdk: touristische Infrastruktur

Hôtel-Restaurant Mallard
type: Label
in scheme: travel!digital Thesaurus

Bahnrestaurant
type: Concept
pref label: Bahnrestaurant
in scheme: travel!digital Thesaurus
definition: bdk: touristische Infrastruktur

Bahnrestaurant
type: Label
in scheme: travel!digital Thesaurus

Restaurant
type: Label
in scheme: travel!digital Thesaurus

Restaurant Terminus
type: Concept
in scheme: travel!digital Thesaurus
pref label: Restaurant Terminus
definition: bdk: touristische Infrastruktur

Restaurant Terminus
type: Label
in scheme: travel!digital Thesaurus

Restaurant Cassar
type: Concept
in scheme: travel!digital Thesaurus
pref label: Restaurant Cassar
definition: bdk: touristische Infrastruktur

Restaurant Cassar
type: Label
in scheme: travel!digital Thesaurus

Sproud’s Restaurant
type: Concept
pref label: Sproud’s Restaurant
in scheme: travel!digital Thesaurus
definition: bdk: touristische Infrastruktur

Sproud’s Restaurant
type: Label
in scheme: travel!digital Thesaurus

Hotel-Restaurant Schwabenberg
type: Concept
in scheme: travel!digital Thesaurus
pref label: Hotel-Restaurant Schwabenberg
definition: bdk: touristische Infrastruktur

Hotel-Restaurant Schwabenberg
type: Label
in scheme: travel!digital Thesaurus

Restaurant Isnard
type: Concept
in scheme: travel!digital Thesaurus
pref label: Restaurant Isnard
definition: bdk: touristische Infrastruktur

Restaurant Isnard
type: Label
in scheme: travel!digital Thesaurus

Thomas’s Hotel
type: Concept
pref label: Thomas’s Hotel
in scheme: travel!digital Thesaurus
definition: bdk: touristische Infrastruktur

Thomas’s Hotel
type: Label
in scheme: travel!digital Thesaurus

Adam’s House
type: Concept
pref label: Adam’s House
in scheme: travel!digital Thesaurus
definition: bdk: touristische Infrastruktur

Adam’s House
type: Label
in scheme: travel!digital Thesaurus

Sagamore
type: Concept
pref label: Sagamore
in scheme: travel!digital Thesaurus
definition: bdk: touristische Infrastruktur

Sagamore
type: Label
in scheme: travel!digital Thesaurus

Windsor
type: Concept
pref label: Windsor
in scheme: travel!digital Thesaurus
definition: bdk: touristische Infrastruktur

Windsor
type: Label
in scheme: travel!digital Thesaurus

St. Denis Hotel
type: Concept
pref label: St. Denis Hotel
definition: bdk: touristische Infrastruktur
in scheme: travel!digital Thesaurus

St. Denis Hotel
type: Label
in scheme: travel!digital Thesaurus

Hotel Iroquois
type: Concept
pref label: Hotel Iroquois
in scheme: travel!digital Thesaurus
definition: bdk: touristische Infrastruktur

Hotel Iroquois
type: Label
in scheme: travel!digital Thesaurus

Cordova
type: Concept
pref label: Cordova
in scheme: travel!digital Thesaurus
definition: bdk: touristische Infrastruktur

Cordova
type: Label
in scheme: travel!digital Thesaurus

Hotel Excelsior
type: Concept
in scheme: travel!digital Thesaurus
pref label: Hotel Excelsior
definition: bdk: touristische Infrastruktur

Hotel Excelsior
type: Label
in scheme: travel!digital Thesaurus

Marchand
type: Concept
pref label: Marchand
in scheme: travel!digital Thesaurus
definition: bdk: touristische Infrastruktur

Marchand
type: Label
in scheme: travel!digital Thesaurus

Broadway Central
type: Concept
pref label: Broadway Central
in scheme: travel!digital Thesaurus
definition: bdk: touristische Infrastruktur

Broadway Central
type: Label
in scheme: travel!digital Thesaurus

Young’s
type: Concept
pref label: Young’s
in scheme: travel!digital Thesaurus
definition: bdk: touristische Infrastruktur

Young’s
type: Label
in scheme: travel!digital Thesaurus

Hotel Mercedes
type: Concept
in scheme: travel!digital Thesaurus
pref label: Hotel Mercedes
definition: bdk: touristische Infrastruktur

Hotel Mercedes
type: Label
in scheme: travel!digital Thesaurus

Spring House
type: Concept
pref label: Spring House
in scheme: travel!digital Thesaurus
definition: bdk: touristische Infrastruktur

Spring House
type: Label
in scheme: travel!digital Thesaurus

Gay Head
type: Concept
pref label: Gay Head
in scheme: travel!digital Thesaurus
definition: bdk: touristische Infrastruktur

Gay Head
type: Label
in scheme: travel!digital Thesaurus

Pilsner Bierhalle
type: Concept
in scheme: travel!digital Thesaurus
pref label: Pilsner Bierhalle
definition: bdk: touristische Infrastruktur

Pilsner Bierhalle
type: Label
in scheme: travel!digital Thesaurus

Kearsarge House
type: Concept
pref label: Kearsarge House
in scheme: travel!digital Thesaurus
definition: bdk: touristische Infrastruktur

Kearsarge House
type: Label
in scheme: travel!digital Thesaurus

Lakewood
type: Concept
pref label: Lakewood
in scheme: travel!digital Thesaurus
definition: bdk: touristische Infrastruktur

Lakewood
type: Label
in scheme: travel!digital Thesaurus

Hotel Victoria
type: Concept
in scheme: travel!digital Thesaurus
pref label: Hotel Victoria
definition: bdk: touristische Infrastruktur

Hotel Victoria
type: Label
in scheme: travel!digital Thesaurus

Closer’s Temperance Eating Rooms
type: Concept
pref label: Closer’s Temperance Eating Rooms
in scheme: travel!digital Thesaurus
definition: bdk: touristische Infrastruktur

Closer’s Temperance Eating Rooms
type: Label
in scheme: travel!digital Thesaurus

Lake View House
type: Concept
pref label: Lake View House
in scheme: travel!digital Thesaurus
definition: bdk: touristische Infrastruktur

Lake View House
type: Label
in scheme: travel!digital Thesaurus

Hotel Cecil
type: Concept
in scheme: travel!digital Thesaurus
pref label: Hotel Cecil
definition: bdk: touristische Infrastruktur

Hotel Cecil
type: Label
in scheme: travel!digital Thesaurus

Hotel Vendome
type: Concept
pref label: Hotel Vendome
in scheme: travel!digital Thesaurus
definition: bdk: touristische Infrastruktur

Hotel Vendome
type: Label
in scheme: travel!digital Thesaurus

Brunswick
type: Concept
pref label: Brunswick
in scheme: travel!digital Thesaurus
definition: bdk: touristische Infrastruktur

Brunswick
type: Label
in scheme: travel!digital Thesaurus

Hotel Central
type: Concept
in scheme: travel!digital Thesaurus
pref label: Hotel Central
definition: bdk: touristische Infrastruktur

Hotel Central
type: Label
in scheme: travel!digital Thesaurus

Adirondack Lodge
type: Concept
pref label: Adirondack Lodge
in scheme: travel!digital Thesaurus
definition: bdk: touristische Infrastruktur

Adirondack Lodge
type: Label
in scheme: travel!digital Thesaurus

Royal-Hôtel
type: Concept
in scheme: travel!digital Thesaurus
pref label: Royal-Hôtel
definition: bdk: touristische Infrastruktur

Royal-Hôtel
type: Label
in scheme: travel!digital Thesaurus

Luehrman’s
type: Concept
pref label: Luehrman’s
in scheme: travel!digital Thesaurus
definition: bdk: touristische Infrastruktur

Luehrman’s
type: Label
in scheme: travel!digital Thesaurus

Berkeley
type: Concept
pref label: Berkeley
in scheme: travel!digital Thesaurus
definition: bdk: touristische Infrastruktur

Berkeley
type: Label
in scheme: travel!digital Thesaurus

Regina Hotel
type: Concept
alternative label: Regina-Hôtel
in scheme: travel!digital Thesaurus
pref label: Regina Hotel
alt label: Regina-Hôtel
definition: bdk: touristische Infrastruktur

Regina Hotel
type: Label
hasVariant: Regina-Hôtel
in scheme: travel!digital Thesaurus

Regina-Hôtel
type: Label
isVariantOf: Regina Hotel
in scheme: travel!digital Thesaurus

Battery Park Hotel
type: Concept
pref label: Battery Park Hotel
in scheme: travel!digital Thesaurus
definition: bdk: touristische Infrastruktur

Battery Park Hotel
type: Label
in scheme: travel!digital Thesaurus

Fabyan House
type: Concept
pref label: Fabyan House
in scheme: travel!digital Thesaurus
definition: bdk: touristische Infrastruktur

Fabyan House
type: Label
in scheme: travel!digital Thesaurus

Heublein
type: Concept
pref label: Heublein
in scheme: travel!digital Thesaurus
definition: bdk: touristische Infrastruktur

Heublein
type: Label
in scheme: travel!digital Thesaurus

National Hotel
type: Concept
in scheme: travel!digital Thesaurus
pref label: National Hotel
definition: bdk: touristische Infrastruktur

National Hotel
type: Label
in scheme: travel!digital Thesaurus

Hotel van Horck
type: Concept
in scheme: travel!digital Thesaurus
pref label: Hotel van Horck
definition: bdk: touristische Infrastruktur

Hotel van Horck
type: Label
in scheme: travel!digital Thesaurus

Yellowstone Lake Hotel
type: Concept
pref label: Yellowstone Lake Hotel
in scheme: travel!digital Thesaurus
definition: bdk: touristische Infrastruktur

Yellowstone Lake Hotel
type: Label
in scheme: travel!digital Thesaurus

Ocean Bluff’s House
type: Concept
pref label: Ocean Bluff’s House
in scheme: travel!digital Thesaurus
definition: bdk: touristische Infrastruktur

Ocean Bluff’s House
type: Label
in scheme: travel!digital Thesaurus

Kittatinny House
type: Concept
pref label: Kittatinny House
in scheme: travel!digital Thesaurus
definition: bdk: touristische Infrastruktur

Kittatinny House
type: Label
in scheme: travel!digital Thesaurus

Tavares
type: Concept
in scheme: travel!digital Thesaurus
pref label: Tavares
definition: bdk: touristische Infrastruktur

Tavares
type: Label
in scheme: travel!digital Thesaurus

Bon Air Hotel
type: Concept
pref label: Bon Air Hotel
in scheme: travel!digital Thesaurus
definition: bdk: touristische Infrastruktur

Bon Air Hotel
type: Label
in scheme: travel!digital Thesaurus

Boldt
type: Concept
pref label: Boldt
in scheme: travel!digital Thesaurus
definition: bdk: touristische Infrastruktur

Boldt
type: Label
in scheme: travel!digital Thesaurus

Hotel de Londres
type: Concept
in scheme: travel!digital Thesaurus
pref label: Hotel de Londres
definition: bdk: touristische Infrastruktur

Hotel de Londres
type: Label
in scheme: travel!digital Thesaurus

Mount Pleasant House
type: Concept
pref label: Mount Pleasant House
in scheme: travel!digital Thesaurus
definition: bdk: touristische Infrastruktur

Mount Pleasant House
type: Label
in scheme: travel!digital Thesaurus

Hotel d’Angleterre
type: Concept
in scheme: travel!digital Thesaurus
pref label: Hotel d’Angleterre
definition: bdk: touristische Infrastruktur

Hotel d’Angleterre
type: Label
in scheme: travel!digital Thesaurus

Landes-Kasino
type: Concept
in scheme: travel!digital Thesaurus
pref label: Landes-Kasino
definition: bdk: touristische Infrastruktur

Landes-Kasino
type: Label
in scheme: travel!digital Thesaurus

New Keena Hotel
type: Concept
in scheme: travel!digital Thesaurus
pref label: New Keena Hotel
definition: bdk: touristische Infrastruktur

New Keena Hotel
type: Label
in scheme: travel!digital Thesaurus

Hotel d’Angleterre & Belle Venise
type: Concept
in scheme: travel!digital Thesaurus
pref label: Hotel d’Angleterre & Belle Venise
definition: bdk: touristische Infrastruktur

Hotel d’Angleterre & Belle Venise
type: Label
in scheme: travel!digital Thesaurus

Hotel Semiramis
type: Concept
in scheme: travel!digital Thesaurus
pref label: Hotel Semiramis
definition: bdk: touristische Infrastruktur

Hotel Semiramis
type: Label
in scheme: travel!digital Thesaurus

The Antlers
type: Concept
pref label: The Antlers
in scheme: travel!digital Thesaurus
definition: bdk: touristische Infrastruktur

The Antlers
type: Label
in scheme: travel!digital Thesaurus

Birreria Svizzera
type: Concept
in scheme: travel!digital Thesaurus
pref label: Birreria Svizzera
definition: bdk: touristische Infrastruktur

Birreria Svizzera
type: Label
in scheme: travel!digital Thesaurus

Hotel de la Grande-Bretagne
type: Concept
in scheme: travel!digital Thesaurus
pref label: Hotel de la Grande-Bretagne
definition: bdk: touristische Infrastruktur

Hotel de la Grande-Bretagne
type: Label
in scheme: travel!digital Thesaurus

Hotel de l’Europe
type: Concept
in scheme: travel!digital Thesaurus
pref label: Hotel de l’Europe
definition: bdk: touristische Infrastruktur

Hotel de l’Europe
type: Label
in scheme: travel!digital Thesaurus

Deutscher Hof
type: Concept
in scheme: travel!digital Thesaurus
pref label: Deutscher Hof
definition: bdk: touristische Infrastruktur

Deutscher Hof
type: Label
in scheme: travel!digital Thesaurus

Hôtel du Pavillon
type: Concept
in scheme: travel!digital Thesaurus
pref label: Hôtel du Pavillon
definition: bdk: touristische Infrastruktur

Hôtel du Pavillon
type: Label
in scheme: travel!digital Thesaurus

Parker House
type: Concept
pref label: Parker House
in scheme: travel!digital Thesaurus
definition: bdk: touristische Infrastruktur

Parker House
type: Label
in scheme: travel!digital Thesaurus

Viticultural Society
type: Concept
pref label: Viticultural Society
in scheme: travel!digital Thesaurus
definition: bdk: touristische Infrastruktur

Viticultural Society
type: Label
in scheme: travel!digital Thesaurus

Cataract House
type: Concept
pref label: Cataract House
in scheme: travel!digital Thesaurus
definition: bdk: touristische Infrastruktur

Cataract House
type: Label
in scheme: travel!digital Thesaurus

Hotel Bertrand
type: Concept
in scheme: travel!digital Thesaurus
pref label: Hotel Bertrand
definition: bdk: touristische Infrastruktur

Hotel Bertrand
type: Label
in scheme: travel!digital Thesaurus

St. Andrew's Hotel
type: Concept
in scheme: travel!digital Thesaurus
pref label: St. Andrew's Hotel
definition: bdk: touristische Infrastruktur

St. Andrew's Hotel
type: Label
in scheme: travel!digital Thesaurus

Hôtel Orient
type: Concept
in scheme: travel!digital Thesaurus
definition: bdk: touristische Infrastruktur
pref label: Hôtel Orient

Hôtel Orient
type: Label
in scheme: travel!digital Thesaurus

Hotel St. Louis
type: Concept
pref label: Hotel St. Louis
in scheme: travel!digital Thesaurus
definition: bdk: touristische Infrastruktur

Hotel St. Louis
type: Label
in scheme: travel!digital Thesaurus

Fleischmann’s Vienna Bakery
type: Concept
pref label: Fleischmann’s Vienna Bakery
in scheme: travel!digital Thesaurus
definition: bdk: touristische Infrastruktur

Fleischmann’s Vienna Bakery
type: Label
in scheme: travel!digital Thesaurus

Hotel Villa Valentina
type: Concept
in scheme: travel!digital Thesaurus
pref label: Hotel Villa Valentina
definition: bdk: touristische Infrastruktur

Hotel Villa Valentina
type: Label
in scheme: travel!digital Thesaurus

Westport Inn
type: Concept
pref label: Westport Inn
in scheme: travel!digital Thesaurus
definition: bdk: touristische Infrastruktur

Westport Inn
type: Label
in scheme: travel!digital Thesaurus

Farrish’s Chop House
type: Concept
pref label: Farrish’s Chop House
in scheme: travel!digital Thesaurus
definition: bdk: touristische Infrastruktur

Farrish’s Chop House
type: Label
in scheme: travel!digital Thesaurus

Hotel del Monte
type: Concept
pref label: Hotel del Monte
in scheme: travel!digital Thesaurus
definition: bdk: touristische Infrastruktur

Hotel del Monte
type: Label
in scheme: travel!digital Thesaurus

Hôtel des Indes
type: Concept
in scheme: travel!digital Thesaurus
pref label: Hôtel des Indes
definition: bdk: touristische Infrastruktur

Hôtel des Indes
type: Label
in scheme: travel!digital Thesaurus

Broadwater Hotel
type: Concept
pref label: Broadwater Hotel
in scheme: travel!digital Thesaurus
definition: bdk: touristische Infrastruktur

Broadwater Hotel
type: Label
in scheme: travel!digital Thesaurus

Geografisch orientierte Bezeichnungen
type: Concept
narrower: Provençale
narrower: Odessaer
narrower: Braunschweiger
narrower: brüsseler
narrower: ofener
narrower: Sizilianer
narrower: belgrader
narrower: eurasisch
narrower: anglo-östlich
narrower: thessalisch
narrower: sächsisch
narrower: nicht-europäisch
narrower: New Yorker
narrower: Damascenerin
narrower: neuenglisch
narrower: pilsener
definition: bdk: geografisch orientierte Konzepte im weitesten Sinn z.B.: Asiat, Orientale, Abendländer einschließlich Referenzen auf Städte, Inseln, Regionen und Provinzen | Duden: geografisch: 1. die Geografie betreffend | 2. die Lage, das Klima usw. eines Ortes, Gebietes betreffend | 3. sich auf einen bestimmten Punkt o. Ä. der Erdoberfläche beziehend
narrower: meeruter
narrower: centralamerikanisch
narrower: eleusinisch
narrower: Moghrebiner
narrower: siebenbürgisch
narrower: Andalusier
narrower: helwâner
narrower: Syrakusaner
narrower: nordamerikanisch
narrower: Abendländer
narrower: memphitisch
narrower: Smyrnioten
narrower: New Havener
narrower: südkarolinisch
narrower: mykenisch
narrower: pester
narrower: odessaer
narrower: Phanariotenfamilie
narrower: kölnisch
narrower: Palmyrener
narrower: bagdader
narrower: Aradier
narrower: pennsylvanisch
narrower: Hesse
narrower: Tirolerin
narrower: Korinther
narrower: Korfiote
narrower: Haurânier
narrower: angelsächsisch
narrower: Afrikaner
narrower: bataviasch
narrower: Galiläer
narrower: pelasgisch
narrower: palmyrenisch
narrower: europäisiert
narrower: phanariotisch
narrower: adrianopeler
narrower: moghrebiner
narrower: toskanisch
narrower: hannoversch
narrower: tiroler
narrower: mährisch
narrower: Andalusierin
narrower: Pisaner
narrower: erythräisch
narrower: kretisch
narrower: thebanisch
narrower: vormykenisch
narrower: pergamenisch
narrower: katalonisch
narrower: bremer
narrower: rheinisch-westfälisch
narrower: peträisch
narrower: Phokäer
narrower: sizilisch
narrower: Karthager
narrower: Acadier
narrower: chercheller
narrower: westindisch
narrower: florentinisch
narrower: funchaler

Provençale
type: Concept
related match: Provence
pref label: Provençale
in scheme: travel!digital Thesaurus
definition: Duden: Provenzale: Einwohnerbezeichnung zu Provence | Duden: Provence: Landschaft im Südosten Frankreichs | Meyers Großes Konversations-Lexikon 1908: Provence (spr. -wāngß', lat. Provincia), ehemalige Provinz im südlichen Frankreich, mit der Hauptstadt Aix, zerfiel in die Oberprovence oder den nördlichen Teil und die Niederprovence oder den südlichen Teil und bildet jetzt die drei Departements Rhonemündungen, Var und Niederalpen; ein Teil ist zum Depart. Vaucluse, ein andrer zu dem der Seealpen geschlagen; s. die Geschichtskarte von Frankreich (Bd. 6. S. 873). Die Bewohner der P., die Provenzalen, sprechen eine eigne romanische Mundart (s. Provenzalische Sprache und Literatur). – Die Ureinwohner der P. waren die Sallusier, ein ligurischer Volksstamm. Diese wurden 123 v. Chr. vom Konsular Sextius den Römern völlig unterworfen; so wurde Südgallien nach und nach zur römischen Provinz und erhielt den Namen Provincia im Gegensatz zu dem freien Gallien. Doch umfaßte die damalige gallische Provincia, unter Augustus offiziell Gallia Narbonnensis benannt, nicht bloß die jetzige P., sondern auch Languedoc, das Dauphine und Savoyen. Nachdem der größte Teil von Languedoc 415 von den Westgoten, das Land vom Genfer See bis gegen die Durance (das heutige Dauphiné) von den Burgundern (seit 443) eingenommen worden war, beschränkte sich der römische Besitz und zugleich der Name Provincia auf das Land zwischen der Durance und dem Mittelmeer, das den Römern um 470 durch die Westgoten entrissen wurde. Unter Theoderich d. Gr. wurde die P. ein Teil des ostgotischen Reiches. 536 trat sie der ostgotische König Vitiges dem fränkischen König Theodebert ab. Unter der Regierung der spätern Merowinger wurde sie zum Teil die Beute der Sarazenen, bis Karl Martell deren Herrschaft ein Ziel setzte. Beim Verfall des Frankenreichs wurde sie 879 dem niederburgundischen oder zisjuranischen Königreich einverleibt, 933 mit dem transjuranischen Königreich zum Reich Arelat vereinigt, und 1032 fiel sie an De…

Provençale
type: Label
in scheme: travel!digital Thesaurus

Odessaer
type: Concept
related match: Odessa
in scheme: travel!digital Thesaurus
pref label: Odessaer
definition: bdk: Einwohnerbezeichnung zu Odessa | Duden: Odessa: ukrainische Hafenstadt am Schwarzen Meer | Meyers Großes Konversations-Lexikon 1908: Odessa, Kreisstadt im russ. Gouv. Cherson, wichtigster Hafen- und Handelsplatz des Schwarzen Meeres und überhaupt Rußlands, liegt 40 km nördlich von der Mündung des Dnjestrlimans und ist Ausgangspunkt der Linie O.-Shmerinka-Kiew der russischen Südwestbahn. Die Stadt breitet sich an der Südwestseite der Bai von O. aus, auf einer nach W. zu unmittelbar in die kahle Steppe übergehenden Hochfläche, die, mehrfach von tiefen Wasserrinnen (Balki) durchschnitten, im Bereich der Stadt und südlich von ihr steil zum Meer abfällt. Die Stadthauptmannschaft O. (Areal 501 qkm) besteht aus der eigentlichen Stadt O., den Vorstädten Moldawanka, Peressyp und Slobodka-Romanowka und 18 Vororten. | Die Stadt selbst, um die sich die Staroportofrankowskaja (Alte Freihafen-) Straße halbkreisförmig herumzieht, ist sehr regelmäßig angelegt, die meisten Straßen kreuzen sich rechtwinklig und sind von großer Breite und Länge. Als die schönsten und als Mittelpunkte des Verkehrs sind zu nennen: die vom Bahnhof aus Meer führende Puschkinskaja und die ihr parallel laufenden Richelieu-, Katharinen- und Preobrashenskaja-Straße, die zu diesen querlaufenden Langeron-, De Ribas-, Griechische, Polizei- und Poststraße, die nach dem Peressyp hinabführende Sofiewskaja und der Nikolajewski-Boulevard, mit herrlicher Aussicht auf das Meer. Unter den öffentlichen Plätzen ist vor allem der schöne Katharinenplatz mit dem 1900 enthüllten Denkmal der Gründerin der Stadt, Katharina II. (von Dmitrenko), zu nennen, die Ssobornaja Ploschtschad mit dem Denkmal des Fürsten M. S. Woronzow und der Börsenplatz. Außer den genannten Denkmälern gibt es noch ein Denkmal Alexanders II. im Alexanderpark (1891 enthüllt) und Denkmäler des Herzogs von Richelieu und A. S. Puschkins (beide auf dem Nikolajewski-Boulevard). [...] | Quelle: Meyers Großes Konversations-Lexikon, Band 14. Leipzig 1908, S. …

Odessaer
type: Label
in scheme: travel!digital Thesaurus

Braunschweiger
type: Concept
in scheme: travel!digital Thesaurus
pref label: Braunschweiger
definition: Duden: Einwohnerbezeichnung | [Anm.: unvollständig: Einwohnerbezeichnung zu Braunschweig] | Duden: Stadt in Niedersachsen | Meyers Großes Konversations-Lexikon 1905: Braunschweig (hierzu der Stadtplan), Haupt- und Residenzstadt des Herzogtums Braunschweig, an der Oker, 63 m ü. M., Knotenpunkt der preuß. Staatsbahnlinien Eilsleben-Helmstedt-B., B.-Jerxheim und andrer Linien, ist eine interessante, ihr altdeutsches Bild im Innern treu bewahrende Stadt. Die hauptsächlichsten Straßen und Plätze innerhalb der frühern Ringmauern sind: der Bohlweg, Steinweg, der Burg-, Ruhsäulchen-, Schloß- und Friedrich-Wilhelmsplatz, der Altstadtmarkt mit altem, gotischem Brunnen (s. Tafel »Brunnen«, Fig. 3), der Kohlmarkt und der Hagenmarkt, letzterer mit dem von Breymann entworfenen und von Howaldt in Bronze gegossenen Brunnenstandbild Heinrichs des Löwen. [...] | Quelle: Meyers Großes Konversations-Lexikon, Band 3. Leipzig 1905, S. 359-361. | Permalink: http://www.zeno.org/nid/20006364152
related match: Braunschweig

Braunschweiger
type: Label
in scheme: travel!digital Thesaurus

brüsseler
type: Concept
definition: bdk: Brüssel, die Brüsseler betreffend; von den Brüsselern stammend, zu ihnen gehörend; in Brüssel gelegen | Duden: Brüssel: Hauptstadt von Belgien | Meyers Großes Konversations-Lexikon 1905: Brüssel (franz. Bruxelles, hierzu der Stadtplan), die Haupt- und Residenzstadt des Königreichs Belgien, zugleich die Hauptstadt der Provinz Brabant sowie der ehemaligen österreichischen, früher spanischen Niederlande, liegt 15 m ü. M., unter 50°51' 10'' nördl. Br. und 4°22' 13'' östl. L., an der Senne, einem Nebenflüßchen der Schelde, aus welchem der von dem untern Teil der Stadt ausgehende schiffbare Kanal von Willebroek in die Rupel führt (s. unten), wodurch die Stadt mit der Schelde und folglich auch mit Antwerpen in Verbindung steht, während ein anderer Kanal nach Charleroi geht und in die Sambre mündet. Das Klima ist feucht und veränderlich. Die Stadt liegt in fruchtbarer und gut angebauter Gegend[507] und besteht aus einem nordwestlichen untern Teil, der von mehreren Armen der Senne und von Kanälen durchschnitten ist, und einem südöstlichen obern Teil, der die aus dem Tal der Senne sanft ansteigende Höhe bedeckt. Sie hat einen Umfang von fast 8 km. Jenseit der ehemaligen Wälle, jetzt Boulevards, liegen rings um die innere Stadt acht Vororte (s. unten) mit gesonderter Verwaltung. Das Sennebett selbst ist 1867–71 überwölbt und über demselben sind zwei die Unterstadt in ihrer ganzen Breite durchziehende Boulevards angelegt worden. [...] | Quelle: Meyers Großes Konversations-Lexikon, Band 3. Leipzig 1905, S. 507-510. | Permalink: http://www.zeno.org/nid/2000637557X
related match: City of Brussels
pref label: brüsseler
in scheme: travel!digital Thesaurus

brüsseler
type: Label
in scheme: travel!digital Thesaurus

ofener
type: Concept
pref label: ofener
definition: bdk: den Stadtteil Ofen in Budapest betreffend | Meyers Großes Konversations-Lexikon 1908: Ofen (ungar. Buda), seit Béla IV. die Hauptstadt von Ungarn, von 1541–1686 in Türkenhänden, 1872 mit der Schwesterstadt Pest unter dem Namen Budapest vereint und zur Haupt- und Residenzstadt Ungarns erklärt. Weiteres und Geschichte s. Budapest. | Quelle: Meyers Großes Konversations-Lexikon, Band 14. Leipzig 1908, S. 911. | Permalink: http://www.zeno.org/nid/20007176511
alt label: ofner
in scheme: travel!digital Thesaurus
alternative label: ofner
related match: Buda
related: Budapester

ofener
type: Label
hasVariant: ofner
in scheme: travel!digital Thesaurus

ofner
type: Label
isVariantOf: ofener
in scheme: travel!digital Thesaurus

Budapester
type: Concept
definition: Duden: Einwohnerbezeichnung | [Anm.: unvollständig: Einwohnerbezeichnung zu Budapest] | Duden: Budapest: Hauptstadt von Ungarn | Meyers Großes Konversations-Lexikon 1905: Budapest (spr. budapescht, hierzu der Stadtplan mit Registerblatt), Haupt- und Residenzstadt von Ungarn (96–105 m ü. M.), liegt unter 47°25–35' nördl. Br. und 36°36–53' östl. L. und erstreckt sich zu beiden Seiten der Donau, deren Bett sich am Fuß des Blocksberges von 950 bis auf 300 m verengert. | B. besteht aus den im J. 1872 vereinigten Städten Ofen (Buda) und Pęst nebst dem Markte Altofen (O-Buda) und der Margareteninsel. Ofen erhebt sich am rechten Donauufer auf den letzten Ausläufern des ungarischen Mittelgebirges, Pest dehnt sich links vom Strome gegen den Rákos (Feld) und die ungarische Tiefebene hin nach O. aus. | [Stadtteile.] B. ist in 10 Bezirke (kerület) mit folgenden Stadtteilen eingeteilt: Auf der Ofen er Seite 1) die Festung (Vár), nämlich die königliche Burg und der I. Bezirk am 70 m hohen Plateau des Festungsberges. Nach W. zu liegt die ländliche Christinenstadt, gegen S. erhebt sich, durch die vom Taban (Raizenstadt) ausgefüllte Niederung getrennt, der 224 m hohe, durch die 1852 erbaute, jetzt ausgelassene Zitadelle befestigte Blocksberg (Gerhardsberg). 2) Zwischen dem Festungsberg und der Donau[557] liegt die Wasserstadt (Viziváros), weiter nördlich die Landstraße (Országút) mit dem untern Neustift (Ujlak). 3) Das obere Neustift und Altosen (O-Buda). Auf der Pester Seite: 4) die innere Stadt (Belváros), der älteste Teil der Stadt Pest. Um diesen gruppieren sich im Halbkreis die übrigen Stadtteile. 5) Gegen N. die Leopoldstadt (Lipótváros), das Zentrum des Großhandels; 6) gegen O. die Theresienstadt (Terézváros) vom Westbahnhof bis zur Königsgasse und 7) die Elisabethstadt (Erzsébetváros) bis zur Kerepeserstraße; 8) gegen SO. die Josephstadt (Józsesváros) und 9) die Franzstadt (Ferenczváros). Weiter rückwärts gegen O. liegt 10) Steinbruch (Köbánya, s.d.) und das Villenviertel des…
related match: Budapest
in scheme: travel!digital Thesaurus
pref label: Budapester

Budapester
type: Label
in scheme: travel!digital Thesaurus

belgrader
type: Concept
definition: bdk: Belgrad, die Belgrader betreffend; von den Belgradern stammend, zu ihnen gehörend; in Belgrad gelegen
pref label: belgrader
in scheme: travel!digital Thesaurus
related: Belgrader

belgrader
type: Label
in scheme: travel!digital Thesaurus

Belgrader
type: Concept
related match: Belgrade
pref label: Belgrader
in scheme: travel!digital Thesaurus
definition: Duden: Einwohnerbezeichnung | [Anm.: unvollständig: Einwohnerbezeichnung zu Belgrad] | Duden: Belgrad: Hauptstadt von Serbien; Beograd | Meyers Großes Konversations-Lexikon 1905: Belgrad, 1) (serb. Beograd, »weiße Burg«, ungar. Nandor-Fejérvár) befestigte Haupt- und Residenzstadt des Königreichs Serbien, 73 m ü. M., an der Vereinigung von Donau und Save und an der von Budapest nach Konstantinopel, bez. Salonichi führenden Eisenbahn, so daß sie die Wasser- und Landverbindungen nach allen vier Himmelsrichtungen hin beherrscht. Die gut armierte Festung zerfällt in die obere Festung mit Kommandantur (früher Residenz des Paschas), einigen Kasernen, Militärhospital und bombenfesten Kasematten, in denen Sträflinge untergebracht sind, und in die untere Festung mit großen Magazinen und Kasernen. Hart an der Donau steht der Turm Nebojse. Zwischen Festung und Stadt liegt der gegen 200 m breite Kalimejdan, ein früher wüster, jetzt in einen schönen Park umgewandelter Raum. B. wird in sechs Bezirke eingeteilt. Das alte Türkenviertel Dortschol ist fast ganz verschwunden; gerade Straßen durchkreuzen es. B. war bis 1862 mit Wällen umgeben, durch die fünf Tore in die eigentliche Stadt führten. Unweit des schönsten dieser Tore, des 1868 niedergerissenen Stambul Kapu, steht das 1871 eröffnete Nationaltheater und ihm gegenüber seit 1882 das eherne Denkmal des Fürsten Michael Obrenowić III. Außer einer alten Kirche in der obern Festung hat B. noch 4 griechisch-katholische und eine evang. Kirche, eine kath. Kapelle, 2 Synagogen und eine Moschee. Die Zahl der Einwohner beträgt (1900) 69,097, davon 39,659 Männer und nur 29,438 Frauen. Die Industrie ist ganz unbedeutend, dagegen ist B. Sitz des Handels zwischen Serbien und Österreich-Ungarn und vermittelt den lebhaften Transitverkehr zwischen Österreich und der Türkei. Zum Aufschwunge des Handels tragen viel die privilegierte serbische Nationalbank und die Kreditbank bei. Die Donaudampfschiffahrtsgesellschaft, die Österreichische Staatseisen…

Belgrader
type: Label
in scheme: travel!digital Thesaurus

eurasisch
type: Concept
definition: Duden: 1. zu Eurasien | 2. die Eurasier betreffend | [Anm.: unvollständig: Eurasien, die Eurasier betreffend; von den Eurasiern stammend, zu ihnen gehörend; in Eurasien gelegen]
related: asiatisch
pref label: eurasisch
related: Eurasier
related: europäisch
in scheme: travel!digital Thesaurus

asiatisch
type: Concept
preferred label: asiatic @en
pref label: asiatic
related: Asiat
narrower: vorderasiatisch
in scheme: travel!digital Thesaurus
narrower: innerasiatisch
definition: Duden: zu Asien gehörend; aus Asien kommend | [Anm.: unvollständig: Asien, die Asiaten betreffend; von den Asiaten stammend, zu ihnen gehörend; in Asien gelegen]
pref label: asiatisch
narrower: europäisch-asiatisch
narrower: deutsch-asiatisch
narrower: ostasiatisch
narrower: kleinasiatisch

asiatic
type: Label
isTranslationOf: asiatisch
in scheme: travel!digital Thesaurus

asiatisch
type: Label
hasTranslation: asiatic
in scheme: travel!digital Thesaurus

vorderasiatisch
type: Concept
definition: Duden: Vorderasien betreffend; aus Vorderasien stammend | [Anm.: unvollständig: Vorderasien, die Bewohner von Vorderasien betreffend; von den Bewohnern von Vorderasien stammend, zu ihnen gehörend; in Vorderasien gelegen] | Duden: Vorderasien: südwestliches Asien
in scheme: travel!digital Thesaurus
pref label: vorderasiatisch

vorderasiatisch
type: Label
in scheme: travel!digital Thesaurus

innerasiatisch
type: Concept
in scheme: travel!digital Thesaurus
pref label: innerasiatisch
definition: bdk: siehe asiatisch | Duden: Zentralasien | Duden: Zentralasien: Bereich der großen (zumeist zu China und der Mongolei gehörenden) Hochländer im Innern Asiens

innerasiatisch
type: Label
in scheme: travel!digital Thesaurus

europäisch-asiatisch
type: Concept
definition: bdk: siehe europäisch, asiatisch
in scheme: travel!digital Thesaurus
pref label: europäisch-asiatisch

europäisch-asiatisch
type: Label
in scheme: travel!digital Thesaurus

ostasiatisch
type: Concept
preferred label: east asiatic @en
pref label: ostasiatisch
related: Ostasiat
definition: Duden: Ostasien, die Ostasiaten betreffend; von den Ostasiaten stammend, zu ihnen gehörend | [Anm.: unvollständig: Ostasien, die Ostasiaten betreffend; von den Ostasiaten stammend, zu ihnen gehörend; in Ostasien gelegen]
pref label: east asiatic
in scheme: travel!digital Thesaurus

ostasiatisch
type: Label
hasTranslation: east asiatic
in scheme: travel!digital Thesaurus

east asiatic
type: Label
isTranslationOf: ostasiatisch
in scheme: travel!digital Thesaurus

kleinasiatisch
type: Concept
related: Kleinasiat
pref label: kleinasiatisch
in scheme: travel!digital Thesaurus
definition: Duden: Kleinasien betreffend | [Anm.: Kleinasien, die Kleinasiaten betreffend; von den Kleinasiaten stammend, zu ihnen gehörend; in Kleinasien gelegen]

kleinasiatisch
type: Label
in scheme: travel!digital Thesaurus

eurasisch
type: Label
in scheme: travel!digital Thesaurus

europäisch
type: Concept
narrower: europäisch-klassizistisch
in scheme: travel!digital Thesaurus
narrower: südosteuropäisch
related: Europäer
definition: Duden: 1. zu Europa | [Anm.: unvollständig: Europa, die Europäer betreffend; von den Europäern stammend, zu ihnen gehörend; in Europa gelegen]
pref label: european
related: Europäerin
narrower: osteuropäisch
pref label: europäisch
narrower: südeuropäisch
narrower: westeuropäisch
narrower: mitteleuropäisch
narrower: europäisch-asiatisch
preferred label: european @en
narrower: europäisch-japanisch
pref label: europeu
preferred label: europeu @pt
narrower: europäisch-örtlich
narrower: nordeuropäisch

europäisch-klassizistisch
type: Concept
alternative label: europäisch klassizistisch
in scheme: travel!digital Thesaurus
pref label: europäisch-klassizistisch
alt label: europäisch klassizistisch
definition: bdk: siehe europäisch | Duden: klassizistisch: den Klassizismus (1) betreffend; zu ihm gehörend | Duden: Klassizismus: 1. <ohne Plural> Stilform, die im Anschluss an antike, besonders römische Vorbilder Klarheit und Strenge der Gliederung, Geradlinigkeit und die Gesetzmäßigkeit der Verhältnisse betont

europäisch-klassizistisch
type: Label
hasVariant: europäisch klassizistisch
in scheme: travel!digital Thesaurus

europäisch klassizistisch
type: Label
isVariantOf: europäisch-klassizistisch
in scheme: travel!digital Thesaurus

südosteuropäisch
type: Concept
related match: Southeast Europe
definition: bdk: siehe europäisch
in scheme: travel!digital Thesaurus
pref label: südosteuropäisch

südosteuropäisch
type: Label
in scheme: travel!digital Thesaurus

european
type: Label
isTranslationOf: europäisch
in scheme: travel!digital Thesaurus

europäisch
type: Label
in scheme: travel!digital Thesaurus
hasTranslation: european

Europäerin
type: Concept
in scheme: travel!digital Thesaurus
definition: Duden: weibliche Form zu Europäer
pref label: Europäerin
related: Europäer

Europäerin
type: Label
in scheme: travel!digital Thesaurus

osteuropäisch
type: Concept
definition: Duden: Osteuropa, die Osteuropäer betreffend; von den Osteuropäern stammend, zu ihnen gehörend | [Anm.: unvollständig: Osteuropa, die Osteuropäer betreffend; von den Osteuropäern stammend, zu ihnen gehörend; in Osteuropa gelegen] | Duden: Osteuropa: östlicher Teil Europas
related match: Eastern Europe
pref label: osteuropäisch
in scheme: travel!digital Thesaurus

osteuropäisch
type: Label
in scheme: travel!digital Thesaurus

südeuropäisch
type: Concept
definition: Duden: Südeuropa betreffend, aus Südeuropa stammend, zu Südeuropa gehörend | [Anm.: unvollständig: Südeuropa, die Südeuropäer betreffend; von den Südeuropäern stammend, zu ihnen gehörend; in Südeuropa gelegen] | Duden: Südeuropa: südlicher Teil Europas
related match: Southern Europe
in scheme: travel!digital Thesaurus
pref label: südeuropäisch

südeuropäisch
type: Label
in scheme: travel!digital Thesaurus

westeuropäisch
type: Concept
definition: Duden: Westeuropa betreffend, aus Westeuropa stammend, zu Westeuropa gehörend | [Anm.: unvollständig: Westeuropa, die Westeuropäer betreffend; von den Westeuropäern stammend, zu ihnen gehörend; in Westeuropa gelegen] | Duden: Westeuropa: westlicher Teil Europas
related match: Western Europe
in scheme: travel!digital Thesaurus
pref label: westeuropäisch

westeuropäisch
type: Label
in scheme: travel!digital Thesaurus

mitteleuropäisch
type: Concept
related: Mitteleuropäer
definition: Duden: Mitteleuropa, die Mitteleuropäer betreffend, von den Mitteleuropäern stammend, zu ihnen gehörend; aus Mitteleuropa stammend | [Anm.: unvollständig: Mitteleuropa, die Mitteleuropäer betreffend; von den Mitteleuropäern stammend, zu ihnen gehörend; in Mitteleuropa gelegen]
pref label: mitteleuropäisch
in scheme: travel!digital Thesaurus

mitteleuropäisch
type: Label
in scheme: travel!digital Thesaurus

europeu
type: Label
isTranslationOf: europäisch
in scheme: travel!digital Thesaurus
hasTranslation: european

europäisch-örtlich
type: Concept
in scheme: travel!digital Thesaurus
definition: bdk: siehe europäisch | Duden: örtlich: 1. auf eine bestimmte Stelle beschränkt, begrenzt | 2. nur einen bestimmten Ort betreffend; nur in einem bestimmten Ort
pref label: europäisch-örtlich

europäisch-örtlich
type: Label
in scheme: travel!digital Thesaurus

nordeuropäisch
type: Concept
related match: Northern Europe
pref label: nordeuropäisch
in scheme: travel!digital Thesaurus
definition: Duden: Nordeuropa betreffend, aus Nordeuropa stammend, zu Nordeuropa gehörend | [Anm.: unvollständig: Nordeuropa, die Nordeuropäer betreffend; von den Nordeuropäern stammend, zu ihnen gehörend; in Nordeuropa gelegen]

nordeuropäisch
type: Label
in scheme: travel!digital Thesaurus

anglo-östlich
type: Concept
in scheme: travel!digital Thesaurus
pref label: anglo-eastern
related: englisch
related: britisch
preferred label: anglo-eastern @en
pref label: anglo-östlich
definition: bdk: siehe englisch
comment: Konstantinopel und Kleinasien 1905: nur englisch

anglo-eastern
type: Label
isTranslationOf: anglo-östlich
in scheme: travel!digital Thesaurus

anglo-östlich
type: Label
hasTranslation: anglo-eastern
in scheme: travel!digital Thesaurus

thessalisch
type: Concept
related match: Thessaly
definition: Duden: Thessalien, die Thessalier betreffend | [Anm.: unvollständig: Thessalien, die Thessalier betreffend; von den Thessaliern stammend, zu ihnen gehörend; in Thessalien gelegen] | Duden: Thessalien: Landschaft in Nordgriechenland | Meyers Großes Konversations-Lexikon 1909: Thessalĭen, Landschaft im nördlichen Griechenland, grenzte gegen W. an Epirus, von dem es der Pindos trennt, gegen N. an Mazedonien, gegen O. an das Ägäische Meer, gegen S. an den Pagasäischen und Malischen Meerbusen und an die Änianen und Doloper. Die Hauptgebirge sind: Olympos (2985 m), Ossa (1978 m), Pelion (Plessidi, 1618 m) im N., Othrys (1728 m) im S., Pindos (2295 m) im O. Die Gebirge im N. und S. sind leicht zu überschreiten, so daß T. wiederholt Völkerwanderungen und Eroberern zum Durchzugsland diente. Ein nur 800 m hoher Gebirgszug, die berühmten Kynoskephalä, teilt die von jenen Bergen umringte thessalische Ebene, die einst ein Binnensee gewesen ist, in zwei wohlbewässerte Hälften. Hauptfluß ist der Peneios. Der Boden war fruchtbar; besonders gab es gute Weiden, weshalb die Pferdezucht in T. zu Hause war. Die einzelnen Stadtgebiete waren in vier sogen. Tetraden verteilt. Diese waren außer Perrhäbia im N.: Hestiäotis, nebst dem Gebiete der Perrhäber, der westliche Teil des Landes mit den Städten Trikka, Gomphi, Ithome; Pelasgiotis, im O. mit Larissa, der größten Stadt des Landes, Krannon, Pherä, Skotussa; Thessaliotis, der südwestlichste Teil der thessalischen Ebene, mit Kiërion und Pharsalos, und Achaia Phthiotis, der Süden mit Larisa Kremaste und Thebä Phthiotides, wozu als fünfte Landschaft noch der Küstenstrich Magnesia mit der Stadt Demetrias kam, der ein selbständiges Gemeinwesen bildete. S. Karte »Altgriechenland«. – T. hat in der ältesten Zeit mit dem übrigen Griechenland in engerer Beziehung gestanden als zu Anfang der historischen. Die mykenische Kultur erstreckte sich bis an den Pagasäischen Meerbusen, von Jolkos fuhren die Argonauten aus, in Phthia oder Hellas wohnten die M…
in scheme: travel!digital Thesaurus
pref label: thessalisch

thessalisch
type: Label
in scheme: travel!digital Thesaurus

sächsisch
type: Concept
definition: Duden: Sachsen, die Sachsen betreffend; von den Sachsen stammend, zu ihnen gehörend | [Anm.: unvollständig: die Sachsen, die Sachsen betreffend; von den Sachsen stammend, zu ihnen gehörend; in Sachsen gelegen] | Duden: Sachsen: deutsches Bundesland | Meyers Großes Konversations-Lexikon 1909: Sachsen (hierzu Karte »Königreich Sachsen«), deutsches Königreich, hinsichtlich des Flächeninhalts der fünfte, hinsichtlich der Bevölkerung der dritte Staat des Deutschen Reiches, erstreckt sich von 50°10´-51°29´ nördl. Br. und von 11°53´-15°4´ östl. L. Mit Ausnahme einiger kleiner Parzellen von 15,26 qkm Fläche (darunter Ziegelheim und Liebschwitz mit Taubenpreskeln) bildet das Königreich ein geschlossenes Ganze, das im O. und N. von den preußischen Provinzen Schlesien und S., im W. von der Provinz S., S.-Altenburg, S.-Weimar und Reuß, im SW. von Bayern und Böhmen, im Süden und SO. von Böhmen begrenzt wird. Die Grenzlinie hat eine Länge von 1226 km, wovon 487 km zugleich Reichsgrenze sind. Die größte Längenausdehnung von W. nach O. beträgt 210, die größte Breite von N. nach Süden 150 km. | Seiner Bodengestaltung nach gehört S. fast ganz dem mitteldeutschen Berg- und Hügelland und dem ostdeutschen Gebirgsland an und greift nur in seinem nördlichen Teil in die Norddeutsche Tiefebene hinüber. Nur 0,5 Proz. der Gesamtfläche liegen tiefer als 100 m über der Ostsee, 58,5 Proz. erheben sich mehr als 250 m über dieselbe, wovon 18,1 Proz. bis 550 m, 9,1 Proz. 550–700 m und 0,3 Proz. über 700 m. S. wird durch die Elbe, deren enges Tal sich nur zwischen Pirna und Meißen erweitert (Dresdener Elbtalkessel), in zwei orographisch verschiedene Teile geschieden. Das Gebiet östlich von der Elbe zwischen Pillnitz und Riesa wird von den nordwestlichen Gliedern der Sudeten und deren Vorhöhen erfüllt. Im äußersten Südosten, um Zittau, reicht ein Teil des sächsisch-böhmischen Sandsteingebirges, das Zittauer Gebirge, herein, dessen höchste Berge, die Lausche (796 m) und der Hochwald (749 m), Phonolith…
pref label: sächsisch
related match: Saxony
in scheme: travel!digital Thesaurus

sächsisch
type: Label
in scheme: travel!digital Thesaurus

nicht-europäisch
type: Concept
pref label: nicht-europäisch
related: europäisch
in scheme: travel!digital Thesaurus
definition: bdk: siehe europäisch

nicht-europäisch
type: Label
in scheme: travel!digital Thesaurus

New Yorker
type: Concept
pref label: New Yorker
related match: New York City
related match: New York
in scheme: travel!digital Thesaurus
definition: Duden: Einwohnerbezeichnung | [Anm.: unvollständig: Einwohnerbezeichnung zu New York] | Duden: New York: Stadt in den USA | Meyers Großes Konversations-Lexikon 1908: New York (spr. njū jórk, abgekürzt N. Y.), der volkreichste und wichtigste Staat der Nordamerikanischen Union (s. die Karten »Vereinigte Staaten«), zwischen 40°35´-45° nördl. Br. und 71°51´-79°46´ westl. L., erstreckt sich vom Atlantischen Ozean nordwestwärts bis zum Eriesee, Niagara, Ontariosee und Lorenzstrom, die es von Kanada scheiden, und wird im übrigen umgrenzt von den Unionsstaaten Vermont, Massachusetts, Connecticut (im O.), New Jersey und Pennsylvanien (im S.), mit einer Fläche von 127,350 qkm. Die Seeküste, der die Insel Long Island (s. d.) vorgelagert ist, ist nur kurz, umschließt aber in der N.-Bai, die zwischen Long Island und der Landspitze Sandy Hook landein greift und sich durch die darin liegende Insel Staten Island in die Untere oder Außenbai (Lower Bay) mit der Raritanbai und die Obere oder Innenbai (Upper Bay) gliedert, den besten atlantischen Naturhafen Nordamerikas. Schon von Natur bot die Außenbai Schiffen von 8 m Tiefgang bei Sandy Hook eine 190 m breite Einfahrt, durch Ausbaggerung ist letztere aber auf 300 m verbreitert und auf 10 m vertieft worden, und ihre weitere Vertiefung auf 13 m ist im Werke. Die Innenbai ist nicht bloß durch die 1600 m breiten Narrows (»Engen«) bequem erreichbar, sondern für kleinere Schiffe auch durch den Arthur Kill und Kill van Kull (westlich und nördlich von Staten Island), und nach den Sprengungen des Hellgate für Schiffe von 8 m Tiefgang unmittelbar vom Ozean her auch durch den East River (s. d.) und Long Island-Sund, während sie mit ihren Verzweigungen und Seitenbuchten eine außerordentliche Fülle und Mannigfaltigkeit von Lösch- und Ladevorrichtungen gewährt. Sehr bedeutsam für die kulturgeographische Rolle des Staates N. ist es auch, daß mit dem Niagara (s. d.) und seinen Fällen sowohl das untere als auch das obere Niveau der Lorenzseen in sein…

New Yorker
type: Label
in scheme: travel!digital Thesaurus

Damascenerin
type: Concept
related: Damaszener
in scheme: travel!digital Thesaurus
pref label: Damascenerin
definition: Duden: Damaszenerin: weibliche Form zu Damaszener

Damaszener
type: Concept
related match: Damascus
definition: Duden: Einwohnerbezeichnung zu Damaskus | Duden: Damaskus: Hauptstadt von Syrien | Meyers Großes Konversations-Lexikon 1906: Damaskus (arab. esch Scham, auch Dimischk), Hauptstadt der asiatisch-türk. Provinz Syrien, fünftgrößte Stadt des osmanischen Reiches, in entzückender Lage am östlichen Fuß des Antilibanon, 690 m ü. M., in weiter, fruchtbarer Ebene (El Ghuta, mit 134 Dörfern), die von den Orientalen als das schönste der vier irdischen Paradiese gepriesen wird. Der Barada (Chrysorrhoas) durchströmt in mehreren Armen die Stadt, bewässert die stundenweit ausgedehnten Gärten und Felder und verliert sich endlich gegen O. hin in Sümpfen. Die von alten Mauern mit Türmen und Gräben umgebene Stadt hat neun Tore und krumme, staubige, unsaubere Straßen. Die schnurgerade, 1,6 km lange Hauptstraße soll dieselbe sein, die in der Apostelgeschichte (9,11) als die »gerade« erwähnt wird. Im übrigen hat D. trotz seines hohen Alters nur wenig Altertümer aufzuweisen. Unter den zahlreichen Moscheen (angeblich 248) ist die berühmteste die Moschee der Omaijaden oder die Große Moschee, ursprünglich eine Kirche des heil. Johannes, die an der Stelle eines heidnischen Tempels errichtet und später von Welid (705–715), dem sechsten Kalifen des Hauses der Omaijaden, in das jetzige, durch seine Pracht und Schönheit ausgezeichnete Wunderwerk arabischer Baukunst umgewandelt wurde. Von den drei Minarets genießt »Mâdinet'-Isâ« besondere Verehrung wegen der Sage, daß am Jüngsten Tage Jesus sich auf dieses Minaret vom Himmel herablassen werde. Das größte Heiligtum der Moschee ist die Kapelle, wo das Haupt Johannis des Täufers ruhen soll, obschon es zur Zeit des byzantinischen Reiches nach Konstantinopel gebracht wurde. An nichtmohammedanischen Gotteshäusern besitzt D. 14 Synagogen, je eine griechische, maronitische, syrische und armenische Kirche, dazu 3 römisch-katholische Klöster. Merkwürdig ist die umfangreiche, 1219 erbaute Zitadelle im NW. der Stadt. Die Basare von D. (über 30 an der Zahl), di…
pref label: Damaszener
in scheme: travel!digital Thesaurus
alt label: Damascener
alternative label: Damascener

Damaszener
type: Label
in scheme: travel!digital Thesaurus
hasVariant: Damascener

Damascener
type: Label
in scheme: travel!digital Thesaurus
isVariantOf: Damaszener

Damascenerin
type: Label
in scheme: travel!digital Thesaurus

neuenglisch
type: Concept
pref label: neuenglisch
in scheme: travel!digital Thesaurus
definition: bdk: Neuengland, die Einwohner von Neuengland betreffend; von den Einwohnern von Neuengland stammend, zu ihnen gehörend; in Neuengland gelegen | Duden: Neuengland: Gebiet im Nordosten der USA | Meyers Großes Konversations-Lexikon 1908: Neuengland (engl. New England), der nordöstliche Teil der nordamerikan. Union, umfaßt die sechs Staaten Maine, New Hampshire, Vermont, Massachusetts, Rhode-Island und Connecticut, zusammen 163,805 qkm mit (1900) 5,592,017 Einw. (34,1 auf 1 qkm). Den wichtigsten Bevölkerungsbestandteil bilden die Nachkommen englischer Puritaner und Schotten, die sich noch jetzt durch ihre Frömmigkeit, aber auch durch kühnen Unternehmungsgeist auszeichnen. Ihnen allein gebührt der Spitzname Yankee (s. d.). Daneben sind später die Iren stark in den Vordergrund getreten; 1900 zählte man 387,570 in Irland Geborne. In wirtschaftlicher Hinsicht ragt N. hervor durch seine Forstproduktion (1900: 37,417,971 Doll.), durch seine Küsten- und Hochseefischerei (1902 mit 1479 Schiffen, 11,021 Booten und 38,879 Mann, 4,284,725 Doll. Fangwert), durch seine von den reichen Wasserkräften geförderte großartige Industrie (1900 mit 947,645 Arbeitern und 1875: 792,081 Doll. Produktionswert) und durch seine rege Anteilnahme am Handel und Schiffsverkehr, besonders von seinem Haupt ha sen Boston aus. Das Gebiet wurde 1606 von Jakob I. der Plymouthgesellschaft verliehen. Vgl. Talvj, Geschichte der Kolonisation von N. (Leipz. 1847); Palfrey, History of New England (Bost. 1859–90, 5 Bde.); Weeden, Economic and social history of New England, 1620–1789 (das. 1890, 2 Bde.); Powell, Historic towns of New England (New York 1898); C. Johnston, New England and its neighbours (Lond. 1902). | Quelle: Meyers Großes Konversations-Lexikon, Band 14. Leipzig 1908, S. 547. | Permalink: http://www.zeno.org/nid/20007147384
related match: New England

neuenglisch
type: Label
in scheme: travel!digital Thesaurus

pilsener
type: Concept
alternative label: pilsner
related match: Plzeň
alt label: pilsner
in scheme: travel!digital Thesaurus
pref label: pilsener
definition: bdk: Pilsen, die Pilsener betreffend; von den Pilsenern stammend, zu ihnen gehörend; in Pilsen gelegen | Duden: Pilsen Stadt in der heutigen Tschechischen Republik | Meyers Großes Konversations-Lexikon 1908: Pilsen (tschech. Plzen), Stadt in Böhmen, nächst Prag die größte Stadt des Landes, 320 m ü. M., an der Mies, die hier die Radbusa (mit der Angel) und die Uslawa aufnimmt und von da an Beraun heißt, Knotenpunkt der Staatsbahnlinien Wien-Gmünd-Eger, Prag-P.-Furth im Wald und Dux-P.-Eisenstein, besteht aus der eigentlichen, regelmäßig angelegten Stadt und den von derselben durch Anlagen geschiedenen Vorstädten, hat hübsche Straßen und Plätze, ein Denkmal des Bürgermeisters Martin Kopetzky (gest. 1854), eine frühgotische Erzdechanteikirche (1292) mit 102 m hohem Turm, ein Franziskanerkloster mit gotischer St. Barbarakapelle (Fresken aus dem 15. Jahrh.), eine evang. Kirche und eine Synagoge, ein Rathaus mit dem Bankettsaal, wo 1634 die Generale Wallenstein den Eid der Treue leisteten (»Pilsener Revers«), ein deutsches und ein neues tschechisches Theater u. zählt 1900 (mit Einschluß von 2259 Mann Militär) 68,079 Einw. (größtenteils Tschechen, 9174 Deutsche, der Religion nach meist Katholiken, 3293 Juden). Die Stadt enthält an Fabrikunternehmungen: mehrere Bauschlossereien und Bautischlereien, 3 Maschinenfabriken, 2 Drahtstiftefabriken, 2 Emailgeschirrfabriken, 3 Metallwarenfabriken, eine große Fabrik zur Erzeugung von Gußstahl, Schiffsbestandteilen, Geschützen und Munition (Aktiengesellschaft Skodawerke), eine Glockengießerei, eine Fabrik für englische Ketten, 2 Eisenmöbelfabriken, eine Wagenfabrik, eine Granit- und Marmorschleiferei, 2 Mühlsteinfabriken, eine Zementwaren-, eine Porzellan- und eine Glasfabrik, 2 Ofen- und Tonwarenfabriken, 4 Dampfmühlen und 2 Dampfbrotbäckereien, 2 Kanditenfabriken, eine Kaffeesurrogatfabrik, eine Sodawasserfabrik, 3 große Bierbrauereien (das bürgerliche Bräuhaus der brauberechtigten Bürgerschaft,[879] die Aktienbrauerei und die Genos…

pilsner
type: Label
isVariantOf: pilsener
in scheme: travel!digital Thesaurus

pilsener
type: Label
hasVariant: pilsner
in scheme: travel!digital Thesaurus

meeruter
type: Concept
related match: Meerut
definition: bdk: Meerut, die Einwohner von Meerut betreffend; von den Einwohnern von Meerut stammend, zu ihnen gehörend; in Meerut gelegen | Meyers Großes Konversations-Lexikon 1908: Mirat (Meerut), Division der britisch-indischen Nordwestprovinzen, 29,315 qkm groß, zwischen den Flüssen Ganges und Dschamna, ein Teil des Doab (s. d.), reicht im N. bis in den Himalaja, im S. bis gegen Agra, einer der fruchtbarsten (Weizen, Reis, Indigo, Zucker, Baumwolle) und im südlichen Teil auch bevölkertsten Landstriche Indiens, durchzogen vom Eastern Jumna- und Gangeskanal. – Die Stadt M., 265 m ü. M., hat einige schöne Gebäude von der mohammedanischen Herrschaft her, eine stattliche anglikanische Kirche, eine kath. Kirche und mit der Garnison (1901) 118,129 Einw. (62,007 Hindu, 50,317 Mohammedaner und 624 Christen), lebhaften Handel und eine große Messe. – M. wurde wiederholt zerstört, so 1017 durch Mahmud von Ghazni, 1399 durch Timur. 1857 im Aufstande der Sipahi revoltierte hier zuerst die indische Besatzung. | Quelle: Meyers Großes Konversations-Lexikon, Band 13. Leipzig 1908, S. 890. | Permalink: http://www.zeno.org/nid/20007094574
in scheme: travel!digital Thesaurus
pref label: meeruter

meeruter
type: Label
in scheme: travel!digital Thesaurus

eleusinisch
type: Concept
related match: Eleusis
in scheme: travel!digital Thesaurus
pref label: eleusinisch
definition: Duden: aus Eleusis stammend | bdk: Eleusis, die die Einwohner von Eleusis betreffend; von den Einwohnern von Eleusis stammend, zu ihnen gehörend; in Eleusis gelegen | Duden: Eleusis: altgriechischer Ort | Meyers Großes Konversations-Lexikon 1906: Eleusis, nächst Athen der wichtigste Ort des alten Attika, an der Nordküste des gleichnamigen Golfs, ist jetzt ein Dorf, Station der Eisenbahn Athen-Olympia,[702] das außer Trümmerhaufen nur den Namen (Levsina) von seiner Herrlichkeit bewahrt hat (s. Karte »Umgebung von Athen«). In ältern Zeiten war E. Hauptort eines kleinen Königreichs, ward aber unter Eumolpos von den Athenern unterworfen. Demeter und Persephone (Kora) hatten an dem die Stadt beherrschenden Burghügel ihren berühmten Mysterientempel, der zwar von den Persern zerstört, aber durch Perikles nach den Plänen des Iktinos prächtiger und größer, mit 54 m Grundfläche, wieder aufgebaut, um 311 v. Chr. vollendet wurde. Zuletzt wurde er von Alarich zerstört. 1882–87 ließ die Griechische Archäologische Gesellschaft die Stätte ausgraben, wobei auch Reste dreier älterer und eines jüngern Demetertempels, ein Buleuterion, ein kleines Plutonion u.a.m. gefunden wurden (vgl. D. Philios, E. et ses mystères, mit Plan). Nördlich von diesem Tempel, zu dem zwei Propyläen führten, stand ein zweiter der Artemis Propyläa; daneben entsprang die Quelle Kallichoros, in deren Umgebung nach attischer Sage das erste Getreide gewachsen war. – Die hier gefeierten Eleusinischen Mysterien galten als die ältesten und ehrwürdigsten nicht nur der gleichnamigen, sondern aller Mysterien überhaupt. Sie bezogen sich auf die drei chthonischen Gottheiten Demeter, Kore-Persephone und Jakchos-Dionysos. Ihre Gründung führt man auf Demeter (s. d.) selbst zurück, den Ritus auf Eumolpos (s. d.). Bei seinen Nachkommen, den Eumolpiden, und in der Familie der Keryken (s. Keryx) waren die Hauptämter erblich: jenen gehörte der Oberpriester, der Hierophant (s. d.), an, diesen der Hierokeryx (heilige Herold); andre…

eleusinisch
type: Label
in scheme: travel!digital Thesaurus

Moghrebiner
type: Concept
pref label: Moghrebiner
in scheme: travel!digital Thesaurus
definition: Duden: Maghrebiner: Bewohner des Maghreb | Duden: Maghreb: Tunesien, Nordalgerien und Marokko umfassender westlicher Teil der arabischen Welt
related match: Maghreb

Moghrebiner
type: Label
in scheme: travel!digital Thesaurus

siebenbürgisch
type: Concept
alternative label: siebenbürger
related match: Transylvania
definition: Duden: Siebenbürgen, die Siebenbürger betreffend; von den Siebenbürgern stammend, zu ihnen gehörend | [Anm.: unvollständig: Siebenbürgen, die Siebenbürger betreffend; von den Siebenbürgern stammend, zu ihnen gehörend; in Siebenbürgen gelegen]| Duden: Siebenbürgen: Gebiet in Rumänien | Meyers Großes Konversations-Lexikon 1909: Siebenbürgen (magyar. Erdély, »Waldland«, rumän. Ardealu, lat. Transsilvania), das Gebiet des ehemaligen Großfürstentums S., das Land »jenseit des Königsteiges« (Királyhágó, s. d.), das seit 1867 vollständig mit Ungarn vereinigt (s. Karte »Ungarn«) ist und die östlich von den Komitaten Krassó-Szörény, Arad, Bihar und Szilágy sowie südlich von Szatmár und der Máramaros liegenden 15 ungarischen Komitate (s. unten) umfaßt, grenzt im O. an die Bukowina, im O. und Süden an Rumänien und hat einen Flächenraum von 57,244 qkm (1039,6 QM.). S. ist ein zu dem Gebirgssystem der Karpathen gehöriges Hochland, das von Randgebirgen in beinahe quadratischer Form wallförmig umgeben ist (s. Karpathen). Der höchste Gipfel Siebenbürgens ist der Negoi (2536 m). Nach innen entsenden die Randgebirge zahlreiche und vielverzweigte Bergreihen mit meist engen und kurzen Tälern, und nur die Täler der Hauptflüsse erweitern sich stellenweise beckenartig; so im obern und mittlern Lauf der Maros, wie z. B. bei Maros-Vásárhely und das schöne Hátszeger Tal (500 m ü. M.), die fruchtbaren Ebenen bei Hermannstadt, des Alt bei Csikszereda, Kronstadt und von Reps bis zum Rotenturmpaß, das prächtige Burzenland (s. d.) und das Szamostal bei Bistritz und Deés. Die tiefsten Punkte (im westlichen Marostal) haben noch immer eine Seehöhe von über 160 m. Charakteristisch sind die ungeheuern Spalten, welche die Berge mitunter senkrecht teilen (Tordaer Spalte). Fast völlig in der Mitte des Landes liegt die Mezöség (Siebenbürgische Heide, rumän. Kimpia), ein etwa 6000 qkm großes, fruchtbares Hügelland von 90 km Lange und 75 km Breite. Hauptfluß ist die das Land in einem Bogen durchströmende Mar…
in scheme: travel!digital Thesaurus
pref label: siebenbürgisch
alt label: siebenbürger

siebenbürgisch
type: Label
hasVariant: siebenbürger
in scheme: travel!digital Thesaurus

siebenbürger
type: Label
isVariantOf: siebenbürgisch
in scheme: travel!digital Thesaurus

Andalusier
type: Concept
pref label: Andalusier
definition: Duden: Einwohnerbezeichnung | [Anm.: unvollständig: Einwohnerbezeichnung zu Andalusien] | Duden: Andalusien: Region in Spanien | Meyers Großes Konversations-Lexikon 1905: Andalusien (span. Andalucia), span. Landschaft, welche die vier ehemaligen maurischen Königreiche von Granada, Jaen, Cordoba und Sevilla umfaßt und somit den südlichsten Teil der Halbinsel bildet, 87,570 qkm (1590 QM.) groß mit (1900) 3,562,606 Einw. A., das Vandalitia oder Vandalusia zur Zeit der Vandalenherrschaft, grenzt im N. an Estremadura und Neukastilien, im S. an das Atlantische und das Mittelländische Meer, im O. an Murcia, im W. an Portugal und zerfällt gegenwärtig in die acht Provinzen: Cordoba, Cadiz, Huelva, Sevilla, Jaen, Malaga, Granada und Almeria (Genaueres s. unter den einzelnen Provinzen). Der Andalusier ist von schöner Körpergestalt, lebhaft und heiter, vergnügungssüchtig, leichtsinnig, aber ehrlich und edel, redselig, voll Verstand und Gewandtheit in der Auffassung, stolz auf sein Land und poetisch begabt, aber arbeitsscheu, dabei genügsam, gastfrei und gefällig, aber auch jähzornig, keck und streitsüchtig, ein Freund des Messers und des Revolvers, wenn auch öfter nur ein prahlerischer Zungenheld. Eine kurze Samtjacke, oben eng anliegende Beinkleider, weiße Strümpfe, ein schneeweißes Hemd mit Krause und offenem Kragen, ein breitrandiger, flacher, steifer Filzhut und gelbe Schuhe bilden die Tracht des echten Andalusiers. Die Frauen, von einer unnachahmlichen Grazie und mit vielem Mutterwitz begabt, sind zwar nicht die schönsten Spanierinnen, aber doch die interessantesten. Am Südabhang der Sierra Nevada (Alpujarras) leben noch reine Nachkommen der Mauren. Viele Tausende von teils ansässigen, teils nomadisierenden Zigeunern (Gitanos) sind über ganz A. verstreut. | In den ältesten Zeiten wurde A. von den Turtern bewohnt, die Gewerbe trieben und einige Kultur besaßen, dabei sanft und friedliebend, aber auch weichlich waren und keinem Eroberer widerstanden, und hieß Bätica (nach dem…
pref label: andaluz
preferred label: andaluz @es
in scheme: travel!digital Thesaurus
preferred label: andalûsi @ar
related match: Andalusia
pref label: andalûsi

Andalusier
type: Label
hasTranslation: andaluz
in scheme: travel!digital Thesaurus
hasTranslation: andalûsi

andaluz
type: Label
isTranslationOf: Andalusier
in scheme: travel!digital Thesaurus
hasTranslation: andalûsi

andalûsi
type: Label
isTranslationOf: Andalusier
in scheme: travel!digital Thesaurus
hasTranslation: andaluz

helwâner
type: Concept
related match: Helwan
pref label: helwâner
in scheme: travel!digital Thesaurus
definition: bdk: Heluan, die Einwohner von Heluan betreffend; von den Einwohnern von Heluan stammend, zu ihnen gehörend; in Heluan gelegen | Meyers Großes Konversations-Lexikon 1907: Heluan, Bade- und Luftkurort im Distrikt Badraschein der ägypt. Provinz (Mudirieh) Gizeh, 23 km südlich von Kairo (s. Karte »Umgebung von Kairo«), mit dem es Bahnverbindung hat, liegt 5 km östlich vom Nil auf einem Plateau der Arabischen Wüste, dessen Quellen (Schwefelsalzthermen von 30°, mit Chlornatrium, Chlormagnesium etc.) vielleicht schon von den alten Ägyptern, sicher aber unter arabischer Herrschaft benutzt und 1871–72 gefaßt wurden. H. hat ein über den Quellen errichtetes Badehaus mit Inhalationssaal, Trinkquelle, Wüstensandbäder, ein großes Hotel, Villen und Gartenanlagen. Vgl. Heltzel, Les eaux d'Hélouan (1888); Fényes, Der Winterkurort und Schwefelthermen in H. (Kairo 1895); Schweinfurth, Die Umgegend von H. als Beispiel der Wüsten-Denudation (Karte 1: 30,000, Berl. 1897); May, Helwân and the Egyptian desert (Lond. 1901); »Meyers Reisebücher: Ägypten« (4. Aufl., Leipz. 1904). | Quelle: Meyers Großes Konversations-Lexikon, Band 9. Leipzig 1907, S. 159. | Permalink: http://www.zeno.org/nid/20006761089

helwâner
type: Label
in scheme: travel!digital Thesaurus

Syrakusaner
type: Concept
related match: Syracuse, Sicily
pref label: Syrakusaner
in scheme: travel!digital Thesaurus
definition: Duden: Syrakuser: Einwohnerbezeichnung | [Anm.: unvollständig: Einwohnerbezeichnung zu Syrakus] | Duden: Syrakus: Stadt auf Sizilien | Meyers Großes Konversations-Lexikon 1909: Syrakūs (Siracusa), Hauptstadt der gleichnamigen ital. Provinz (s. oben), liegt auf der mit dem Festlande durch einen Damm verbundenen Insel Ortygia, an der Eisenbahnlinie Catania-S.-Licata, ist durch Mauern und Gräben und durch ein Kastell (11.–13. Jahrh.) befestigt und hat einen Umfang von 4 km (gegen 33 km Umfang des antiken S.). Der große Hafen (Porto Grande) umfaßt die Bucht zwischen der Insel Ortygia und dem Vorgebirge Plemmyrion (Massolivieri) und nimmt den Fluß Anapo auf. Er hat eine Fläche von 232 Hektar, ist bei einer Tiefe von 10–20 m für die Aufnahme der größten Flotte geeignet und durch zwei Leuchttürme bezeichnet. Der kleine Hafen (Porto Piccolo) im N. hat eine Wassertiefe von nur 2–3 m. Das Klima von S. ist sehr günstig, namentlich für an den Respirationsorganen Leidende; die mittlere Jahrestemperatur beträgt 18,2, im Januar 11,3, im Juli 26°, die jährliche Regenmenge (an 57 Tagen) nur 412 mm. Unter den Bauten der Stadt sind hervorzuheben: das Kastell Maniace (13. Jahrh.), der Dom Santa Maria del Piliero (in die Säulen eines dorischen Tempels der Minerva eingebaut), mehrere Kirchen des 15. Jahrh., der erzbischöfliche Palast (16. Jahrh.), der Palazzo Communale (17. Jahrh.), der Neubau des Museums, das schöne Theater und mehrere mittelalterliche Privatpaläste. S. hat ein Lyzeum, Gymnasium, Technisches Institut, eine Technische und eine Kunstgewerbeschule, Seminar, archäologisches Museum (mit zahlreichen Skulpturen, darunter eine Statue der Venus und ein kolossaler Kopf des Neptun, ferner Vasen, keramische Gegenstände, Inschriften, Münzen etc.), Bibliothek (12,000 Bände), Filiale der Nationalbank, mehrere selbständige Banken, Handelskammer, Fabrikation von Tonwaren, Essenzen, Öl, Teigwaren, Konserven und Seilerwaren, Steinbrüche, lebhaften Handel (besonders mit Öl, Wein, Südfrücht…

Syrakusaner
type: Label
in scheme: travel!digital Thesaurus

Abendländer
type: Concept
definition: Duden: Vertreter der abendländischen Kultur | Duden: Abendland: durch Antike und Christentum geformte kulturelle Einheit der europäischen Völker; Europa; Alte Welt; Okzident | Meyers Großes Konversations-Lexikon 1908: Okzident (lat. Occidens), zunächst die Himmelsgegend, wo die Sonne scheinbar untergeht, der Westen oder Abend; dann soviel wie Abendland, d.h. die zum weströmischen Reich oder abendländischen Kaisertum gehörigen Länder im Gegensatz zum oströmischen oder morgenländischen (byzantinischen) Kaisertum. Zur Zeit der Kreuzzüge verstand man unter O. oder Abendland das ganze zum Kampf gegen den von Osten her vordringenden Islam vereinigte Europa. Jetzt versteht man darunter alle europäischen Länder (gelegentlich auch Amerika) im Gegensatz zum Orient (s. d.). | Quelle: Meyers Großes Konversations-Lexikon, Band 15. Leipzig 1908, S. 19. | Permalink: http://www.zeno.org/nid/2000718008X
pref label: Abendländer
in scheme: travel!digital Thesaurus

Abendländer
type: Label
in scheme: travel!digital Thesaurus

memphitisch
type: Concept
definition: bdk: Memphis, die Einwohner von Memphis betreffend; von den Einwohnern von Memphis stammend, zu ihnen gehörend; in Memphis gelegen | Duden: Memphis: altägyptische Stadt westlich des Nils | Meyers Großes Konversations-Lexikon 1908: Memphis (in der Bibel Noph oder Moph), im alten Reiche die Hauptstadt von Ägypten, auf dem westlichen Nilufer, bei den heutigen Dörfern Mitrahine und Sakkâra, 18 km südlich von Kairo (s. Karte »Umgebung von Kairo«). Die Gründung von M. wird auf Menes (vgl. Ägypten, S. 195), den ersten König der 1. Dynastie, zurückgeführt. Menes ließ den Nil, der am Felsenrande der Libyschen Wüste hinfloß, nach O. hin in sein jetziges Bett leiten und erbaute auf dem so gewonnenen Platz die Stadt; derselbe soll hier auch den berühmten Tempel des Weltengottes Ptah gegründet haben, nach dem sie auch den Namen Het-ke-Ptah (»Haus des Geistes des Ptah«) führte, und sie mit einer kolossalen Mauer umgeben haben. Ansehnliche Trümmer bezeichnen noch heute die Stätte des Tempels. In Wirklichkeit hat im alten Reiche die Stätte der Königsresidenz vielfach gewechselt und hat an verschiedenen Stellen des westlichen Nilufers gegenüber von Kairo gelegen. M. ist genauer genommen erst unter den Königen der 6. Dynastie zur Hauptstadt geworden und führt seinen Namen nach der Pyramide des Königs Phiops 1. (Pepi), die Pepi men-neser (d. h. »Pepij bleibt schön«) hieß. Letzteres ist Men-neser abgekürzt worden, woraus Mense und das griechische Memphis entstanden ist. Seit dem alten Reiche war M. eine der volkreichsten Städte Ägyptens und behielt seine Bedeutung auch noch, als nach Vertreibung der Hyksos die Residenz nach Theben verlegt wurde. 525 erstürmte Kambyses die Stadt, die drei Jahrhunderte später durch die Gründung Alexandrias den Todesstoß erhielt. Die Bevölkerung schwand, nur die Gebäude blieben übrig, doch konnten noch Diodor und Strabon die Ausdehnung und Pracht von M. bewundern. Jetzt ist die alte Stadt bis auf unförmliche Schutthügel, einzelne kolossale Skulpturreste u…
related match: Memphis, Egypt
in scheme: travel!digital Thesaurus
pref label: memphitisch

memphitisch
type: Label
in scheme: travel!digital Thesaurus

Smyrnioten
type: Concept
related match: İzmir
pref label: Smyrnioten
in scheme: travel!digital Thesaurus
definition: bdk: Einwohnerbezeichnung zu Smyrna | Duden: Izmir: türkische Stadt, heutiger Name von Smyrna | Meyers Großes Konversations-Lexikon 1909: Smyrna (türk. Ismir), Hauptstadt des asiatisch-türk. Wilajets Aidin (s. d.), wichtigster Handelsplatz Kleinasiens, liegt im Hintergrunde des 70 km weit eindringenden gleichnamigen Meerbusens (s. das Nebenkärtchen auf der Karte »Kleinasien«), einer Bucht des Ägäischen Meeres, amphitheatralisch um den 150 m hohen Berg Pagos, der die Überreste eines mittelalterlichen Schlosses trägt. Die Stadt entspricht im Innern wenig dem imposanten Anblick, den sie mit ihren über 4 km langen, neuen Kais (Marina) von außen gewährt; an hervorragenden Bauwerken besitzt sie nichts. Außer dem ausschließlich von Christen bewohnten Frankenviertel, dem schönsten Teil von S., im N., umfaßt die untere Stadt (nördlich am Meer) noch das Griechen- und Armenierviertel, während die obere Stadt nur das Türkenviertel, enge, abschüssige Gassen und Gäßchen mit elenden, meist hölzernen Häusern, enthält. Zwischen beiden liegt das schlecht gebaute Judenviertel. S. ist der Sitz des Generalgouverneurs der Provinz, eines katholischen, griechischen und eines armenischen Erzbischofs, der Konsuln der europäischen Staaten (darunter eines deutschen Generalkonsuls) und der Vereinigten Staaten von Amerika, eines Handelsgerichts und einer Bank (Kaiserlich Ottomanische Bank) mit mehreren Filialen im Innern Anatoliens. [...] | Quelle: Meyers Großes Konversations-Lexikon, Band 18. Leipzig 1909, S. 555-556. | Permalink: http://www.zeno.org/nid/2000748691X

Smyrnioten
type: Label
in scheme: travel!digital Thesaurus

New Havener
type: Concept
related match: New Haven, Connecticut
pref label: New Havener
in scheme: travel!digital Thesaurus
definition: bdk: New Haven, die New Havener betreffend; von den New Havenern stammend, zu ihnen gehörend; in New Haven gelegen | Brockhaus' Kleines Konversations-Lexikon 1911: New Haven (spr. njuh héhw'n), Hafenstadt im nordamerik. Staate Connecticut, 6 km vom Long-Island-Sund, (1903) 114.600 E.; Yale-Universität. | Quelle: Brockhaus' Kleines Konversations-Lexikon, fünfte Auflage, Band 2. Leipzig 1911., S. 265. | Permalink: http://www.zeno.org/nid/20001390066

New Havener
type: Label
in scheme: travel!digital Thesaurus

südkarolinisch
type: Concept
related: Carolinier
in scheme: travel!digital Thesaurus
pref label: südkarolinisch
definition: bdk: Carolina, die Karolinier betreffend; von den Karoliniern stammend, zu ihnen gehörend; in Carolina gelegen

Carolinier
type: Concept
in scheme: travel!digital Thesaurus
pref label: Carolinier
definition: bdk: Einwohnerbezeichung zu Carolina | Meyers Großes Konversations-Lexikon 1905: Carolīna, Landschaft im östlichen Teil der Vereinigten Staaten von Nordamerika, wurde schon 1497 von Sebastian Cabot entdeckt, aber erst 1512 von dem spanischen Statthalter Ponce de Leon im Namen Kaiser Karls V. als Teil von Florida in Besitz genommen. Nachdem mehrere Kolonisationsversuche der Spanier mißlungen waren, setzten sich die Franzosen 1562 daselbst fest und nannten es zu Ehren[773] ihres Königs Karl IX. C., wurden indessen von den Spaniern bald wieder vertrieben, worauf das Land ohne Niederlassung blieb, bis König Karl II. von England 24. März 1660 alles Land zwischen 34 und 36° nördl. Br. an acht Briten verlieh. Diese führten nun Pflanzer aus Virginia dahin und gründeten den Ort Albemarle. 1729 nahm die britische Regierung ihr Verleihungspatent gegen Zahlung einer Entschädigung von 17,500 Pfd. Sterl. zurück und teilte das Land in zwei Kolonien, Nord- und Südcarolina. Volksmenge und Wohlstand nahmen hier so zu, daß beide Kolonien 1769 sich unter den ersten mit gegen die Regierung des Mutterlandes auflehnen und nach dem Siege der Revolution als besondere Staaten in die Union eintreten konnten. S. Nordcarolina und Südcarolina. | Quelle: Meyers Großes Konversations-Lexikon, Band 3. Leipzig 1905, S. 773-774. | Permalink: http://www.zeno.org/nid/2000639969X
related match: Province of Carolina

Carolinier
type: Label
in scheme: travel!digital Thesaurus

südkarolinisch
type: Label
in scheme: travel!digital Thesaurus

mykenisch
type: Concept
related match: Mycenae
definition: Duden: die griechische Kunst, Kultur, Sprache der Bronzezeit betreffend, zu ihr gehörend | Duden: Mykene: griechischer Ort und antike Ruinenstätte | bdk: Mykene, die Einwohner von Mykene betreffend; von den Einwohnern von Mykene stammend, zu ihnen gehörend; in Mykene gelegen | Meyers Großes Konversations-Lexikon 1908: Mykēnä, uralte Stadt im innersten, nördlichsten Winkel der Ebene von Argos, angeblich von Perseus erbaut, in frühester Zeit als Residenz des Agamemnon zugleich Hauptstadt eines kleinen achäischen Reiches. Obgleich stark befestigt, wurde sie doch 463 v. Chr. von den Argeiern erobert und zerstört. – Ruinen der Stadt bei dem Dorfe Charvati, unfern von Argos, Reste der kyklopischen Ringmauer mit dem berühmten Löwentor (s. Tafel »Bildhauerkunst II«, Fig. 8, und Tafel »Architektur III«, Fig. 2 u. 3) und ein unterirdisches Kuppelgebäude von bienenkorbähnlicher Form, das ursprünglich für eine Schatzkammer gehalten wurde (»Schatzhaus des Atreus«), in Wahrheit aber ein Grabgewölbe ist, waren schon seit der wissenschaftlichen Expedition der Franzosen nach dem Peloponnes (1822) genauer bekannt. Doch haben erst die 1876 und 1877 von Schliemann veranstalteten und in spätern Jahren von der Archäologischen Gesellschaft in Athen fortgesetzten Ausgrabungen eine genügende Anschauung von der alten Königsburg und den zu ihr gehörigen Bauanlagen (Gräbern etc.) ermöglicht (s. den Plan). Die Entdeckungen bestehen in der Ausgrabung mehrerer Kuppelgräber, von Massengräbern, Mauern etc. und in einer großen Zahl von Architekturfragmenten, Grabstelen, Terrakotten, Tongefäßen, goldenen Masken (Abbildungen bei Artikel »Maske«), Ringen mit geschnittenen Steinen (s. Tafel »Ringe«, Fig. 5), Schmucksachen aus Goldblech, die in den Gräbern gefunden worden sind. [...] | Quelle: Meyers Großes Konversations-Lexikon, Band 14. Leipzig 1908, S. 338. | Permalink: http://www.zeno.org/nid/20007126484
in scheme: travel!digital Thesaurus
pref label: mykenisch

mykenisch
type: Label
in scheme: travel!digital Thesaurus

pester
type: Concept
related match: Pest, Hungary
related: Budapester
definition: bdk: den Stadtteil Pest in Budapest betreffend | Meyers Großes Konversations-Lexikon 1908: Pest, 1) Hauptstadt, s. Budapest. Der am linken Donauufer liegende IV. X. Bezirk der ungarischen Hauptstadt Budapest bildete bis 1872 eine selbständige Stadtgemeinde. Ihr Ursprung reicht bis in die Zeiten vor der Landeseroberung zurück. Der Name wird vom slawischen peć (Kalkofen) hergeleitet. Bis zum 12. Jahrh. war P. eine meist von Deutschen bewohnte Gemeinde, die 1241 von den Mongolen verwüstet wurde. Da Béla IV. sich Ofen als Residenz erwählte, blieb P. in der Entwickelung zurück und erhielt erst unter Matthias Corvinus Mauern. Nach 1526 wurde es öfter von den Türken heimgesucht und bei der Rückeroberung Ofens 1686 fast gänzlich zerstört, schwang sich aber wieder empor, erhielt 1694 das Marktrecht und wurde 1703 zur königlichen Freistadt erhoben. Seit 1867 begann es sich schneller zu entwickeln und wurde 1872 mit Ofen u. Altofen vereinigt. Weiteres s. unter Budapest. – 2) Kis-P., s. Klein-Pest. – 3) Uj-P., s. Neu-Pest. | Quelle: Meyers Großes Konversations-Lexikon, Band 15. Leipzig 1908, S. 646. | Permalink: http://www.zeno.org/nid/2000723693X
in scheme: travel!digital Thesaurus
pref label: pester

pester
type: Label
in scheme: travel!digital Thesaurus

odessaer
type: Concept
definition: bdk: Odessa, die Odessaer betreffend; von den Odessaern stammend, zu ihnen gehörend; in Odessa gelegen
in scheme: travel!digital Thesaurus
related: Odessaer
pref label: odessaer

odessaer
type: Label
in scheme: travel!digital Thesaurus

Phanariotenfamilie
type: Concept
related match: Phanariotes
definition: bdk: Bewohner des istanbuler/konstantinopler Stadtviertes Phanar griechischer Herkunft | Meyers Großes Konversations-Lexikon 1906: Fanar (Fanal), eins der Reviere (Mahalles) von Konstantinopel, am Goldenen Horn, im NW. der Stadt, nach einem Fanal oder Leuchtturm benannt, mit dem griechischen Patriarchat und der großen griechischen Nationalschule. Der F. ist meist von Griechen (Fanarioten) bewohnt, früher besonders von den altadligen Familien, die ihren Ursprung auf die Kaiserzeit zurückführen, wie die Maurokordatos, Monesis, Ypsilantis etc. Als unter Murad III. (1574 bis 1595) der griechische Patriarch sich im F. in einem alten Frauenkloster niederlassen mußte, siedelten sich die Reste der alten griechischen Aristokratie hier an. Die Familienhäupter nannten sich Fürsten; ihre Gemahlinnen führten den Titel Domna und ihre Töchter Domnizza. Bei dem Mißtrauen der Pforte konnten sie lange keinen politischen Einfluß erlangen, bis es endlich seit 1669 üblich wurde, die Dragomane der Pforte aus den Fanarioten zu wählen. Und seit 1731 wurden sogar die Hospodare der Moldau und Walachei aus den genannten adligen Häusern genommen. Andre fanariotische Familien kamen durch Geldgeschäfte in die Höhe. Der Aufstand der Griechen (1821) wurde von den Fanarioten nicht eben mit Begeisterung begrüßt; dennoch mußten sie schrecklich büßen, und manche Geschlechter der Fanarioten wurden fast ganz ausgerottet. Vgl. Zallony, Essai sur les Fanariotes (2. Aufl., Marseille 1830). | Quelle: Meyers Großes Konversations-Lexikon, Band 6. Leipzig 1906, S. 309. | Permalink: http://www.zeno.org/nid/20006589111
in scheme: travel!digital Thesaurus
pref label: Phanariotenfamilie

Phanariotenfamilie
type: Label
in scheme: travel!digital Thesaurus

kölnisch
type: Concept
alternative label: kölner
related match: Cologne
definition: Duden: aus Köln stammend; zu Köln gehörend | [Anm.: unvollständig: Köln, die Einwohner von Köln betreffend; von den Einwohnern von Köln stammend, zu ihnen gehörend; in Köln gelegen] | Duden: Köln: Stadt am Rhein | Meyers Großes Konversations-Lexikon 1907: Köln, ehemals deutsches Erzstift und Kurfürstentum im kurrhein. Kreis, das im Reichstag auf der rheinischen Bank die erste Stimme hatte, bestand aus mehreren gesonderten Teilen: längs des Rheins auf dem linken Ufer zwischen den Herzogtümern Jülich und Berg lag der Hauptteil, zwischen Jülich und dem Erzstift Trier ein andres Gebiet, und auf dem rechten Rheinufer lagen die Grafschaft Recklinghausen und das Herzogtum Westfalen. Die eigentlichen erzstiftischen Lande (ohne Recklinghausen und Westfalen) umfaßten etwa 2750 qkm (50 QM.) mit 100,000 Einw., das ganze vom Kurfürsten beherrschte Gebiet aber ungefähr 6600 qkm (120 QM.) mit 230,000 Einw. Der Erzbischof von K. war der dritte geistliche Kurfürst des Deutschen Reiches und Erzkanzler des heiligen römischen Reiches in Italien sowie des Papstes, seit Innozenz IV. auch geborner päpstlicher Legat. Bei der Wahl des römischen Königs hatte er als Kurfürst die zweite Stimme und genoß das Vorrecht, innerhalb des Erzstifts und außerhalb Deutschlands zur Rechten des Königs gehen zu dürfen. Zwischen ihm und dem Kurfürsten von Mainz bestand wegen der Kaiserkrönung ein langer Streit, der erst 1657 dahin entschieden wurde, daß stets derjenige die Krönung vollziehen sollte, in dessen Sprengel sie stattfinde; sofern sie aber an einem Ort außerhalb der beiden Bistümer vollzogen würde, sollten beide Kurfürsten miteinander abwechseln. Die Landstände des Erzstifts bestanden aus dem Domkapitel, den Grafen, der Ritterschaft und den Städten, und die Landtage wurden gewöhnlich in Bonn gehalten. Die Stadt K. hatte sich schon im 13. Jahrh. von der Herrschaft des Erzbischofs befreit, und dieser residierte meist in Brühl und Godesberg, später in Bonn. Das Domkapitel dagegen, das fast nur aus Mi…
in scheme: travel!digital Thesaurus
pref label: kölnisch
alt label: kölner

kölnisch
type: Label
hasVariant: kölner
in scheme: travel!digital Thesaurus

kölner
type: Label
isVariantOf: kölnisch
in scheme: travel!digital Thesaurus

Palmyrener
type: Concept
related match: Palmyra
definition: bdk: Einwohnerbezeichnung zu Palmyra | Duden: Palmyra: Stadt in der Syrischen Wüste | Meyers Großes Konversations-Lexikon 1908: Palmyra (aramäisch Tadmor, heute Tudmur), der Sage nach von Salomo gegründete Hauptstadt der syrischen Landschaft Palmyrene, berühmt durch die großartigen Ruinen ihrer prächtigen, aus spätrömischer Zeit stammenden Bauwerke und durch den Versuch der dortigen Königsfamilie zur Zeit des Kaisers Aurelian, die römische Herrschaft im Orient[344] zu stürzen. Schon Gallienus mußte um 264 n. Chr. den Palmyrener Septimius Odenathus wegen seiner Hilfe gegen die Perser als eine Art Mitregenten anerkennen; nach dessen Ermordung (267) herrschte seine Witwe Zenobia (s. d.), die den Titel einer römischen Kaiserin führte, im Namen des von Rom anerkannten Regenten, ihres jungen Sohnes Vaballathus. Zenobia eroberte Syrien, Mesopotamien und einen Teil Ägyptens, immer noch notgedrungen von den römischen Kaisern anerkannt, bis es unter Aurelian um 270 zum offenen Bruch kam. Sie verlor bereits 271 Ägypten; bald darauf wurde auch P. erobert und Zenobia gefangen genommen, in Rom im Triumph ausgeführt, aber mit Milde behandelt; das Schicksal ihres Sohnes ist ungewiß. P., wegen eines zweiten Aufstandes von Aurelian zerstört, verlor allmählich seine Bedeutung und spielte im Mittelalter nur eine untergeordnete Rolle. Erst 1678 wurden englische Kaufleute aus Aleppo auf die großartigen Trümmer aufmerksam, sämtlich aus der Blütezeit Palmyras, dem 3. Jahrh., stammend. Diese Ruinen liegen auf einem etwas erhöhten Grund (etwa 400 m hoch) in einer weiten Ebene, ungefähr 140 km östlich von Homs und 200 km südwestlich von Deir am Euphrat, und dehnen sich von SO. gegen NW. in ununterbrochener Linie fast 3 km weit aus. An dem östlichen Ende steht der berühmte Sonnentempel, dem Baal geweiht. Ein Quadrat von 235 m Seitenlänge ist von einer etwa 15–16 m hohen, aus schön behauenen Steinen aufgeführten und mit korinthischen Pilastern dekorierten Mauer umschlossen, von der aber nur die…
in scheme: travel!digital Thesaurus
pref label: Palmyrener

Palmyrener
type: Label
in scheme: travel!digital Thesaurus

bagdader
type: Concept
related match: Baghdad
definition: bdk: Bagdad, die Bagdader betreffend; von den Bagdader stammend, zu ihnen gehörend; in Bagdad gelegen | Duden: Bagdad: Hauptstadt des Iraks | Meyers Großes Konversations-Lexikon 1905: Bagdâd, Hauptstadt des gleichnamigen asiatisch-türk. Wilajets (mit den Liwas B., Kerbela und Hille und 614,000 Einw.), unter 33°20´ nördl. Br. beiderseits des Tigris gelegen, die weltberühmte Kalifenstadt, einst die Metropole der mohammedanischen Herrschaft, neben dem wohlhabendern Kerbela die einzige noch übriggebliebene große Stadt dieses Landes. Der neuere und größere Teil derselben liegt am östlichen Ufer des Tigris und ist mit den Ruinen des alten B. an der Westseite des Flusses, wo die Zitadelle liegt, durch eine 200 m lange Schiffbrücke verbunden. Die Stadt hat einen Umfang von etwa 14 km, die große Stadtmauer wurde durch Midhat Pascha geschleift. Die Bauwerke der Kalifen sind meist verschwunden, nur einzelne Moscheen sowie die Türme und die drei Tore erinnern noch an die einstige Größe der Stadt. Die Straßen sind eng, krumm und ungepflastert. Von den Klöstern bestehen noch zwei, und von den Moscheen liegen die meisten längst in Trümmern. Unter den (30) noch vorhandenen verdienen die Dschamah el Suk el Gazel als die älteste und die Dschamah el Merdschamiah mit Resten von altem Arabeskenwerk Erwähnung. Chane (Karawanseraien) besitzt B. gegen 30, die jedoch hinsichtlich ihrer Bauart denen in Diarbekr und Urfa nachstehen. Die berühmten Basare Bagdâds bilden lange, breite, mit gewölbtem Mauerwerk gedeckte Gänge und enthalten einen großen Reichtum an orientalischen Waren (s. unten). Die öffentlichen Bäder (mehr als 50), einst aufs beste eingerichtet, sind gegenwärtig weniger gut als in andern Städten Mesopotamiens. Reich ist B. an Grabstätten berühmter und heiliger Personen, die es von alters her zu einem vielbesuchten Wallfahrtsort gemacht haben, darunter das Grab der Zobeïde, der Gemahlin Harun al Raschids. B. zählte 1650 nur 15,000, dagegen in der zweiten Hälfte des 18. Jahrh. an …
in scheme: travel!digital Thesaurus
pref label: bagdader
alt label: baghdadisch
alternative label: baghdadisch

bagdader
type: Label
in scheme: travel!digital Thesaurus
hasVariant: baghdadisch

baghdadisch
type: Label
in scheme: travel!digital Thesaurus
isVariantOf: bagdader

Aradier
type: Concept
related match: Arad, Israel
definition: bdk: Einwohnerbezeichnung zu Arad | Pierer's Universal-Lexikon 1857: Arad, 1) (a. Geogr.), Stadt in SPalästina, in dem Stamme Juda an der Grenze von Idumäa. Die Umwohner (Araditer) gingen, von den Israeliten vertrieben, nach Phönicien u. ließen sich auf der Insel Arados nieder; 2) Quelle jenseit des Jordan im Stamme Halb-Manasse. | Quelle: Pierer's Universal-Lexikon, Band 1. Altenburg 1857, S. 653. Permalink: http://www.zeno.org/nid/20009392726
in scheme: travel!digital Thesaurus
pref label: Aradier

Aradier
type: Label
in scheme: travel!digital Thesaurus

pennsylvanisch
type: Concept
narrower: pennsylvanisch-atlantisch
related match: Pennsylvania
in scheme: travel!digital Thesaurus
pref label: pennsylvanisch
definition: Duden: Pennsylvania betreffend, zu Pennsylvania gehörend | [Anm.: unvollständig: Pennsylvania, die Einwohner von Pennsylvania betreffend; von den Einwohnern von Pennsylvania stammend, zu ihnen gehörend; in Pennsylvania gelegen] | Duden: Pennsylvania: Bundesstaat der USA | Pierer's Universal-Lexikon 1861: Pennsylvania (State of Pennsylvania [spr. Steht of Pennsylwehnie]; officielle Abkürzung: Pa., seltner Penn.), einer der ursprünglichen 13 Staaten der nordamerikanischen Union, jetzt einer der sechs sogenannten Mittelstaaten, nächst New York der volkreichste u. wichtigste der Vereinigten Staaten; grenzt im Nordwesten an den Erie See, im Norden an den Staat New York, im Osten an New Jersey (durch den Delaware River davon getrennt), im Süden an die Staaten Delaware, Maryland u. Virginia, im Westen an den Staat Ohio; Flächenraum: 47,000 englische od. 2212 geographische QM. In Bezug auf seine verticale Gliederung zerfällt P. in drei Regionen: die Atlantische Abdachung, die centrale Gebirgsregion u. das Tafelland des Ohio u. Erie. Dem größern Theil nach ist der Boden uneben, nur der Südosten u. Nordwesten machen davon eine Ausnahme; dazwischen laufen ziemlich parallel vorherrschend von Südwesten nach Nordosten mehre Ketten der Alleghanies (als Blue Ridge [Blue od. Kittatinny Mountains] Sideling Hills, Laurel od. Chestnut Ridge u.a., sämmtlich selten bis 2000 Fuß sich erhebend). Die Bewässerung des Staates ist sehr reich; die Hauptströme sind: Delaware River (Grenzfluß gegen New Jersey), Schuylkill, Susquehanna, Alleghany u. Monongahela Rivers (welche letztere beiden in P. sich vereinigen u. den Ohio River bilden); von Binnenseen ist nur der Erie See von Bedeutung, welcher die Nordwestgrenze des Staates bespült; Meeresküste hat P. nicht, doch gewährt der Delaware River, der, bis Philadelphia für große Seeschiffe tief genug ist, dem Staat einen directen Antheil am Seehandel. Das Klima ist sehr verschieden, doch mehr nach der geographischen Länge als nach der Breite, im Oste…

pennsylvanisch-atlantisch
type: Concept
pref label: pennsylvanisch-atlantisch
in scheme: travel!digital Thesaurus
definition: bdk: siehe pennsylvanisch | Duden: Pennsylvanien: Bundesstaat der USA | Meyers Großes Konversations-Lexikon 1908: Pennsylvanĭen (Pennsylvania, abgekürzt Pa. s. Karte »Vereinigte Staaten«), nordamerikan. Staat, in Bedeutung und Volkszahl nach New York der erste Staat der Union, zwischen 39°43´-42°15´ nördl. Br. und 74°12´-80°36´ westl. L., berührt im NW. den Eriesee, grenzt im übrigen an New York, New Jersey, Delaware, Maryland, Westvirginia und Ohio, hat in der Delawaremündung einen Zugang vom Atlantischen Ozean her und ist 117,100 qkm groß. Der Oberflächenbeschaffenheit nach unterscheidet man das Hügelland im O., das Bergland in der Mitte und das westliche Tafelland. Ersteres erstreckt sich vom Delawarefluß 120–130 km weit gegen W. bis zum Fuß der Blauen Kette, die bei Harrisburg und Easton vom Susquehanna und Delaware durchbrochen wird. Weiterhin folgen dann die Parallelketten der Appalachen (Kittatinny, Broad oder Tuscarora Mountains, Sideling Hill, Bald Hill etc.). Im allgemeinen ist dieses Bergland unfruchtbar, mit Ausnahme der muldenförmigen Täler. Auch kommen noch große Strecken Urwaldes vor, mit Bären, Wölfen, Waschbären u.a. Die dritte Region liegt westlich von dem steil aufsteigenden Alleghanyrücken, der die Wasserscheide zwischen dem Susquehanna- und Ohiogebiet[566] bildet und sich gegen NW. zum Eriesee (175 m) abdacht, und hat großenteils sehr fruchtbaren Boden. Etwa die Hälfte wird von Schichten der Karbonformation eingenommen, die mächtige Flöze von Anthrazit und bituminöser Kohle enthalten, ein beträchtlicher Teil auch von Devonschichten mit starken Petroleumquellen, ebenso von silurischen und archäischen Schichten mit Magnet- und Brauneisenerzen. Die drei Hauptflüsse sind der Delaware an der Ostgrenze, der den Lehigh und Schuylkill aufnimmt, der Susquehanna mit dem Juniata und der Ohio nebst seinen Quellflüssen Alleghany und Monongahela. Die kurze Erieseeuferstrecke bietet bei Erie (s. d.) einen guten Naturhafen und ermöglicht eine rege Anteilnahme a…
related match: Pennsylvania

pennsylvanisch-atlantisch
type: Label
in scheme: travel!digital Thesaurus

pennsylvanisch
type: Label
in scheme: travel!digital Thesaurus

Hesse
type: Concept
in scheme: travel!digital Thesaurus
pref label: Hesse
definition: Duden: Einwohnerbezeichnung | [Anm.: unvollständig: Einwohnerbezeichnung zu Hessen] | Duden: Hessen: deutsches Bundesland | Meyers Großes Konversations-Lexikon 1907: Hessen, Großherzogtum (hierzu die Karte »Hessen«), ein deutscher Bundesstaat, besteht aus zwei durch preußisches Gebiet getrennten Hauptteilen nebst elf kleinern Exklaven und liegt mit seinen Hauptteilen zwischen 7°51´ und 9°39´ östl. L. v. Gr. und 49°24´ und 50°50´ nördl. Br. Das südliche Hauptgebiet wird durch den Rhein in die Provinzen Starkenburg und Rheinhessen getrennt und grenzt nördlich an Preußen, östlich an Bayern und Baden, südlich an Baden, westlich an die bayrische Rheinpfalz und Rheinpreußen; der nördliche Hauptteil umfaßt die Provinz Oberhessen und wird gänzlich von Preußen umschlossen. Von den Exklaven sind die größten die zusammenhängenden Gemarkungen Wimpfen a. Berg, [263] Wimpfen i. Tal und Hohenstadt, an Baden und Württemberg grenzend, die mit Baden gemeinschaftliche Gemarkung Kürnbach und die Gemarkung Helmhof mit Forstbezirk, beide von Baden umschlossen, sowie die von Preußen umschlossene Gemarkung Steinbach, sämtlich zur Provinz Starkenburg gehörig. Die zur Provinz Oberhessen gehörenden Parzellen (mehrere Walddistrikte) liegen südwestlich von dieser Provinz in preußischem Gebiet. Enklaven fremder Staaten (Preußen und Baden) sind acht von hessischem Gebiet eingeschlossen. Das Großherzogtum H. ist zusammengesetzt teils aus den ältern Ländern, nämlich der Obergrafschaft Katzenelnbogen (1567) und dem größern Teil von Oberhessen (1584 und 1627), teils aus den seit 1803 zur Entschädigung und durch Tausch hinzugekommenen Teilen von Kurpfalz und Kurmainz, dem Bistum Worms, der Abtei Seligenstadt, den ehemaligen Reichsstädten Worms, Friedberg und Wimpfen und einem Teil des ehemaligen französischen Departements Donnersberg (Provinz Rheinhessen, s. unten: Geschichte, S. 271 f.), ferner den Standesherrschaften Isenburg, Solms, Schlitz, Stolberg, Erbach, Löwenstein-Wertheim etc. sowie den reic…
related match: Hesse

Hesse
type: Label
in scheme: travel!digital Thesaurus

Tirolerin
type: Concept
related match: Tyrol
pref label: Tirolerin
in scheme: travel!digital Thesaurus
definition: Duden: weibliche Form zu Tiroler | Duden: Tiroler: Einwohnerbezeichnung | [Anm.: unvollständig: Einwohnerbezeichnung zu Tirol] | Duden: Tirol: 1. österreichisches Bundesland | 2. ([historische] Alpenregion im Westen Österreichs und Norden Italiens) | Meyers Großes Konversations-Lexikon 1909: Tirol (hierzu Karte »Tirol«), gefürstete Grafschaft und österreich. Kronland, bildet mit dem Kronland Vorarlberg (s. d.) ein Verwaltungsgebiet, grenzt nördlich an Bayern, östlich an Salzburg, Kärnten und Italien, südlich an Italien, westlich an Italien, die Schweiz und Vorarlberg und umfaßt 26,683 qkm (484,7 QM.), mit Vorarlberg 29,285 qkm (531,9 QM.). T. ist das gebirgigste Land Österreichs und hat Anteil an dem nördlichen, mittlern und südlichen Zuge der Alpen. Zur zentralen Gneisalpenzone gehören die nördlichen Verzweigungen der Rätischen Alpen, und zwar die Fermuntgruppe (Fluchthorn 3408 m) und die Fervallgruppe (Kuchenspitze 3170 m), ferner das gletscherreiche Massiv der Ötztaler Alpen (Wildspitze 3774 m) und der Stubaier Alpen (Zuckerhütl 3511 m), die Adamelloalpen (Presanella 3564 m), die Ortleralpen (Ortler 3902 m, der höchste Gipfel des Landes) und das Penser Gebirge (Hirzer 2785 m). Jenseit des Brenner erheben sich die Zillertaler Alpen (Hochfeiler 3523 m) und die Hohen Tauern (Großglockner 3798 m) mit ihren südlichen Vorlagerungen. Im NO. lehnen sich an die Gneisalpen das Tuxer Tonschiefergebirge (Reckner 2882 m) und die Kitzbühler Alpen (Katzenkopf 2532 m) an. Die nördliche Kalkalpenzone beginnt mit den Algäuer (Lechtaler) Alpen (Parseier Spitze 3038 m) und setzt sich in den Nordtiroler Kalkalpen mit den Gruppen des Wettersteingebirges (2968 m), des Karwendelgebirges (2756 m),[566] der Brandenberger Alpen (2296 m) und des Kaisergebirges (2344 m) fort. Der südlichen Kalkalpenzone gehören in T. insbes. die Brentagruppe (3176 m), dann östlich vom Etschtal die Vicentinischen Alpen (Cima Dodici 2331 m), die Südtiroler Dolomiten (Marmolata 3360 m), endlich an der Grenze ge…

Tirolerin
type: Label
in scheme: travel!digital Thesaurus

Korinther
type: Concept
related match: Corinth
related match: Ancient Corinth
definition: Duden: Einwohnerbezeichnung zu Korinth | Duden: Korinth: griechische Stadt | Meyers Großes Konversations-Lexikon 1907: Korinth (Korinthos), im Altertum berühmte Stadt im Peloponnes, Hauptort der Landschaft Korinthia, die den Nordosten von Argolis umfaßte und durch den zu ihr gehörigen Isthmus (s. d.) von K. den Peloponnes mit dem griechischen Festland verband (s. unten). Die Stadt lag unter dem steilen Nordabfall des Berges, auf dem ihre Burg (Akrokorinth) stand, hatte drei Häfen (Lechäon am Korinthischen Busen, mit K. durch 12 Stadien lange Schenkelmauern verbunden, Kenchreäu. Schönos am Saronischen Busen) und war die Pforte zum Peloponnes, daher von großer strategischer Wichtigkeit. An die Phöniker, die sich hier frühzeitig niedergelassen hatten, erinnerten neben der Purpurfärberei und Teppichweberei mannigfache Anklänge in Mythe und Kultus. Dieser Götterdienst gab schon in alter Zeit Veranlassung zur Ausübung und Ausbildung mannigfacher Künste, und die Korinther zeichneten sich dabei durch Erfindungsgeist, Schönheitssinn und Kunstfertigkeit aus und suchten einen Ruhm darin, in dem Schmuck ihrer Stadt und ihrer Tempel das übrige Griechenland zu überbieten. Die Kunstweberei und Färberei, die Bearbeitung des Erzes, die Töpferei und Tonplastik standen in K. in besonderer Blüte; in der Malerei werden Korinther, wie Ardikas, Kleophantos, Kleanthes, als die Begründer der Kunst genannt. Auch der Dithyrambos fand hier durch Arion seine Ausbildung. Später jedoch blieb die geistige Kultur hinter der Betonung und Pflege des Materiellen zurück; in der Literatur hat sich kein Korinther hervorgetan. Dagegen hat K. Staatsmänner hervorgebracht, wie Periandros und Timoleon. Gewerbtätigkeit, Handel und Schiffahrt nahmen hauptsächlich die Tätigkeit der Korinther in Anspruch. Die Lage zwischen zwei Meeren, die Schwierigkeit, den Peloponnes zu umschiffen, die Leichtigkeit dagegen, Waren und selbst Schiffe über den Isthmus zu schaffen, hatten K. schon sehr früh zu einem großen Markt- u…
in scheme: travel!digital Thesaurus
pref label: Korinther

Korinther
type: Label
in scheme: travel!digital Thesaurus

Korfiote
type: Concept
definition: Duden: Einwohnerbezeichnung zu Korfu | Duden: Korfu: griechische Insel im Ionischen Meer | Meyers Großes Konversations-Lexikon 1907: Korfu (bei den alten Griechen Kerkyra, bei den Römern Corcyra), nördlichste der Ionischen Inseln und gleich ihnen ein losgelöster Teil des epirotischen Gebirges, am Eingang vom Ionischen ins Adriatische Meer (Kanal von Otranto), an der Küste von Albanien, von der sie durch den schmalen Kanal von K. getrennt wird, ist 62 km lang, von keulenförmiger Gestalt, an der breitesten Stelle fast 30 km breit und hat einen Flächenraum von 719 qkm (nach Partsch und englischen Angaben nur 593 qkm) und (1896) 90,872 Einw. K. zerfällt in das nördliche Bergland, das im Pantokrator zu 914 m, der größten Höhe der Insel, aufsteigt und vorwiegend aus mesozoischen Kalksteinen, aus Flyschmergeln und Sandsteinen und pliocänen Mergeln, Sandsteinen und Konglomeraten besteht, und in das tertiäre (pliocäne) Hügelland des langen, schmalen Mittel- und Südteils, eine anmutige, fast durchweg von Ölbäumen bewachsene, wohlbevölkerte Landschaft. Erdbeben sind häufig, aber meist nicht besonders heftig. Die Insel hat regenreiche (77,8 Regentage), aber warme, milde Winter und heiße, trockne Sommer. Perennierende Flüsse hat K. bloß zwei, jedoch zahlreiche Quellen. Die Malaria ist für gewöhnlich auf bestimmte Örtlichkeiten beschränkt und nimmt nur höchst selten einen epidemischen Charakter an. Wald ist nur noch wenig vorhanden, um so mehr Gestrüpp. Die Fauna ist arm, die Viehzucht unbedeutend. Weder Ackerbau noch Fischerei und Industrie (Seifensiederei, Gerberei, Dampfmühlen, Makkaronifabriken) leisten etwas; K. ist auf Zufuhr angewiesen. Mais ist die wichtigste Frucht, dann Winterweizen, Mohrenhirse und Gerste; der Anbau von Kartoffeln nimmt stetig zu, und es findet eine bedeutende Ausfuhr nach Deutschland statt. Hervorragend ist der Weinbau, noch mehr aber der des Ölbaums, der die Hälfte von K. bedeckt (über 4 Mill. Bäume) und als Haupthandelsgegenstand Öl liefert. Der Ert…
related match: Corfu
related match: Korkyra (polis)
in scheme: travel!digital Thesaurus
pref label: Korfiote

Korfiote
type: Label
in scheme: travel!digital Thesaurus

angelsächsisch
type: Concept
definition: Duden: 1. die Angelsachsen betreffend, von ihnen abstammend, zu ihnen gehörend | Duden: Angelsachsen: 1. (Geschichte) Angehöriger eines der im 5./6. Jahrhundert nach England ausgewanderten westgermanischen Stämme der Angeln, Sachsen und Jüten | 2. Person englischer Abstammung und Muttersprache, besonders Engländer oder aus England stammender Amerikaner | Meyers Großes Konversations-Lexikon 1905: Angelsachsen, zuerst im 8. Jahrh. von dem langobardischen Historiker Paulus Diaconus gebrauchter Name des aus Angeln, Sachsen und Jüten gemischten[514] Volkes, das um 450 die Eroberung des romanisierten, aber seit 410 von den römischen Legionen verlassenen Britannien begann. Der Sage nach landeten die A., von den Briten gegen die Pikten und Skoten zu Hilfe gerufen, 449 unter Hengist und Horsa in Britannien und verbreiteten sich von der ihnen zuerst eingeräumten Insel Thanet aus über das Land. In Wirklichkeit fehlt es an zuverlässigen Nachrichten über die sich über einen Zeitraum von 150 Jahren erstreckenden Kämpfe, durch die der Süden und Osten Britanniens in den Besitz der A. kam und die keltisch-britische Bevölkerung auf Irland, Wales, Cornwallis und die schottischen Hochlande beschränkt wurde. Von den kleinen Königreichen, in welche die A. nach der Eroberung zerfielen, blieben in der nächsten Zeit sieben oder acht größere bestehen: Essex, Wessex, Sussex, Kent (Ost- und Westkent), Mercia, Northumberland, Ostangeln. Diese bezeichnet man als die angelsächsische Heptarchie, obwohl, von vorübergehenden Vereinigungen abgesehen, eine dauernde staatsrechtliche Verbindung zwischen ihnen nicht bestand. Die A. waren zur Zeit der Eroberung Heiden. Zur Verkündigung des Christentums sandte Papst Gregor I. um 596 den Mönch Augustinus mit mehreren Gehilfen; und seit der Bekehrung Ethelberts, Königs von Kent (597), verbreitete sich das Christentum allmählich über alle Reiche der A. An der Spitze der angelsächsischen Kirche stand das Erzbistum Canterbury, dessen Erzbischof Theodor aus Tars…
pref label: angelsächsisch
in scheme: travel!digital Thesaurus
related match: Anglo-Saxons

angelsächsisch
type: Label
in scheme: travel!digital Thesaurus

Afrikaner
type: Concept
definition: Duden: aus Afrika stammende Person [von schwarzer Hautfarbe] | [Anm.: Betonung der Hautfarbe!?] | Meyers Großes Konversations-Lexikon 1905: Afrika, der fast insulare südwestliche Teil der Alten Welt. Der Name, zuerst von Ennius gebraucht, bezog sich ursprünglich nur auf die Karthago und Umgebung umfassende römische Provinz, wurde aber in der Kaiserzeit auf den ganzen Erdteil übertragen. Bei den Griechen war dafür der semitische Name Libyen gebräuchlich, womit man anfänglich bloß den Nordrand Afrikas zwischen Ägypten und den Syrten bezeichnete (vgl. Erdteil). [...] | (Hierzu die Tafeln »Afrikanische Völker I u. II«, mit Erklärungsblatt, und »Afrikanische Kultur I, mit Erklärungsblatt, u. II, III«.) | A. kennzeichnet sich als ein Raum großer Völkerverschiebungen. Scharfe natürliche Grenzen, welche die Wanderungen der Völker zu hemmen vermochten, fehlen im Innern Afrikas, und selbst die Wüsten üben eine sondernde Wirkung nur in beschränktem Maß aus. Trotz der Sahara sind die Neger ein bedeutendes Mischelement der Bevölkerung von ganz Nordafrika. Der Gebirgsbau und das Flußsystem sind beide nicht befähigt, der Völkerverbreitung starke Hindernisse entgegenzustellen. Dazu waren, mit Ausnahme der Ägypter, alle andern Völker Afrikas Natur- oder Halbkulturvölker, unstet in jeder Beziehung und darum der Vermischung, Vernichtung oder umgestaltenden Erneuerung im höchsten Maß ausgesetzt. Eine Abwanderung über See hat vor dem Eingriff durch Europäer, die zahllose Neger nach Amerika verpflanzten, nirgends stattgefunden, denn die nautischen Leistungen der Afrikaner verharrten auf niedriger Stufe und erhoben sich nicht über den Bau einfacher Ruderkanoes. | Der Nord- und Nordostrand standen durch die Annäherung an Asien und Europa der günstigen Einwirkung fremder Zivilisation offen. Aber je weiter wir uns von dieser entfernen, desto mehr verdunkeln sich die Gesittungszustände Afrikas, bis wir an der Südspitze in den Buschmännern ein Volk auf niedrigster Kulturstufe finden. Nord- und…
in scheme: travel!digital Thesaurus
pref label: Afrikaner
related match: Africa
narrower: Nordafrikaner

Afrikaner
type: Label
in scheme: travel!digital Thesaurus

Nordafrikaner
type: Concept
definition: bdk: siehe Afrikaner
in scheme: travel!digital Thesaurus
pref label: Nordafrikaner
related match: North Africa

Nordafrikaner
type: Label
in scheme: travel!digital Thesaurus

bataviasch
type: Concept
preferred label: bataviaasch @nl
related match: Batavia, Dutch East Indies
pref label: bataviaasch
in scheme: travel!digital Thesaurus
pref label: bataviasch
definition: Duden: batavisch: Batavia, die Bataver betreffend | [Anm.: unvollständig: Batavia, die Bataver betreffend; von den Batavern stammend, zu ihnen gehörend; in Batavia gelegen] | Duden: Batavia: alter Name von Jakarta | Meyers Großes Konversations-Lexikon 1905: Batavĭa, Hauptstadt Niederländisch-Ostindiens und der gleichnamigen Residentschaft (6730 qkm mit [1895] 1,268,043 Einw., worunter 12,429 Europäer, 82,510 Chinesen, 3279 Araber), am westlichen Ende der Nordküste von Java, unter 6°7´ südl. Br. und 106°50´ östl. L., an der Südseite einer geräumigen, durch 17 kleine Koralleninseln geschützten Bai und am Flüßchen Tschiliwung, inmitten ausgedehnter Reisfelder und Kokospflanzungen (s. Plan). Das Klima ist heiß und wenig veränderlich (mittlere Temperatur im heißesten Monat, Mai, 26,3°, im kühlsten, Januar, 25,1°), Extreme 33,7 und 19,4°. Der meiste Regen (385 mm) fällt im Februar, der wenigste (47 mm) im August. Die Altstadt enthält das große Stadthaus, die Börse, eine Kirche, die Javabank, die Gebäude des Hafen- und Zolldepartements, ein für Chinesen und ein für Eingeborne bestimmtes Hospital sowie ein Gefängnis für letztere, die Magazine der Regierung und der Niederländischen Handelsgesellschaft, die Kontore und Speicher der großen Handelshäuser, ist aber nur noch von Malaien, Javanen, Arabern und Mauren, Mischlingen und Chinesen (im chinesischen Kampong) bewohnt, während die Europäer die ehemals von ihnen bewohnten großartigen Häuser in der Altstadt nur während der Geschäftsstunden aufsuchen, sonst aber in der (1808 wegen des mörderischen Klimas der Altstadt angelegten) neuen Stadt wohnen, wolun der fast 4 km lange, gleichfalls europäische Stadt teil Molenvliet hinüberführt. Die lustigen großen Häuser liegen hier getrennt, zwischen Fruchtbäumen aller Art, sind aber nur ein-, höchstens zweistöckig mit platten Dächern und schönen, breiten Veranden. Hier liegen das großartige Harmoniegebäude, das Palais des Generalgouverneurs, die Parapatan-Waisenstiftung, der schöne Ras…

bataviaasch
type: Label
isTranslationOf: bataviasch
in scheme: travel!digital Thesaurus

bataviasch
type: Label
hasTranslation: bataviaasch
in scheme: travel!digital Thesaurus

Galiläer
type: Concept
related match: Galilee
definition: Duden: Einwohnerbezeichnung | [Anm.: unvollständig: Einwohnerbezeichnung zu Galiläa] | Duden: Galiläa: historische Landschaft in Palästina | Meyers Großes Konversations-Lexikon 1907: Galiläa (»Kreis«) war im Zeitalter Jesu Bezeichnung von Nordpalästina diesseit des Jordans, zwischen dem Gebirge Karmel und dem Litani (s. Karte »Palästina«). Es zerfiel in Obergaliläa, ein schönes Bergland mit Gipfeln bis 1200 m und durchschnitten von tiefen Tälern, und das ebenere, fruchtbare Untergaliläa, südlich davon. Obergaliläa hatte z. T. heidnische Bewohner (Phöniker, Syrer, Araber und selbst Griechen). Das Gebiet besteht, außer im O., wo vulkanische Gebilde vorkommen, aus Kalkgebirgen, die im N. schroff und felsig sind, nach SW. aber in Hügelketten und in die fruchtbare Ebene Jezreel oder Esdrelon auslaufen. Das Land, das zahlreiche unbedeutende Wasserläufe enthält, war namentlich im S. zur Betreibung von Ackerbau und Viehzucht vortrefflich geeignet, überall fleißig angebaut, stark bevölkert und entbehrt auch heute noch nicht ganz des Waldes. Am bevölkertsten waren die Gebirgsabhänge im O. gegen den See Genezareth zu und die Gestade dieses Sees selbst. Die größten Städte Galiläas waren. Tiberias, die ältere, und Sepphoris, die spätere Hauptstadt, ferner die von Josephus im jüdischen Kriege verteidigte Festung Jotapata (Tell Dschefât); in der evangelischen Geschichte kommen besonders Kapernaum und Nazareth vor. Die Bewohner Galiläas waren fleißige und tapfere Leute und von mildern religiösen Grundsätzen als ihre Glaubensgenossen, daher auch empfänglicher für Jesu Lehre. Vgl. Guérin, Description historique, géographique et archéologique de la Galilée (Par. 1880, 2 Bde.). | Quelle: Meyers Großes Konversations-Lexikon, Band 7. Leipzig 1907, S. 268. | Permalink: http://www.zeno.org/nid/20006648762
in scheme: travel!digital Thesaurus
pref label: Galiläer

Galiläer
type: Label
in scheme: travel!digital Thesaurus

pelasgisch
type: Concept
definition: bdk: die Pelasger betreffend; von den Pelasgern stammend, zu ihnen gehörend
in scheme: travel!digital Thesaurus
related: Pelasger
pref label: pelasgisch

Pelasger
type: Concept
definition: Duden: Angehöriger einer Urbevölkerung Griechenlands | Meyers Großes Konversations-Lexikon 1908: Pelásger nannten im Altertum die spätern Griechen die Ureinwohner Griechenlands (s. d., S. 297). die sie als gleicher Abstammung, aber als besonderes, durch die einwandernden Hellenen verdrängtes Volk betrachteten. In der historischen Zeit gab es P. nur in der Peneiosebene in Thessalien. Nach den neuern Forschungen waren die ältesten Bewohner Griechenlands indogermanischen Ursprungs (nicht Semiten, wie Röth, Kiepert u.a. wollten) und kamen aus Kleinasien[546] von Norden her über Epirus, wo sich die von ihnen eingerichtete Verehrung des Zeus und der Dione in Dodona bis in späte Zeit erhalten hat. Vgl. Ed. Meyer, Forschungen zur alten Geschichte, Bd. 1 (Halle 1892); H. Müller, P. und Hellenen (Götting. 1892); W. Ridgeway, The early age of Greece, Bd. 1 (Lond. 1901), und die Literatur über die Geschichte Alt-Griechenlands, S. 303. | Quelle: Meyers Großes Konversations-Lexikon, Band 15. Leipzig 1908, S. 546-547. | Permalink: http://www.zeno.org/nid/20007226632
in scheme: travel!digital Thesaurus
pref label: Pelasger

Pelasger
type: Label
in scheme: travel!digital Thesaurus

pelasgisch
type: Label
in scheme: travel!digital Thesaurus

palmyrenisch
type: Concept
preferred label: palmyrénien @fr
pref label: palmyrenisch
definition: Duden: palmyrisch: Palmyra, die Palmyrer betreffend | [Anm.: unvollständig: Palmyra, die Palmyrer betreffend; von den Palmyrern stammend, zu ihnen gehörend; in Palmyra gelegen]
related: Palmyrener
in scheme: travel!digital Thesaurus
pref label: palmyrénien

palmyrenisch
type: Label
hasTranslation: palmyrénien
in scheme: travel!digital Thesaurus

palmyrénien
type: Label
isTranslationOf: palmyrenisch
in scheme: travel!digital Thesaurus

europäisiert
type: Concept
pref label: europäisiert
in scheme: travel!digital Thesaurus
related: europäisch
definition: Duden: europäisieren: der europäischen Lebensart angleichen, nach europäischem Vorbild umgestalten, kulturell oder politisch an [Gesamt]europa orientieren
related match: Westernization
related match: Europeanisation
related: Europäer

europäisiert
type: Label
in scheme: travel!digital Thesaurus

phanariotisch
type: Concept
definition: bdk: die Phanarioten betreffend; von den Phanarioten stammend, zu ihnen gehörend
in scheme: travel!digital Thesaurus
pref label: phanariotisch
related: Phanariotenfamilie

phanariotisch
type: Label
in scheme: travel!digital Thesaurus

adrianopeler
type: Concept
related match: Edirne
definition: bdk: Adrianopel, die Einwohner von Adrianopel betreffend; von den Einwohnern von Adrianopel stammend, zu ihnen gehörend; in Adrianopel gelegen | Meyers Großes Konversations-Lexikon 1905: Adrianopel, befestigte Hauptstadt des gleichnamigen Wilajets (s. oben) in wichtiger, beherrschender[121] Lage an der Mündung der Tundscha und Arda in die Maritza, 49 m ü. M., an der Orientbahn Belgrad-Konstantinopel (mit Abzweigung nach Dedeagatsch), hat enge, krumme, schmutzige Straßen. Bemerkenswert sind: die prachtvolle Moschee Sultan Selims 11. (16. Jahrh.), die von den griechischen Kaisern herrührende Michaelisbrücke und der 600 Schritt lange Basar Ali Paschas. A. hat 71,000 Einw. (darunter 23,000 mohammedanische Türken, 30,000 orthodoxe Griechen und Bulgaren, 6000 Armenier, 8000 Juden), geringe Industrie, besonders Weberei, Fabrikation von Teppichen, Saffian und Quittenkonfekt, ist aber Mittelpunkt des thrakischen Handels. Der in der Nähe gewonnene Wein gilt als der beste in der Türkei. A. ist Sitz eines griechischen Erzbischofs, von zwei bulgarischen und einem armenischen Bischof und eines deutschen Vizekonsuls. – Adrianopels ältester Name ist Uskudama (byzantinisch auch Orestia) als Hauptstadt der thrakischen Bessier. Vom römischen Kaiser Hadrian, der die Stadt verschönerte, erhielt sie ihre jetzige Benennung (Hadrianopolis). In ihrer Nähe siegte Konstantin d. Gr. 3. Juli 323 über seinen Mitkaiser Licinius und schlugen die Westgoten 9. Aug. 378 den Kaiser Valens. Nach ihrer Eroberung 1361 durch Murad I. war sie bis zum Fall Konstantinopels 1453 Residenz der osmanischen Sultane; jetzt noch heißt sie zweite Hauptstadt. Im russisch-türkischen Kriege wurde A. 20. April 1829 durch den Feldmarschall Diebitsch-Sabalkansky erobert, worauf 14. Sept. d. J. unter preußischer Vermittelung der Friede zu A. geschlossen wurde. Die Pforte erhielt alle von den Russen in Bulgarien und Rumelien gemachten Eroberungen zurück. Der Pruth und von dessen Mündung an das rechte Donauufer wurden als Gr…
in scheme: travel!digital Thesaurus
pref label: adrianopeler

adrianopeler
type: Label
in scheme: travel!digital Thesaurus

moghrebiner
type: Concept
related: Moghrebiner
in scheme: travel!digital Thesaurus
pref label: moghrebiner
definition: Duden: maghrebinisch: den Maghreb, die Maghrebiner betreffend; vom Maghreb stammend | [Anm.: unvollständig: den Maghreb, die Maghrebiner betreffend; von den Maghrebinern stammend, zu ihnen gehörend; im Maghreb gelegen]

moghrebiner
type: Label
in scheme: travel!digital Thesaurus

toskanisch
type: Concept
related match: Tuscany
in scheme: travel!digital Thesaurus
pref label: toskanisch
definition: Duden: die Toskana, die Toskaner betreffend; von den Toskanern stammend, zu ihnen gehörend | [Anm.: unvollständig: die Toskana, die Toskaner betreffend; von den Toskanern stammend, zu ihnen gehörend; in der Toskana gelegen] | Duden: Toskana: mittelitalienische Region | Meyers Großes Konversations-Lexikon 1909: Toskāna, ehemaliges Großherzogtum, jetzt Landschaft (compartimento) des Königreichs Italien, grenzt an Ligurien, Emilia, Marken, Umbrien, Latium, das Tyrrhenische Meer und umfaßt die Provinzen: Arezzo, Florenz, Grosseto, Livorno, Lucca, Massa e Carrara, Pisa und Siena mit 24,104 qkm (437,8 QM.) Areal und (1904) 2,609,587 Einw. Vgl. die Geschichtskarte bei Artikel »Italien«. – T. ist das alte Tuscien oder Etrurien (s. d.). Nach dem Untergang des weströmischen Reiches (476 n. Chr.) herrschten in dem Lande zwischen dem Macrafluß und dem Tiber Ostgoten, dann Griechen, darauf Langobarden. Unter der Herrschaft der letztern zerfiel T. in mehrere Herzogtümer (Lucca, Florenz, Chiusi) und Gastaldate. Nach der Vereinigung des langobardischen mit dem fränkischen Reiche bildete es eine Markgrafschaft, deren Markgrafen mehrfach auch über das Herzogtum Spoleto und die Markgrafschaft Camerino gesetzt waren. Das Amt kam um 1030 an den Markgrafen Bonifaz aus dem Hause Canossa, der zugleich Graf von Modena, Reggio, Mantua und Ferrara und der reichste und mächtigste Fürst in Italien war. Ihm folgte 1052 seine Gemahlin Beatrix, die zunächst für ihren unmündigen Sohn Friedrich (gest. 1055), dann für ihre Tochter Mathilde mit ihrem zweiten Gatten, Gottfried von Lothringen, und darauf mit ihrer Tochter selbst regierte und 1076 starb. Beatrix und Mathilde (s. d. 3) waren eifrige Anhängerinnen des Papsttums und spielten in der italienischen Geschichte des 11. Jahrh. eine bedeutende Rolle. Nach dem Tode der Mathilde (1115) gelangten im Laufe des 12. Jahrh. die größern städtischen Gemeinwesen Florenz, Siena, Pisa, Lucca, Arezzo u. a. zu munizipaler Unabhängigkeit und bemächtigten sich de…

toskanisch
type: Label
in scheme: travel!digital Thesaurus

hannoversch
type: Concept
related match: Hanover
definition: Duden: Hannover, die Hannoveraner betreffend | [Anm.: unvollständig: Hannover, die Hannoveraner betreffend; von den Hannoveranern stammend, zu ihnen gehörend; in Hannover gelegen] | Duden: Hannover: Landeshauptstadt von Niedersachsen | Meyers Großes Konversations-Lexikon 1907: Hannover (hierzu die Karte »Hannover«), preuß. Provinz, bis zum deutsch-österreichischen Kriege von 1866 ein Königreich, grenzt im N. an die Nordsee, im NO. an Holstein, an den Hauptteil des Hamburger Gebiets und an Mecklenburg, im O. an die Provinz Sachsen und Braunschweig, im S. und SW. an Teile der Provinzen Sachsen und Hessen-Nassau und an Westfalen, im W. an die Niederlande und besteht im wesentlichen aus drei Teilen: aus dem Hauptteil an der Elbe, Weser und Aller, aus dem westlichen Teil an der Ems, der mit dem Hauptteil durch einen 6 km breiten Landstrich zusammenhängt, und aus dem südlichen, der vom Hauptteil ganz durch braunschweigisches Gebiet getrennt ist. Einige kleinere Parzellen liegen noch zerstreut an der Weser und am Harz. Die ältern Bestandteile der Provinz sind: das Herzogtum Bremen zwischen dem Ausfluß der Elbe und Weser, das Land Hadeln nahe der Elbmündung, das Fürstentum Lüneburg zwischen Elbe und Aller, ein Teil des Herzogtums Lauenburg zu beiden Seiten der Elbe, das Herzogtum Verden an der Weser und Aller, das Fürstentum Kalenberg an der Leine und bis zur Weser, das Fürstentum Hildesheim an der Innerste und zwischen der Leine und dem Harz, die Grafschaften Hoya und Diepholz zwischen Weser und Hunte, alle im Hauptteil; sodann im westlichen Teil: das Fürstentum Osnabrück, die Grafschaften Lingen und Bentheim, ein Teil des Stiftes Münster (Meppen), das Fürstentum Ostfriesland und das Harlingerland mit den Nordseeinseln Borkum, Juist, Norderney, Baltrum, Langeoog und Spiekeroog; endlich im südlichen Teil: die Fürstentümer Grubenhagen und Göttingen und getrennt am Harz das zur Grafschaft Hohnstein gehörige Amt Ilfeld. Seit der preußischen Herrschaft sind der Provinz noch das…
pref label: hannoversch
in scheme: travel!digital Thesaurus

hannoversch
type: Label
in scheme: travel!digital Thesaurus

tiroler
type: Concept
pref label: tiroler
in scheme: travel!digital Thesaurus
definition: bdk: Tirol, die Tiroler betreffend; von den Tirolern stammend, zu ihnen gehörend; in Tirol gelegen

tiroler
type: Label
in scheme: travel!digital Thesaurus

mährisch
type: Concept
pref label: mährisch
in scheme: travel!digital Thesaurus
definition: Duden: Mähren, die Mähren betreffend, von den Mähren stammend, zu ihnen gehörend | [Anm.: unvollständig: Mähren, die Mähren betreffend; von den Mähren stammend, zu ihnen gehörend; in Mähren gelegen] | Duden: Mähren: Gebiet in Tschechien | Meyers Großes Konversations-Lexikon 1908: Mähren (tschech. Morava), Markgrafschaft und Kronland des österreich. Kaiserstaates, wird nördlich von Österreich isch- und Preußisch-Schlesien, östlich und südöstlich von Ungarn, südlich von Niederösterreich, westlich von Böhmen begrenzt und hat ein Areal von 22,222 qkm (403,6 QM.), nach neuerer Berechnung[114] 22,231 qkm. S. Karte »Böhmen, Mähren und Österreichisch-Schlesien« (beim Artikel »Böhmen«). | [Physische Beschaffenheit.] Das Land ist im W., N. und O. von Randgebirgen eingeschlossen und umfaßt vier Erhebungszonen: 1) die böhmischmährische Höhe (Jaborschitz 835 m, Kaiserstein 812 m, Hradisko 768 m); 2) die Sudeten im N., die mit dem Glatzer Gebirge (Großer oder Spieglitzer Schneeberg 1422 m) nach M. hinreichen, sodann von der Marchquelle bis zur Oder sich als Altvatergebirge (mit dem Altvater, 1490 m, der höchsten Erhebung des Landes) und dem mährisch-schlesischen Gesenke (821 m) hinziehen und sich gegen S O. im Odergebirge abflachen (675 m). Im O. des Landes erheben sich 3) die Karpathen mit dem an der ungarischen Grenze gelegenen Weißen Gebirge (Javorina 968 m) und dem Javornikgebirge (1077 m) sowie den nördlichen Seitenästen derselben (Tanečnica 912 m, Javornik Kelsky 865 m), dann den Beskiden im nordöstlichen Teil des Landes (Kněhyna 1251 m, Radhoscht 1130 m). Im S. der fruchtbaren Hanna steigt 4) das Marsgebirge (Brdo 587 m) mit seiner westlichen Fortsetzung, dem Steinitzer Wald (442 m), auf, und südlich von der Thaya erhebt sich isoliert die Gruppe der Polauer Berge bis zu 550 m. Der Hauptfluß ist die March, die vom Spieglitzer Schneeberg kommt und an Nebenflüssen rechts die Sazawa, Hanna und Thaya, links die Betschwa und Olsawa aufnimmt. Die in M. entspringende Oder bildet d…

mährisch
type: Label
in scheme: travel!digital Thesaurus

Andalusierin
type: Concept
pref label: Andalusierin
related: Andalusier
preferred label: anadluza @es
comment: Mittelmeer 1909: nur spanisch
pref label: anadluza
definition: Duden: weibliche Form zu Andalusier
in scheme: travel!digital Thesaurus

Andalusierin
type: Label
hasTranslation: anadluza
in scheme: travel!digital Thesaurus

anadluza
type: Label
isTranslationOf: Andalusierin
in scheme: travel!digital Thesaurus

Pisaner
type: Concept
related match: Pisa
definition: Duden: Einwohnerbezeichnung | [Anm.: unvollständig: Einwohnerbezeichnung Pisa] | Duden: Pisa: Stadt in Italien | Meyers Großes Konversations-Lexikon 1908: Pisa, ital. Provinz mit gleichnamiger Hauptstadt in Toskana, grenzt an die Provinzen Lucca, Florenz, Siena, Grosseto, Livorno und das Ligurische Meer, umfaßt 3055 qkm (55,5 QM.) mit (1901) 320,829 Einw. (105 auf 1 qkm) und zerfällt in die Kreise P. und Volterra. | Quelle: Meyers Großes Konversations-Lexikon, Band 15. Leipzig 1908, S. 906. | Permalink: http://www.zeno.org/nid/20007257678
in scheme: travel!digital Thesaurus
pref label: Pisaner

Pisaner
type: Label
in scheme: travel!digital Thesaurus

erythräisch
type: Concept
related match: Eritrea
definition: bdk: Erythräa, die Einwohner von Erythräa betreffend; von den Einwohnern von Erythräa stammend, zu ihnen gehörend; in Erythräa gelegen | Meyers Großes Konversations-Lexikon 1906: Erythräa (ital. Eritrēa), ital. Kolonie am Roten (Erythräischen) Meer, im N. und O. von Abessinien, umfaßt den Küstenstrich von Ras Kasar (18°2' nördl. Br.) bis Kap Dumeirah (an der Grenze gegen das französische Obok) mit den vorgelagerten Inseln sowie das Hinterland bis zur abessinischen Grenze und einer durch Vertrag mit England 1891 bestimmten Demarkationslinie (s. Karte »Ägypten«). Sie läuft von der Mündung des Dschubbflusses an ihm aufwärts bis 6° nördl. Br., folgt dieser Gradlinie dann bis 35° östl. L., darauf diesem bis zum Rohatfluß und geht von dort zum Ras Kasar. In diese Grenzen sind inbegriffen die Somalküste am Indischen Ozean zwischen 8° nördl. Br. und der Dschubbmündung. E. umfaßt 247,300 qkm mit (1899) 329,516 Einw., davon 2014 Europäer. Hinter dem nur mit spärlicher Vegetation bedeckten schmalen Küstenstreifen erhebt sich eine niedrige Terrasse, der vereinzelte Vulkankegel aufgesetzt sind. Noch 1861 hat man bei Ed vulkanische Tätigkeit beobachtet. Das ganze Gebiet bis zum Steilabfall des abessinischen Hochlandes, die Samhara, ist heiß, wasser- und vegetationslos und nur schwach bevölkert; die Oberfläche besteht teils aus nacktem Fels, teils aus losen Sandablagerungen. Angebaut werden hier Bananen, Tabak, Baumwolle, Gemüse und Getreide. Auf dem 2000–2350 m hohen Hochland von Asmara, Godofelassi und Gura findet sich gutes Weideland, in den Tälern fruchtbarer Boden. Die kurzen Küstenflüsse führen nur periodisch Wasser; die vom abessinischen Hochland herabkommenden größern Flüsse verlieren sich in Salzseen, wie der Banert im Alalebaddsee, der Hawasch in Abhebaddsee, oder im Sande der Steppe, wie der Golima. Das Klima ist außerordentlich heiß; Massaua hat eine Jahrestemperatur von 30,3° (Juli 34,8°, Januar 25,6°), der Regenmangel ist groß, es fallen in Massaua 222, in Assab nur …
in scheme: travel!digital Thesaurus
pref label: erythräisch

erythräisch
type: Label
in scheme: travel!digital Thesaurus

kretisch
type: Concept
definition: Duden: zu Kreta | [Anm.: unvollständig: Kreta, die Kreter betreffend; von den Kretern stammend, zu ihnen gehörend; auf Kreta gelegen]
related: Kreter
in scheme: travel!digital Thesaurus
pref label: kretisch

Kreter
type: Concept
related match: Crete
related match: Ancient Crete
definition: Duden: Einwohnerbezeichnung zu Kreta | Duden: Kreta: griechische Insel | Meyers Großes Konversations-Lexikon 1907: Kreta (neugriech. Kriti, türk. Kirid, ital. Candia), Insel im Mittelmeer (s. Karte »Griechenland«), nach Größe, Lage, Hafenreichtum, Fruchtbarkeit und Bevölkerung die wichtigste Insel des Griechischen Archipels, zwischen 23°31'–26°20' östl. L. und 34°55' bis 35°41' nördl. Br., südlich dem Ägäischen Meer vorgelagert, hat eine von W. nach O. langgestreckte Gestalt; größte Länge 260, Breite 12–56 km, Flächeninhalt 8618 qkm (156,5 QM.). Die Küsten sind fast überall steil, doch enthält die nördliche einige Strandebenen und zahlreiche Buchten mit den meist versandeten Haupthäfen der Insel (Mirabella-, Armyro-, Suda-, Chania-, Kisamobai) und Vorgebirge, während der stellenweise ganz unzugänglichen Südküste solche mangeln. Diese Erscheinung erklärt sich daraus, daß die Gebirge nach S. steil und unvermittelt abstürzen, während sie sich nordwärts in längern Abhängen zu einem ausgedehnten, fruchtbaren Tertiär-Hügelland abdachen, an das sich eine leicht zugängliche Küste schließt, an der alle bedeutendern Siedelungen liegen. Von den Vorgebirgen sind die bekanntesten: Kap Buza und Kap Spatha (Psacum promontorium) im W., die Vorgebirge Sidero (Samonium promontorium) und Salmone im O., Kap Lithinos (Lissēs prom.) als südlichster Vorsprung. Das Innere Kretas wird von einer in vier Gruppen gesonderten Hochgebirgskette durchzogen, die nahe der Mitte der Insel in dem aus drei Spitzen bestehenden alten Götterberg Ida oder Psiloriti 2456 m Höhe erreicht und durch tiefere Einsenkungen in drei Abschnitte zerlegt wird. Der westliche Teil sind die Weißen Berge (Aspra Vuna) oder das Madaräsgebirge, die vielgenannte Landschaft Sphakia bildend, eine natürliche Festung, von der alle Erhebungen gegen die Türken ausgingen, im Theodoro 2469 m hoch, daher nur in den Sommermonaten frei von Schnee; den östlichen Teil bilden das Lasithigebirge (im Altertum Dicte, 2160 m) und weiterhin der…
in scheme: travel!digital Thesaurus
pref label: Kreter

Kreter
type: Label
in scheme: travel!digital Thesaurus

kretisch
type: Label
in scheme: travel!digital Thesaurus

thebanisch
type: Concept
related match: Boeotia
related match: Thebes, Greece
definition: Duden: Theben, die Thebaner betreffend | bdk: Theben, die Thebaner betreffend; von den Thebanern stammend, zu ihnen gehörend; in Theben gelegen | Meyers Großes Konversations-Lexikon 1909: Theben, 1) alte Stadt in Oberägypten, am Nil, die »hunderttorige Stadt«, seit der Mitte des 2. vorchristlichen Jahrtausends die Residenz des Pharaonenreiches, heute nur ein ausgedehntes Ruinenfeld zu beiden Seiten des Nils, das durch die Ortschaften Luksor und Karnak auf dem Ostufer, Kurna und Medinet Habu auf dem Westufer bezeichnet wird. Die Stadt ist allmählich durch die Vereinigung mehrerer Gemeinden zusammengewachsen, nach deren wichtigster Weset sie auch genannt wurde. Daneben wurde sie auch kurz als Nut, »die Stadt«, bezeichnet, woraus die biblischen Namen No und No-Amon, »Amonsstadt«, entstanden sind. Die Griechen nannten sie in ähnlicher Weise Diospolis, »Stadt des Zeus« (d. h. des mit Zeus identifizierten Amon). Was die Griechen zu der Übertragung des mehrfach bei ihnen vorkommenden Stadtnamens Thebai auf die ägyptische Stadt bestimmte, ist nicht bekannt. – Die Gründung Thebens ist in Dunkel gehüllt. In die Geschichte tritt die Stadt erst nach dem alten Reich ein, als thebanische Fürsten (die 11. Dynastie von T.) die Reorganisation des zerfallenen Staates unternahmen. Nach der Vertreibung der Hyksos und namentlich seit Amosis (ca. 1550) begannen die herrlichen Bauten zu entstehen, die, im Laufe der folgenden elf Jahrhunderte verschönert, vergrößert und vermehrt, die Stadt zum Wunder der Alten Welt erhoben haben. Die Verlegung der Residenz unter der 21. Dynastie nach dem Delta, später der Aufschwung Alexandrias unter den Ptolemäern entzogen ihr die Lebenskraft. Sie versuchte zwar wiederholt noch, politisch hervorzutreten und wurde sogar vorübergehend der Sitz einheimischer Könige, die sich gegen die Ptolemäer erhoben hatten. Indessen brachten ihr diese Empörungen auch den Untergang; sie wurde von Ptolemäus X. nach dreijähriger Belagerung erobert und[460] später nach einem …
in scheme: travel!digital Thesaurus
pref label: thebanisch

thebanisch
type: Label
in scheme: travel!digital Thesaurus

vormykenisch
type: Concept
definition: bdk: siehe mykenisch
related: mykenisch
in scheme: travel!digital Thesaurus
pref label: vormykenisch

vormykenisch
type: Label
in scheme: travel!digital Thesaurus

pergamenisch
type: Concept
definition: Duden: aus Pergamon | [Anm.: unvollständig: Pergamon, die Einwohner von Pergamon betreffend; von den Einwohnern von Pergamon stammend, zu ihnen gehörend; in Pergamon gelegen] | Duden: Pergamon: antike Stadt im Nordwesten Kleinasiens | Meyers Großes Konversations-Lexikon 1908: Pergamon, im Altertum berühmte Stadt in Mysien, in der Landschaft Teuthrania, war ursprünglich nur eine starke, auf der Höhe eines steil über der Kaikosebene sich erhebenden Berges angelegte Burg. Die Bewohner waren einheimischen Stammes, doch war schon in der Perserzeit auch das griechische Element stark vertreten. König Lysimachos von Thrakien bewahrte in der Burg seine Schätze auf (9000 Talente = ca. 32 Mill. Mk.) unter der Obhut des Kommandanten Philetairos. Dieser behielt nach dem Falle seines Herrn (282 v. Chr.) das Geld für sich und legte damit den Grund zur Macht seines Hauses. Aus der Burg entwickelte sich die Hauptstadt des von bescheidener lokaler Herrschaft allmählich zur Großmacht aufwachsenden Pergamenischen Reiches (s. d.). Am meisten vergrößert und verschönert wurde die Stadt durch König Eumenes II. (197–159). Er zog den ganzen Abhang des Berges bis zu seinem Fuß in den Mauerkreis hinein. Ob er oder schon sein Vater Attalos I. die berühmte Bibliothek gründete, die mit der alexandrinischen wetteiferte, ist nicht sicher. Beide Fürsten förderten auch die bildende Kunst durch großartige Aufgaben (s. Bildhauerkunst, S. 865). Erzeugnisse pergamenischen Gewerbfleißes waren Salben, irdene Becher und Pergament (charta pergamena). Auch nach der Einverleibung des pergamenischen Reiches in das römische (133 v. Chr.) blieb P. die blühende Hauptstadt der Provinz Asia. Sie dehnte sich sogar in dieser Zeit bedeutend in die Ebene aus. Die Reste sehr stattlicher Gebäude sind hier noch erhalten. [...] | Quelle: Meyers Großes Konversations-Lexikon, Band 15. Leipzig 1908, S. 583-584. | Permalink: http://www.zeno.org/nid/20007231652
related match: Pergamon
pref label: pergamenisch
in scheme: travel!digital Thesaurus

pergamenisch
type: Label
in scheme: travel!digital Thesaurus

katalonisch
type: Concept
preferred label: catalan @en
related match: Catalonia
definition: Duden: katalanisch | Duden: 1. autonome Region in Nordostspanien | 2. historische Provinz in Nordostspanien | Duden: Katalonien: Katalonien, die Katalanen betreffend; aus Katalonien stammend | [Anm.: unvollständig: Katalonien, die Katalanen betreffend; von den Katalanen stammend, zu ihnen gehörend; in Katalonien gelegen] | Meyers Großes Konversations-Lexikon 1907: Katalonĭen (span. Cataluña), span. Fürstentum, der nordöstlichste Teil der Pyrenäischen Halbinsel, grenzt nördlich an Frankreich, östlich und südöstlich an das Mittelmeer, südlich an Valencia, westlich an Aragonien, hat einen Flächeninhalt von 32,197 qkm (585 QM.) mit einer Bevölkerung von (1900) 1,966,382 Seelen und zerfällt in vier Provinzen: Lerida, Gerona, Barcelona und Tarragona. Die jetzigen Katalonier (Catalanes) sind nüchterne, mit Scharfsinn, Gelehrigkeit und körperlicher wie geistiger Gewandtheit begabte Menschen, dazu von rastloser Tätigkeit, hohem Unternehmungsgeist und unermüdlicher Ausdauer. Sie sind von mittlerer Größe, aber kräftig (s. Tafel »Volkstrachten II«, Fig. 16). Selbst die gebildeten Stände sprechen unter sich meist den rauhen, dem Provenzalischen verwandten katalanischen Dialekt (s. Katalanische Sprache und Literatur). – K. war schon zur Römerzeit eine blühende Provinz und führte den Namen Hispania Tarraconensis. Später wurde es von den Alanen, um 415 von den Westgoten, 711 von den Arabern erobert. Völlig vertrieben wurden letztere erst zu Anfang des 9. Jahrh. durch die kriegerischen Eingebornen mit Hilfe Ludwigs des Frommen von Aquitanien. Von dieser Zeit an bildete das von Ludwig in 15 Grafschaften eingeteilte Land die sogen. spanische Mark des fränkischen Kaiserreichs. Nach Karls des Dicken Tod (888) wußten die inzwischen mächtig gewordenen Grafen von Barcelona sich unabhängig zu machen, und es entstand die Markgrafschaft Barcelona oder das »Fürstentum K.«, das als selbständiger Staat bis zur Vereinigung mit Aragonien durch die Vermählung der Erbin dieses Landes mit Raimund Ber…
pref label: catalan
pref label: katalonisch
in scheme: travel!digital Thesaurus

catalan
type: Label
isTranslationOf: katalonisch
in scheme: travel!digital Thesaurus

katalonisch
type: Label
hasTranslation: catalan
in scheme: travel!digital Thesaurus

bremer
type: Concept
related match: Bremen
pref label: bremer
in scheme: travel!digital Thesaurus
definition: bdk: Bremen, die Bremer betreffend; von den Bremern stammend, zu ihnen gehörend; in Bremen gelegen] | Duden: Bremen: Stadt und deutsches Bundesland | Meyers Großes Konversations-Lexikon 1905: Bremen, seit 1815 deutscher Freistaat mit dem amtlichen Titel »Freie Hansestadt B.«, ein Glied des Deutschen Reiches, dessen Gebiet (256,69 qkm) aus drei getrennt liegenden, an Größe sehr ungleichen Teilen besteht (s. die Karte bei S. 378). Der Hauptbestandteil mit der Stadt B. liegt zwischen 53°1'–53°10' nördl. Br. und 8°38'–8°59' östl. L. v. Gr. und zu beiden Seiten der untern Weser, 74 km vom Meer entfernt, und wird von der preußischen Provinz Hannover und von dem Herzogtum Oldenburg begrenzt. Dicht an der Nordgrenze des Gebietes, aber getrennt davon, liegt am rechten Ufer des Stromes die Stadt Vegesack (s.d.) und weiter nördlich, 55 km von der Stadt B., der dritte Landesteil von 292 Hektar Größe mit der Hafenstadt Bremerhaven (s.d.), am Einfluß der Geeste in die Weser. – Das Bremer Gebiet besteht auf beiden Seiten des Weserstromes aus Flachland, in das nur der Ausläufer einer Dünenkette (bis zu 10 m Höhe) am rechten Ufer eine geringe Abwechselung bringt. Die Weser durchzieht dasselbe bis an den Vegesacker Hafen etwa 25 km weit in vorwiegend nordwestlicher Richtung. Da fast die Hälfte des Gebietes noch unter den Nullpunkt des Bremer Pegels hinabsinkt, so sind die Weser und deren Nebenflüsse, Wümme und Ochtum, mit Deichen in einer Länge von etwa 100 km eingefaßt. Zur Entwässerung dient ein künstliches System von Gräben und Sielen und eine Dampfentwässerungsanlage. Der Boden ist teils sandige, arme Vorgeeft, teils fruchtbare lehmige Flußmarsch. Vom Gesamtflächenraum des Staatsgebiets (25,669 Hektar) kamen 1900: 6750 Hektar auf Acker- und Gartenland, 8303 Hektar auf Wiesen, 5979 Hektar auf Weiden, 48 Hektar auf Holzungen. Von dem ertragsfähigen Lande waren also 32,2 Proz. Fruchtland und 67,8 Proz. Grasland. Daher nimmt die Viehzucht, namentlich die Rindviehzucht, eine hervorrag…

bremer
type: Label
in scheme: travel!digital Thesaurus

rheinisch-westfälisch
type: Concept
definition: Duden: Westfalen, die Westfalen betreffend; aus Westfalen stammend | [Anm.: unvollständig: Westfalen, die Westfalen betreffend; von den Westfalen stammend, zu ihnen gehörend; in Westfahlen gelegen] | Duden: Westfalen: nordöstlicher Teil von Nordrhein-Westfalen | Meyers Großes Konversations-Lexikon 1909: Westfalen (hierzu Karte »Westfalen«), Provinz des preuß. Staates, wurde 1815 gebildet aus dem Herzogtum W. und Engern (s. oben, S. 558), dem Fürstentum Minden, der Grafschaft Tecklenburg Solmsschen Anteils, den Grafschaften Lingen und Ravensberg, dem größten Teil des Hochstifts Münster, den Fürstentümern Paderborn und Korvei und der Stadt Dortmund, der Grafschaft Mark, dem Fürstentum Siegen, dem Amt Reckenberg, den mediatisierten Fürstentümern, Graf- und Herrschaften Salm-Ahaus, Salm-Bocholt, Rheina-Wolbeck, Salm-Horstmar, Rietberg, Rheda, Anholt, Dülmen, Gehmen, Bentheim, Steinfurt, Wittgenstein-Wittgenstein, Wittgenstein-Berleburg, dem Solmsschen Amt Neukirchen, wozu 1851 noch die Stadt Lippstadt kam, die Lippe-Detmold gemeinschaftlich mit Preußen besaß. Die Provinz grenzt gegen N. an Hannover, gegen O. an Hannover, Schaumburg-Lippe, den hessen-nassauischen Kreis Rinteln, Lippe. Braunschweig, Hessen-Nassau und Waldeck, gegen SW. an die Rheinprovinz, gegen NW. an die Niederlande und umfaßt einen Flächenraum von 20,214 qkm (367,13 QM.). [...] | Quelle: Meyers Großes Konversations-Lexikon, Band 20. Leipzig 1909, S. 559-561. | Permalink: http://www.zeno.org/nid/20007689942 | Duden: rheinisch: den Rhein, das Rheinland, dessen Bewohner und ihre Sprache betreffend | Duden: Rhein: Fluss in Westeuropa | Duden: Rheinland: Gebiet zu beiden Seiten des Mittel- und Niederrheins; Abkürzung: Rhld. | Meyers Großes Konversations-Lexikon 1908: Rheinland, soviel wie Rheinprovinz (s. d.); auch der vom Alten Rhein durchflossene Landstrich in der niederländischen Provinz Südholland. | Quelle: Meyers Großes Konversations-Lexikon, Band 16. Leipzig 1908, S. 867. | Permalink: http://www.zeno…
related match: Westphalia
in scheme: travel!digital Thesaurus
pref label: rheinisch-westfälisch

rheinisch-westfälisch
type: Label
in scheme: travel!digital Thesaurus

peträisch
type: Concept
definition: bdk: Petra, die Peträer betreffend; von den Peträern stammend, zu ihnen gehörend; in Petra gelegen
in scheme: travel!digital Thesaurus
pref label: peträisch
related: Peträer

peträisch
type: Label
in scheme: travel!digital Thesaurus

Peträer
type: Concept
definition: bdk: Einwohnerbezeichnung zu Petra | Meyers Großes Konversations-Lexikon 1908: Petra (griech., »Fels«), Stadt im Edomiterland, ca. 100 km vom Golfe von Akaba des Arabischen Meerbusens (s. Rotes Meer), in einem Felsental am Ostfuß des Berges Hor (Ruinen 100 km nördlich vom Golf von Akaba, unweit des Wadi el Arab), hieß eigentlich Sela (»Felsenstadt«) und wurde im 9. Jahrh. v. Chr. vom König Amazia, der sie eroberte, Jokteel und erst in der griechischen Zeit P. genannt. P. war durch die große bei ihr vorüberziehende Straße vom Roten Meer nach N. ein wichtiger Handelsplatz. Nach ihr hieß das Peträische Arabien. Seit etwa 300 v. Chr. war es die Hauptstadt der Nabatäer. Des Antigonos General Athenäos überfiel 310 P. und plünderte es, ward aber wieder vertrieben und sein Heer aufgerieben; Demetrios belagerte darauf die unzugängliche Felsenstadt vergeblich. Seit Pompejus dem Römerreiche tributär, wurde sie 105 n. Chr. durch Trajan demselben einverleibt. Mit der mohammedanischen Eroberung verlor es seine Bedeutung und hieß seitdem Wadi Musa (»Tal des Moses«). Die großartigen Ruinen aus spätrömischer Zeit (Felsengräber, ein ganz aus dem Felsen gehauenes Theater, mehrere Tempel, ein Triumphbogen etc.) wurden 1812 von Seetzen und Burckhardt wieder aufgefunden, dann von den Engländern Irby und Mangles, den Franzosen de Laborde und Linant (»Voyage dans l'Arabie Pétrée«, Par. 1830), dem Herzog von Luynes (»Voyage d'exploration à la Mer Morte, Petra etc.«, das. 1871 ff.) u.a. besucht. Vgl. Brünnow und v. Domaszewski, Provincia Arabia, Bd. 1 (Straßb. 1904); Libbey, Jordan valley and P. (Lond. 1905, 2 Bde.). | Quelle: Meyers Großes Konversations-Lexikon, Band 15. Leipzig 1908, S. 661. | Permalink: http://www.zeno.org/nid/20007238339
in scheme: travel!digital Thesaurus
pref label: Peträer

Peträer
type: Label
in scheme: travel!digital Thesaurus

Phokäer
type: Concept
related match: Foça
definition: bdk: Einwohnerbezeichnung zu Phokäa | bdk: Phokäa: antike griechische Stadt in Kleinasien | Meyers Großes Konversations-Lexikon 1908: Phokäa, phokische Kolonie in Ionien (Kleinasien), auf der Halbinsel zwischen dem Elaitischen und Smyrnaïschen Meerbusen, hatte zwei vortreffliche Häfen, vor denen eine kleine, mit Tempeln besetzte Insel (Bakchion) lag. Ihre Einwohner unternahmen zuerst unter den Griechen weite Seereisen (bis nach Spanien). Als die Stadt von den Persern unter Harpagos belagert wurde, wanderten viele Phokäer nach Korsika aus, wo sie Alalia (Aleria) gründeten. Später ergriff P. für Antiochos III. von Syrien Partei und ward deshalb von den Römern erobert; doch existierte die Stadt bis in die späte Kaiserzeit. Unter Phokäas Pflanzstädten sind Massilia (Marseille) und Elea in Lukanien zu nennen. Jetzt liegt an der alten Stelle ein griechischer Ort Phokia (türk. Eskidsche Fotscha, d.h. Alt-Phokäa). | Quelle: Meyers Großes Konversations-Lexikon, Band 15. Leipzig 1908, S. 804. | Permalink: http://www.zeno.org/nid/20007247923
in scheme: travel!digital Thesaurus
pref label: Phokäer

Phokäer
type: Label
in scheme: travel!digital Thesaurus

Acadier
type: Concept
related match: Acadia
definition: bdk: Einwohnerbezeichnung zu Akadien | Meyers Großes Konversations-Lexikon 1905: Akadien (engl. Acadia, franz. l'Acadie. von indian. cadie, d.h. Fundstätte), der alte Name für die atlantischen Küstenprovinzen Kanadas und insbes. für Neuschottland. Seit 1604 von Franzosen besiedelt, wuchs die Kolonie langsam und zählte 1687 erst 900 Köpfe. Nach den Kriegen zwischen England und Frankreich wurde A., dessen Bewohner mit den ihnen verbündeten Indianern hartnäckig gegen die Engländer kämpften, im Frieden von Utrecht 1713 an letztere abgetreten, doch kämpften die Akadier noch lange gegen die neuen Besitzer, und später wanderten 5000 nach Louisiana, Georgia etc. aus, während 2000 zwangsweise entfernt und in Neuengland angesiedelt wurden. Man schätzte 1858 die Zahl aller Akadier auf 95,000, davon 30,000 in Neubraunschweig, 20,000 in Neuschottland, je 15,000 auf den Inseln Cape Breton und Prinz Edward, 8000 an der Nordküste der Baie des Chaleurs, der Rest auf den Magdaleneninseln, in Labrador, auf St.-Pierre und Miquelon. Vgl. Moreau, Histoire de l'Acadie française (Par. 1873); Rameau de Saint-Père, L'Acadie (das. 1889). – Acadian Highlands heißen die beiden Höhenzüge, die Neuschottland durchziehen, ein südlicher granitischer und ein nördlicher kristallinischer (Cobequid Mountains). S. Appalachen und Neuschottland. | Quelle: Meyers Großes Konversations-Lexikon, Band 1. Leipzig 1905, S. 221. | Permalink: http://www.zeno.org/nid/20006203442
pref label: Acadier
in scheme: travel!digital Thesaurus

Acadier
type: Label
in scheme: travel!digital Thesaurus

chercheller
type: Concept
related match: Cherchell
pref label: chercheller
in scheme: travel!digital Thesaurus
definition: bdk: Cherchell, die die Einwohner von Cherchell betreffend; von den Einwohnern von Cherchell stammend, zu ihnen gehörend; in Cherchell gelegen | Meyers Großes Konversations-Lexikon 1905: Scherschel (Cherchell), befestigte Hafenstadt im franz. Depart. Algier, mit Eisengruben, Baumwollbau und Kochenillekultur und (1901) 4235 (als Gemeinde 9088) Einw. Dabei die Trümmer und Zisternen des alten Caesarea Mauretaniae, s. Cäsarea 4). Der alte römische Binnenhafen wurde 1843 wieder benutzbar gemacht. | Quelle: Meyers Großes Konversations-Lexikon, Band 17. Leipzig 1909, S. 744. | Permalink: http://www.zeno.org/nid/20007417802

chercheller
type: Label
in scheme: travel!digital Thesaurus

westindisch
type: Concept
in scheme: travel!digital Thesaurus
pref label: westindisch
narrower: holländisch-westindisch
definition: Duden: Westindien betreffend | [Anm.: unvollständig: Westindien, die Einwohner von Westindien betreffend; von den Einwohnern von Westindien stammend, zu ihnen gehörend; in Westindien gelegen] | Duden: Westindien: Gebiet der Westindischen Inseln | Meyers Großes Konversations-Lexikon 1909: Westindien (Westindische Inseln; hierzu Karte »Westindien und Mittelamerika«; Rückseite: Karte der Kleinen Antillen, Haupthäfen etc.), der aus mehreren Tausend größern und kleinern Inseln bestehende Archipel, der in nach NW. gerichtetem Bogen das Amerikanische Mittelmeer umgürtet und gliedert und sich von der Mündung des Orinoko bis zu den Halbinseln Florida und Yukatan erstreckt. Er erhielt diesen Namen, weil man ihn anfangs für einen Teil von Indien hielt. W. umfaßt die Großen Antillen, Bahamainseln, Jungferninseln, Inseln über dem Wind, Inseln unter dem Wind (s. die Einzelartikel) sowie einige kleinere Nebengruppen (Cayman-Inseln, Schwaneninseln, Pedro-Keys). Das Areal beträgt 235,580 qkm mit 6,300,000 Einw., wovon bei weitem der größte Teil, nämlich 216,843 qkm und 4,447,400 Einw., auf die Großen Antillen entfallen. Die Verteilung dieses Gebietes auf die einzelnen Hauptinseln zeigt die Tabelle bei »Nordamerika«, S. 745. Die Inseln sind teils niedrig und flach, wie die Bahamainseln, die meisten Nebeninseln Cubas u. a., teils sehr gebirgig und von tiefen Tälern und Schluchten vielfach durchzogen. Die höchsten Berge findet man auf Cuba (2560 m), Jamaika (2488 m) und Haïti (2955 m), während die höchste der Kleinen Antillen, Dominica, nur bis 1900 m ansteigt. Die Küsten sind teilweise zerklüftet und vielfach von Korallenbänken umsäumt; doch ist an vorzüglichen Häfen kein Mangel. Viele der Bäche trocknen während der heißen Jahreszeit aus, überschwemmen aber nach heftigem Regen ihre Ufer. Die Großen Antillen erscheinen als Teile eines großen, durch mehrere Längs- und Querbrüche zerstückelten Kettengebirges, das eine auffallende Ähnlichkeit in seiner Zusammensetzung mit der im Golf von …
related match: West Indies

westindisch
type: Label
in scheme: travel!digital Thesaurus

florentinisch
type: Concept
alternative label: florentiner
definition: Duden: Florenz, die Florentiner (1) betreffend | [Anm.: unvollständig: Florenz, die Florentiner betreffend; von den Florentinern stammend, zu ihnen gehörend; in Florenz gelegen]
pref label: florentinisch
in scheme: travel!digital Thesaurus
related: Florentiner
alt label: florentiner

florentinisch
type: Label
hasVariant: florentiner
in scheme: travel!digital Thesaurus

florentiner
type: Label
isVariantOf: florentinisch
in scheme: travel!digital Thesaurus

Florentiner
type: Concept
related match: Florence
definition: Duden: zu Florenz | [Anm.: unvollständig: Einwohnerbezeichnung zu Florenz] | Duden: Florenz: italienische Stadt | Meyers Großes Konversations-Lexikon 1906: Florenz (ital. Firenze, hierzu der Stadtplan), Hauptstadt der gleichnamigen ital. Provinz (s. oben), bis 1859 Hauptstadt des Großherzogtums Toskana und 1865–71 die des Königreichs Italien, 55 m ü. M., ist reizend im weiten, von Berghöhen umkränzten Tal des 120–160m breiten, von Kais eingefaßten Arno gelegen, eine der interessantesten Städte Italiens, die den Beinamen la bella (»die Schöne«) führt und wegen ihrer hohen geistigen Bedeutung, namentlich für die Kunst, auch das »italienische Athen« genannt wird. | Das Klima ist großen Temperatursprüngen ausgesetzt; die mittlere Temperatur beträgt im Jahr 14,3°, im Januar 4,8, im Juli 24,6°. Gleichwohl bringen viele Fremde einen Teil des Jahres hier zu. Spätfrühling und Herbst sind die schönste Zeit für F. Die Stadt ist durch Niederreißung der alten Mauer und Errichtung neuer Stadtviertel bedeutend vergrößert und zugleich verschönert, aber auch durch Niederlegung alter Quartiere mancher geschichtlicher Baudenkmäler und malerischer Örtlichkeiten beraubt worden. Sie hat mehrere wohlerhaltene Stadttore aus dem 13. und 14. Jahrh. und zwei Zitadellen, die kleinere (Belvedere) südlich am höchsten Punkte, die größere (Forte da Basso oder San Giovanni Battista) am Nordende. Die schönsten Straßen sind heute die längs den Ufern des Arno führenden Kais, Lungarno[701] genannt, die Via Calzajoli, die belebteste Straße, die den Domplatz mit der Piazza della Signoria verbindet, die Via Porta Rossa, Via Tornabuoni, Via de' Cerretani, Via Martelli und Via Cavour auf dem rechten, die Via Maggio auf dem linken Arno-Ufer. An Stelle der frühern Befestigungsmauer umzieht die Stadt gegenwärtig eine breite Ringstraße (Viale). Unter den zahlreichen Plätzen bildet die Piazza della Signoria seit dem Mittelalter den Mittelpunkt des städtischen Lebens. Hier fanden alle Volksversammlungen, Feste un…
pref label: Florentiner
in scheme: travel!digital Thesaurus

Florentiner
type: Label
in scheme: travel!digital Thesaurus

funchaler
type: Concept
related match: Funchal
in scheme: travel!digital Thesaurus
pref label: funchaler
definition: bdk: Funchal, die Einwohner von Funchal betreffend; von den Einwohnern von Funchal stammend, zu ihnen gehörend; in Funchal gelegen] | Meyers Großes Konversations-Lexikon 1907: Funchal (spr. fungschāl), Hauptstadt des gleichnamigen portug. Distrikts (die Inseln Madeira und Porto Santo), an der Südküste von Madeira, an einer den Südwinden völlig preisgegebenen Bai mit schlechtem Ankergrund und starker Brandung, hübsch gelegen, aber schmutzig und winklig, ist Sitz des Gouverneurs und eines Bischofs sowie eines deutschen Konsuls, hat eine Kathedrale, mehrere Klöster, eine englische prot. Kirche und (1890) 18,778 Einw. Merkwürdig ist die Schädelkapelle in der Kirche des ehemaligen Franziskanerklosters. F. ist Haupthandelsplatz von Madeira (s.d.); 1892 betrug die Einfuhr 713,216, die Ausfuhr 733,533 Milreis, es liefen 606 Dampfer von 1,060,517 Ton. und 96 Segelschiffe von 23,972 T. ein. Wegen seines milden Klimas (20–24°) wird F. von vielen Brustkranken aufgesucht. Vgl. Christmann, F. auf Madeira und sein Klima (Zabern 1889), und Literatur bei Art. »Madeira«. | Quelle: Meyers Großes Konversations-Lexikon, Band 7. Leipzig 1907, S. 206. | Permalink: http://www.zeno.org/nid/20006642284

funchaler
type: Label
in scheme: travel!digital Thesaurus